sling-commits mailing list archives

Site index · List index
Message view « Date » · « Thread »
Top « Date » · « Thread »
From Apache Jenkins Server <jenk...@builds.apache.org>
Subject Build failed in Jenkins: sling-trunk-1.8 #1537
Date Mon, 14 Sep 2015 15:15:18 GMT
See <https://builds.apache.org/job/sling-trunk-1.8/1537/changes>

Changes:

[cziegeler] SLING-5019 : ServiceUserMappedBundleFilter should be immediate

------------------------------------------
[...truncated 33998 lines...]
[INFO] Apache Sling Discovery Support Bundle ............. SKIPPED
[INFO] Apache Sling Discovery Standalone Implementation .. SKIPPED
[INFO] Apache Sling Event Support ........................ SKIPPED
[INFO] Apache Sling Feature Flags ........................ SKIPPED
[INFO] Apache Sling Filesystem Resource Provider ......... SKIPPED
[INFO] Apache Sling javax.activation bundle .............. SKIPPED
[INFO] Apache Sling Service User Mapper .................. SKIPPED
[INFO] Apache Sling Settings ............................. SKIPPED
[INFO] Apache Sling Web Console Branding ................. SKIPPED
[INFO] Apache Sling Web Console Security Provider ........ SKIPPED
[INFO] Apache Sling Explorer ............................. SKIPPED
[INFO] Apache Sling Health Check Core .................... SKIPPED
[INFO] Apache Sling Health Check Annotations ............. SKIPPED
[INFO] Apache Sling Health Check Samples ................. SKIPPED
[INFO] Apache Sling Health Check Support Components ...... SKIPPED
[INFO] Apache Sling Health Check Webconsole Plugin ....... SKIPPED
[INFO] Apache Sling Health Check JUnit Bridge ............ SKIPPED
[INFO] Apache Sling Health Check Integration Tests ....... SKIPPED
[INFO] Apache Sling Health Check Reactor POM ............. SKIPPED
[INFO] Apache Sling Resource Access Security ............. SKIPPED
[INFO] Apache Sling Test Tools ........................... SKIPPED
[INFO] Apache Sling Resource Access Security Integration Tests  SKIPPED
[INFO] Apache Sling Validation Framework API ............. SKIPPED
[INFO] Apache Sling Validation Framework Core Implementation  SKIPPED
[INFO] Apache Sling Validation Framework Testing Services  SKIPPED
[INFO] Apache Sling Validation Framework Integration Tests  SKIPPED
[INFO] Apache Sling Validation Framework Examples ........ SKIPPED
[INFO] Apache Sling Validation Framework Builder ......... SKIPPED
[INFO] Apache Sling Models API ........................... SKIPPED
[INFO] Apache Sling Models Implementation ................ SKIPPED
[INFO] Apache Sling Models Validation Implementation ..... SKIPPED
[INFO] Apache Sling Models Integration Tests ............. SKIPPED
[INFO] Apache Sling Internationalization Support ......... SKIPPED
[INFO] Apache Sling XSS Protection Bundle ................ SKIPPED
[INFO] Apache Sling JUnit Core ........................... SKIPPED
[INFO] Apache Sling JUnit Scriptable Tests Provider ...... SKIPPED
[INFO] Apache Sling JUnit Health Checks .................. SKIPPED
[INFO] Apache Sling JUnit Remote Tests Runners ........... SKIPPED
[INFO] Apache Sling JUnit Performance .................... SKIPPED
[INFO] Apache Sling Testing Mock Log Configuration ....... SKIPPED
[INFO] Apache Sling Testing JCR Mock ..................... SKIPPED
[INFO] Apache Sling Testing OSGi Mock .................... SKIPPED
[INFO] Apache Sling Testing Sling Mock Jackrabbit-based Resource Resolver  SKIPPED
[INFO] Apache Sling Sample Server-Side Tests ............. SKIPPED
[INFO] Apache Sling Failing Server-Side Tests ............ SKIPPED
[INFO] Apache Sling Sample Integration Tests ............. SKIPPED
[INFO] Apache Sling Testing Modules Reactor .............. SKIPPED
[INFO] Apache Sling Installer ............................ SKIPPED
[INFO] Apache Sling Installer WebConsole Plugin .......... SKIPPED
[INFO] Apache Sling File Installer ....................... SKIPPED
[INFO] Apache Sling JCR Installer ........................ SKIPPED
[INFO] Apache Sling Installer Configuration Admin Support  SKIPPED
[INFO] Apache Sling Deployment Package Installer ......... SKIPPED
[INFO] Apache Sling Subsystems Installer ................. SKIPPED
[INFO] Apache Sling Installer Integration Tests .......... SKIPPED
[INFO] Apache Sling Launchpad API ........................ SKIPPED
[INFO] Apache Sling Launchpad Base ....................... SKIPPED
[INFO] Apache Sling Launchpad Installer .................. SKIPPED
[INFO] Apache Sling Launchpad Content .................... SKIPPED
[INFO] Apache Sling Launchpad Testing Services ........... SKIPPED
[INFO] Apache Sling Launchpad Testing Services WAR ....... SKIPPED
[INFO] Apache Sling Launchpad Testing Fragment Bundle .... SKIPPED
[INFO] Apache Sling Launchpad Test Bundles ............... SKIPPED
[INFO] Apache Sling Integration Tests .................... SKIPPED
[INFO] Apache Sling Launchpad Testing .................... SKIPPED
[INFO] Apache Sling (Builder) ............................ SKIPPED
[INFO] ------------------------------------------------------------------------
[INFO] BUILD FAILURE
[INFO] ------------------------------------------------------------------------
[INFO] Total time: 1:04:09.403s
[INFO] Finished at: Mon Sep 14 13:30:34 UTC 2015
[INFO] Final Memory: 136M/474M
[INFO] ------------------------------------------------------------------------
[ERROR] Internal error: java.lang.IllegalStateException: Invalid object ID 108 iota=157: Object
was recently deallocated
[ERROR] #108 (ref.0) : [hudson.maven.MavenBuildProxy2]
[ERROR] Created at Mon Sep 14 12:29:17 UTC 2015
[ERROR] at hudson.remoting.ExportTable$Entry.<init>(ExportTable.java:93)
[ERROR] at hudson.remoting.ExportTable.export(ExportTable.java:297)
[ERROR] at hudson.remoting.Channel.internalExport(Channel.java:591)
[ERROR] at hudson.remoting.Channel.export(Channel.java:582)
[ERROR] at hudson.remoting.Channel.export(Channel.java:552)
[ERROR] at hudson.maven.MavenBuild$ProxyImpl2.writeReplace(MavenBuild.java:743)
[ERROR] at sun.reflect.GeneratedMethodAccessor6814.invoke(Unknown Source)
[ERROR] at sun.reflect.DelegatingMethodAccessorImpl.invoke(DelegatingMethodAccessorImpl.java:43)
[ERROR] at java.lang.reflect.Method.invoke(Method.java:606)
[ERROR] at java.io.ObjectStreamClass.invokeWriteReplace(ObjectStreamClass.java:1075)
[ERROR] at java.io.ObjectOutputStream.writeObject0(ObjectOutputStream.java:1134)
[ERROR] at java.io.ObjectOutputStream.defaultWriteFields(ObjectOutputStream.java:1547)
[ERROR] at java.io.ObjectOutputStream.writeSerialData(ObjectOutputStream.java:1508)
[ERROR] at java.io.ObjectOutputStream.writeOrdinaryObject(ObjectOutputStream.java:1431)
[ERROR] at java.io.ObjectOutputStream.writeObject0(ObjectOutputStream.java:1177)
[ERROR] at java.io.ObjectOutputStream.writeObject(ObjectOutputStream.java:347)
[ERROR] at java.util.HashMap.writeObject(HashMap.java:1133)
[ERROR] at sun.reflect.GeneratedMethodAccessor426.invoke(Unknown Source)
[ERROR] at sun.reflect.DelegatingMethodAccessorImpl.invoke(DelegatingMethodAccessorImpl.java:43)
[ERROR] at java.lang.reflect.Method.invoke(Method.java:606)
[ERROR] at java.io.ObjectStreamClass.invokeWriteObject(ObjectStreamClass.java:988)
[ERROR] at java.io.ObjectOutputStream.writeSerialData(ObjectOutputStream.java:1495)
[ERROR] at java.io.ObjectOutputStream.writeOrdinaryObject(ObjectOutputStream.java:1431)
[ERROR] at java.io.ObjectOutputStream.writeObject0(ObjectOutputStream.java:1177)
[ERROR] at java.io.ObjectOutputStream.defaultWriteFields(ObjectOutputStream.java:1547)
[ERROR] at java.io.ObjectOutputStream.writeSerialData(ObjectOutputStream.java:1508)
[ERROR] at java.io.ObjectOutputStream.writeOrdinaryObject(ObjectOutputStream.java:1431)
[ERROR] at java.io.ObjectOutputStream.writeObject0(ObjectOutputStream.java:1177)
[ERROR] at java.io.ObjectOutputStream.writeObject(ObjectOutputStream.java:347)
[ERROR] at hudson.remoting.UserRequest._serialize(UserRequest.java:155)
[ERROR] at hudson.remoting.UserRequest.serialize(UserRequest.java:164)
[ERROR] at hudson.remoting.UserRequest.<init>(UserRequest.java:62)
[ERROR] at hudson.remoting.Channel.call(Channel.java:741)
[ERROR] at hudson.maven.ProcessCache$MavenProcess.call(ProcessCache.java:161)
[ERROR] at hudson.maven.MavenModuleSetBuild$MavenModuleSetBuildExecution.doRun(MavenModuleSetBuild.java:840)
[ERROR] at hudson.model.AbstractBuild$AbstractBuildExecution.run(AbstractBuild.java:529)
[ERROR] at hudson.model.Run.execute(Run.java:1706)
[ERROR] at hudson.maven.MavenModuleSetBuild.run(MavenModuleSetBuild.java:529)
[ERROR] at hudson.model.ResourceController.execute(ResourceController.java:88)
[ERROR] at hudson.model.Executor.run(Executor.java:232)
[ERROR] Released at Mon Sep 14 13:33:31 UTC 2015
[ERROR] at hudson.remoting.ExportTable$Entry.release(ExportTable.java:125)
[ERROR] at hudson.remoting.ExportTable$ExportList.release(ExportTable.java:241)
[ERROR] at hudson.remoting.UserRequest.releaseExports(UserRequest.java:190)
[ERROR] at hudson.remoting.UserRequest.releaseExports(UserRequest.java:186)
[ERROR] at hudson.remoting.Channel.call(Channel.java:760)
[ERROR] at hudson.maven.ProcessCache$MavenProcess.call(ProcessCache.java:161)
[ERROR] at hudson.maven.MavenModuleSetBuild$MavenModuleSetBuildExecution.doRun(MavenModuleSetBuild.java:840)
[ERROR] at hudson.model.AbstractBuild$AbstractBuildExecution.run(AbstractBuild.java:529)
[ERROR] at hudson.model.Run.execute(Run.java:1706)
[ERROR] at hudson.maven.MavenModuleSetBuild.run(MavenModuleSetBuild.java:529)
[ERROR] at hudson.model.ResourceController.execute(ResourceController.java:88)
[ERROR] at hudson.model.Executor.run(Executor.java:232): ReleasedAt
[ERROR] -> [Help 1]
org.apache.maven.InternalErrorException: Internal error: java.lang.IllegalStateException:
Invalid object ID 108 iota=157
	at org.apache.maven.DefaultMaven.execute(DefaultMaven.java:168)
	at org.jvnet.hudson.maven3.launcher.Maven3Launcher.main(Maven3Launcher.java:117)
	at sun.reflect.NativeMethodAccessorImpl.invoke0(Native Method)
	at sun.reflect.NativeMethodAccessorImpl.invoke(NativeMethodAccessorImpl.java:62)
	at sun.reflect.DelegatingMethodAccessorImpl.invoke(DelegatingMethodAccessorImpl.java:43)
	at java.lang.reflect.Method.invoke(Method.java:483)
	at org.codehaus.plexus.classworlds.launcher.Launcher.launchStandard(Launcher.java:329)
	at org.codehaus.plexus.classworlds.launcher.Launcher.launch(Launcher.java:239)
	at org.jvnet.hudson.maven3.agent.Maven3Main.launch(Maven3Main.java:178)
	at sun.reflect.NativeMethodAccessorImpl.invoke0(Native Method)
	at sun.reflect.NativeMethodAccessorImpl.invoke(NativeMethodAccessorImpl.java:62)
	at sun.reflect.DelegatingMethodAccessorImpl.invoke(DelegatingMethodAccessorImpl.java:43)
	at java.lang.reflect.Method.invoke(Method.java:483)
	at hudson.maven.Maven3Builder.call(Maven3Builder.java:136)
	at hudson.maven.Maven3Builder.call(Maven3Builder.java:71)
	at hudson.remoting.UserRequest.perform(UserRequest.java:118)
	at hudson.remoting.UserRequest.perform(UserRequest.java:48)
	at hudson.remoting.Request$2.run(Request.java:328)
	at hudson.remoting.InterceptingExecutorService$1.call(InterceptingExecutorService.java:72)
	at java.util.concurrent.FutureTask.run(FutureTask.java:266)
	at java.util.concurrent.ThreadPoolExecutor.runWorker(ThreadPoolExecutor.java:1142)
	at java.util.concurrent.ThreadPoolExecutor$Worker.run(ThreadPoolExecutor.java:617)
	at java.lang.Thread.run(Thread.java:745)
Caused by: java.lang.IllegalStateException: Invalid object ID 108 iota=157
	at hudson.remoting.ExportTable.diagnoseInvalidId(ExportTable.java:346)
	at hudson.remoting.ExportTable.get(ExportTable.java:322)
	at hudson.remoting.Channel.getExportedObject(Channel.java:595)
	at hudson.remoting.RemoteInvocationHandler$RPCRequest.perform(RemoteInvocationHandler.java:301)
	at hudson.remoting.RemoteInvocationHandler$RPCRequest.call(RemoteInvocationHandler.java:290)
	at hudson.remoting.RemoteInvocationHandler$RPCRequest.call(RemoteInvocationHandler.java:249)
	at hudson.remoting.UserRequest.perform(UserRequest.java:118)
	at hudson.remoting.UserRequest.perform(UserRequest.java:48)
	at hudson.remoting.Request$2.run(Request.java:328)
	at hudson.remoting.InterceptingExecutorService$1.call(InterceptingExecutorService.java:72)
	at jenkins.util.ContextResettingExecutorService$2.call(ContextResettingExecutorService.java:46)
	at java.util.concurrent.FutureTask.run(FutureTask.java:262)
	at java.util.concurrent.ThreadPoolExecutor.runWorker(ThreadPoolExecutor.java:1145)
	at java.util.concurrent.ThreadPoolExecutor$Worker.run(ThreadPoolExecutor.java:615)
	... 1 more
Caused by: java.lang.Exception: Object was recently deallocated
    #108 (ref.0) : [hudson.maven.MavenBuildProxy2]
      Created at Mon Sep 14 12:29:17 UTC 2015
    	at hudson.remoting.ExportTable$Entry.<init>(ExportTable.java:93)
    	at hudson.remoting.ExportTable.export(ExportTable.java:297)
    	at hudson.remoting.Channel.internalExport(Channel.java:591)
    	at hudson.remoting.Channel.export(Channel.java:582)
    	at hudson.remoting.Channel.export(Channel.java:552)
    	at hudson.maven.MavenBuild$ProxyImpl2.writeReplace(MavenBuild.java:743)
    	at sun.reflect.GeneratedMethodAccessor6814.invoke(Unknown Source)
    	at sun.reflect.DelegatingMethodAccessorImpl.invoke(DelegatingMethodAccessorImpl.java:43)
    	at java.lang.reflect.Method.invoke(Method.java:606)
    	at java.io.ObjectStreamClass.invokeWriteReplace(ObjectStreamClass.java:1075)
    	at java.io.ObjectOutputStream.writeObject0(ObjectOutputStream.java:1134)
    	at java.io.ObjectOutputStream.defaultWriteFields(ObjectOutputStream.java:1547)
    	at java.io.ObjectOutputStream.writeSerialData(ObjectOutputStream.java:1508)
    	at java.io.ObjectOutputStream.writeOrdinaryObject(ObjectOutputStream.java:1431)
    	at java.io.ObjectOutputStream.writeObject0(ObjectOutputStream.java:1177)
    	at java.io.ObjectOutputStream.writeObject(ObjectOutputStream.java:347)
    	at java.util.HashMap.writeObject(HashMap.java:1133)
    	at sun.reflect.GeneratedMethodAccessor426.invoke(Unknown Source)
    	at sun.reflect.DelegatingMethodAccessorImpl.invoke(DelegatingMethodAccessorImpl.java:43)
    	at java.lang.reflect.Method.invoke(Method.java:606)
    	at java.io.ObjectStreamClass.invokeWriteObject(ObjectStreamClass.java:988)
    	at java.io.ObjectOutputStream.writeSerialData(ObjectOutputStream.java:1495)
    	at java.io.ObjectOutputStream.writeOrdinaryObject(ObjectOutputStream.java:1431)
    	at java.io.ObjectOutputStream.writeObject0(ObjectOutputStream.java:1177)
    	at java.io.ObjectOutputStream.defaultWriteFields(ObjectOutputStream.java:1547)
    	at java.io.ObjectOutputStream.writeSerialData(ObjectOutputStream.java:1508)
    	at java.io.ObjectOutputStream.writeOrdinaryObject(ObjectOutputStream.java:1431)
    	at java.io.ObjectOutputStream.writeObject0(ObjectOutputStream.java:1177)
    	at java.io.ObjectOutputStream.writeObject(ObjectOutputStream.java:347)
    	at hudson.remoting.UserRequest._serialize(UserRequest.java:155)
    	at hudson.remoting.UserRequest.serialize(UserRequest.java:164)
    	at hudson.remoting.UserRequest.<init>(UserRequest.java:62)
    	at hudson.remoting.Channel.call(Channel.java:741)
    	at hudson.maven.ProcessCache$MavenProcess.call(ProcessCache.java:161)
    	at hudson.maven.MavenModuleSetBuild$MavenModuleSetBuildExecution.doRun(MavenModuleSetBuild.java:840)
    	at hudson.model.AbstractBuild$AbstractBuildExecution.run(AbstractBuild.java:529)
    	at hudson.model.Run.execute(Run.java:1706)
    	at hudson.maven.MavenModuleSetBuild.run(MavenModuleSetBuild.java:529)
    	at hudson.model.ResourceController.execute(ResourceController.java:88)
    	at hudson.model.Executor.run(Executor.java:232)
      Released at Mon Sep 14 13:33:31 UTC 2015
    	at hudson.remoting.ExportTable$Entry.release(ExportTable.java:125)
    	at hudson.remoting.ExportTable$ExportList.release(ExportTable.java:241)
    	at hudson.remoting.UserRequest.releaseExports(UserRequest.java:190)
    	at hudson.remoting.UserRequest.releaseExports(UserRequest.java:186)
    	at hudson.remoting.Channel.call(Channel.java:760)
    	at hudson.maven.ProcessCache$MavenProcess.call(ProcessCache.java:161)
    	at hudson.maven.MavenModuleSetBuild$MavenModuleSetBuildExecution.doRun(MavenModuleSetBuild.java:840)
    	at hudson.model.AbstractBuild$AbstractBuildExecution.run(AbstractBuild.java:529)
    	at hudson.model.Run.execute(Run.java:1706)
    	at hudson.maven.MavenModuleSetBuild.run(MavenModuleSetBuild.java:529)
    	at hudson.model.ResourceController.execute(ResourceController.java:88)
    	at hudson.model.Executor.run(Executor.java:232)
	at hudson.remoting.ExportTable.diagnoseInvalidId(ExportTable.java:339)
	... 14 more
Caused by:   Released at Mon Sep 14 13:33:31 UTC 2015
	at hudson.remoting.ExportTable$Entry.release(ExportTable.java:125)
	at hudson.remoting.ExportTable$ExportList.release(ExportTable.java:241)
	at hudson.remoting.UserRequest.releaseExports(UserRequest.java:190)
	at hudson.remoting.UserRequest.releaseExports(UserRequest.java:186)
	at hudson.remoting.Channel.call(Channel.java:760)
	at hudson.maven.ProcessCache$MavenProcess.call(ProcessCache.java:161)
	at hudson.maven.MavenModuleSetBuild$MavenModuleSetBuildExecution.doRun(MavenModuleSetBuild.java:840)
	at hudson.model.AbstractBuild$AbstractBuildExecution.run(AbstractBuild.java:529)
	at hudson.model.Run.execute(Run.java:1706)
	at hudson.maven.MavenModuleSetBuild.run(MavenModuleSetBuild.java:529)
	at hudson.model.ResourceController.execute(ResourceController.java:88)
	at hudson.model.Executor.run(Executor.java:232)
[ERROR] 
[ERROR] To see the full stack trace of the errors, re-run Maven with the -e switch.
[ERROR] Re-run Maven using the -X switch to enable full debug logging.
[ERROR] 
[ERROR] For more information about the errors and possible solutions, please read the following
articles:
[ERROR] [Help 1] http://cwiki.apache.org/confluence/display/MAVEN/InternalErrorException
channel stopped
Build was aborted

Mime
View raw message