sling-commits mailing list archives

Site index · List index
Message view « Date » · « Thread »
Top « Date » · « Thread »
From Apache Jenkins Server <jenk...@builds.apache.org>
Subject Build failed in Jenkins: sling-contrib-1.7 #355
Date Tue, 15 Sep 2015 22:20:23 GMT
See <https://builds.apache.org/job/sling-contrib-1.7/355/changes>

Changes:

[sseifert] SLING-4381 add readme

[sseifert] SLING-4381 add nosql sample launchpad

------------------------------------------
Started by an SCM change
[EnvInject] - Loading node environment variables.
Building remotely on jenkins-ubuntu-1404-4gb-782 (jenkins-cloud-4GB cloud-slave Ubuntu ubuntu)
in workspace <https://builds.apache.org/job/sling-contrib-1.7/ws/>
Updating http://svn.apache.org/repos/asf/sling/trunk/contrib at revision '2015-09-15T22:18:09.157
+0000'
U         pom.xml
A         nosql/README.md
A         nosql/launchpad
A         nosql/launchpad/src
A         nosql/launchpad/src/main
A         nosql/launchpad/src/main/provisioning
AU        nosql/launchpad/src/main/provisioning/boot.txt
AU        nosql/launchpad/src/main/provisioning/nosql-couchbase.txt
AU        nosql/launchpad/src/main/provisioning/nosql-generic.txt
AU        nosql/launchpad/src/main/provisioning/nosql-mongodb.txt
AU        nosql/launchpad/pom.xml
A         nosql/launchpad/README.md
At revision 1703304
Parsing POMs
Discovered a new module org.apache.sling:org.apache.sling.nosql.launchpad Apache Sling NoSQL
Launchpad
Modules changed, recalculating dependency graph
maven3-agent.jar already up to date
maven3-interceptor.jar already up to date
maven3-interceptor-commons.jar already up to date
[trunk] $ /home/jenkins/tools/java/latest1.7/bin/java -Xmx512M -XX:MaxPermSize=256M -enableassertions
-cp /jenkins/maven3-agent.jar:/jenkins/tools/hudson.tasks.Maven_MavenInstallation/Maven_3.0.5/boot/plexus-classworlds-2.4.jar
org.jvnet.hudson.maven3.agent.Maven3Main /jenkins/tools/hudson.tasks.Maven_MavenInstallation/Maven_3.0.5
/jenkins/slave.jar /jenkins/maven3-interceptor.jar /jenkins/maven3-interceptor-commons.jar
47155
<===[JENKINS REMOTING CAPACITY]===>   channel started
Executing Maven:  -B -f <https://builds.apache.org/job/sling-contrib-1.7/ws/trunk/pom.xml>
-Dmaven.repo.local=/jenkins/maven-repositories/0 -DobrRepository=false clean install -DHttpTestBase.readyTimeoutSeconds=300
[INFO] Scanning for projects...
Downloading: http://repo.maven.apache.org/maven2/org/apache/sling/slingstart-maven-plugin/1.3.6/slingstart-maven-plugin-1.3.6.pom
Downloaded: http://repo.maven.apache.org/maven2/org/apache/sling/slingstart-maven-plugin/1.3.6/slingstart-maven-plugin-1.3.6.pom
(7 KB at 17.5 KB/sec)
Downloading: http://repo.maven.apache.org/maven2/org/apache/sling/slingstart-maven-plugin/1.3.6/slingstart-maven-plugin-1.3.6.jar
Downloaded: http://repo.maven.apache.org/maven2/org/apache/sling/slingstart-maven-plugin/1.3.6/slingstart-maven-plugin-1.3.6.jar
(92 KB at 1941.6 KB/sec)
[ERROR] Unable to get artifact for Dependency {groupId=org.apache.sling, artifactId=org.apache.sling.launchpad,
version=LATEST, type=slingfeature}: Failed to resolve version for org.apache.sling:org.apache.sling.launchpad:txt:slingfeature:LATEST
[ERROR] org.apache.sling:org.apache.sling.launchpad:slingfeature:LATEST
[ERROR] 
[ERROR] from the specified remote repositories:
[ERROR] Nexus (http://repository.apache.org/snapshots, releases=false, snapshots=true),
[ERROR] central (http://repo.maven.apache.org/maven2, releases=true, snapshots=false)
[ERROR] -> [Help 1]
[ERROR] 
[ERROR] To see the full stack trace of the errors, re-run Maven with the -e switch.
[ERROR] Re-run Maven using the -X switch to enable full debug logging.
[ERROR] 
[ERROR] For more information about the errors and possible solutions, please read the following
articles:
[ERROR] [Help 1] http://cwiki.apache.org/confluence/display/MAVEN/MavenExecutionException
channel stopped

Mime
View raw message