sling-commits mailing list archives

Site index · List index
Message view « Date » · « Thread »
Top « Date » · « Thread »
From Apache Jenkins Server <jenk...@builds.apache.org>
Subject Build failed in Jenkins: sling-trunk-1.8 #1412
Date Thu, 13 Aug 2015 08:57:37 GMT
See <https://builds.apache.org/job/sling-trunk-1.8/1412/changes>

Changes:

[kwin] SLING-4944 fix potential race condition when accessing the resource resolver

------------------------------------------
[...truncated 120333 lines...]
[INFO] Apache Sling Scripting Sightly JavaScript Use Provider  SUCCESS [3.678s]
[INFO] Apache Sling Scripting Sightly Read-Eval-Print Loop Environment  SUCCESS [3.303s]
[INFO] Apache Sling Scripting Sightly Integration Tests Content  SUCCESS [4.159s]
[INFO] Apache Sling Adapter Manager Implementation ....... SUCCESS [5.096s]
[INFO] Apache Sling Launchpad Application Builder ........ SUCCESS [26.047s]
[INFO] Apache Sling Scripting Sightly Integration Tests .. SUCCESS [3:10.071s]
[INFO] Apache Sling Scripting Sightly Models Use Provider  SUCCESS [3.850s]
[INFO] Apache Sling Scripting Sightly Reactor ............ SUCCESS [2.201s]
[INFO] Apache Sling Bundle Resource Provider ............. SUCCESS [2.257s]
[INFO] Apache Sling Distributed Event Admin .............. SUCCESS [4.282s]
[INFO] Apache Sling Discovery API ........................ SUCCESS [2.192s]
[INFO] Apache Sling Discovery Commons Bundle ............. SUCCESS [3.288s]
[INFO] Apache Sling Resource-Based Discovery Service ..... SUCCESS [34:59.135s]
[INFO] Apache Sling Discovery Support Bundle ............. SUCCESS [3.005s]
[INFO] Apache Sling Discovery Standalone Implementation .. SUCCESS [2.549s]
[INFO] Apache Sling Event Support ........................ SUCCESS [28:21.449s]
[INFO] Apache Sling Feature Flags ........................ SUCCESS [2.314s]
[INFO] Apache Sling Filesystem Resource Provider ......... SUCCESS [2.452s]
[INFO] Apache Sling javax.activation bundle .............. SUCCESS [3.853s]
[INFO] Apache Sling Service User Mapper .................. SUCCESS [3.750s]
[INFO] Apache Sling Settings ............................. SUCCESS [8.125s]
[INFO] Apache Sling Web Console Branding ................. SUCCESS [2.199s]
[INFO] Apache Sling Web Console Security Provider ........ SUCCESS [2.597s]
[INFO] Apache Sling Explorer ............................. SUCCESS [3.267s]
[INFO] Apache Sling Health Check Core .................... SUCCESS [10.146s]
[INFO] Apache Sling Health Check Annotations ............. SUCCESS [2.347s]
[INFO] Apache Sling Health Check Samples ................. SUCCESS [4.132s]
[INFO] Apache Sling Health Check Support Components ...... SUCCESS [3.904s]
[INFO] Apache Sling Health Check Webconsole Plugin ....... SUCCESS [2.429s]
[INFO] Apache Sling Health Check JUnit Bridge ............ SUCCESS [3.628s]
[INFO] Apache Sling Health Check Integration Tests ....... SUCCESS [33.225s]
[INFO] Apache Sling Health Check Reactor POM ............. SUCCESS [1.412s]
[INFO] Apache Sling Resource Access Security ............. SUCCESS [3.296s]
[INFO] Apache Sling Test Tools ........................... SUCCESS [4.349s]
[INFO] Apache Sling Resource Access Security Integration Tests  SUCCESS [1:01.068s]
[INFO] Apache Sling Validation Framework API ............. SUCCESS [2.397s]
[INFO] Apache Sling Validation Framework Core Implementation  SUCCESS [6.272s]
[INFO] Apache Sling Validation Framework Testing Services  SUCCESS [2.821s]
[INFO] Apache Sling Validation Framework Integration Tests  SUCCESS [33.902s]
[INFO] Apache Sling Validation Framework Examples ........ SUCCESS [2.298s]
[INFO] Apache Sling Validation Framework Builder ......... SUCCESS [1.878s]
[INFO] Apache Sling Models API ........................... SUCCESS [2.375s]
[INFO] Apache Sling Models Implementation ................ SUCCESS [6.821s]
[INFO] Apache Sling Models Validation Implementation ..... SUCCESS [2.132s]
[INFO] Apache Sling Models Integration Tests ............. SUCCESS [1:08.972s]
[INFO] Apache Sling Internationalization Support ......... SUCCESS [2:02.117s]
[INFO] Apache Sling XSS Protection Bundle ................ SUCCESS [11.148s]
[INFO] Apache Sling JUnit Core ........................... SUCCESS [3.574s]
[INFO] Apache Sling JUnit Scriptable Tests Provider ...... SUCCESS [3.463s]
[INFO] Apache Sling JUnit Health Checks .................. SUCCESS [3.371s]
[INFO] Apache Sling JUnit Remote Tests Runners ........... SUCCESS [2.694s]
[INFO] Apache Sling JUnit Performance .................... SUCCESS [3.467s]
[INFO] Apache Sling Testing Mock Log Configuration ....... SUCCESS [4.163s]
[INFO] Apache Sling Testing Resource Resolver Mock ....... SUCCESS [2.695s]
[INFO] Apache Sling Testing JCR Mock ..................... SUCCESS [4.390s]
[INFO] Apache Sling Testing OSGi Mock .................... SUCCESS [6.987s]
[INFO] Apache Sling Testing Sling Mock ................... SUCCESS [6.824s]
[INFO] Apache Sling Testing Sling Mock Jackrabbit-based Resource Resolver  SUCCESS [58.539s]
[INFO] Apache Sling Sample Server-Side Tests ............. SUCCESS [3.028s]
[INFO] Apache Sling Failing Server-Side Tests ............ SUCCESS [3.062s]
[INFO] Apache Sling Sample Integration Tests ............. SUCCESS [1:06.163s]
[INFO] Apache Sling Testing Modules Reactor .............. SUCCESS [3.170s]
[INFO] Apache Sling Installer ............................ SUCCESS [7.744s]
[INFO] Apache Sling Installer WebConsole Plugin .......... SUCCESS [2.210s]
[INFO] Apache Sling File Installer ....................... SUCCESS [3.184s]
[INFO] Apache Sling JCR Installer ........................ SUCCESS [2:55.121s]
[INFO] Apache Sling Installer Configuration Admin Support  SUCCESS [3.711s]
[INFO] Apache Sling Deployment Package Installer ......... SUCCESS [2.553s]
[INFO] Apache Sling Subsystems Installer ................. SUCCESS [3.844s]
[INFO] Apache Sling Installer Integration Tests .......... SUCCESS [1:13.537s]
[INFO] Apache Sling Launchpad API ........................ SUCCESS [2.156s]
[INFO] Apache Sling Launchpad Base ....................... SUCCESS [13.388s]
[INFO] Apache Sling Launchpad Installer .................. FAILURE [31:44.092s]
[INFO] Apache Sling Launchpad Content .................... SKIPPED
[INFO] Apache Sling Launchpad Testing Services ........... SKIPPED
[INFO] Apache Sling Launchpad Testing Services WAR ....... SKIPPED
[INFO] Apache Sling Launchpad Testing Fragment Bundle .... SKIPPED
[INFO] Apache Sling Launchpad Test Bundles ............... SKIPPED
[INFO] Apache Sling Integration Tests .................... SKIPPED
[INFO] Apache Sling Launchpad Testing .................... SKIPPED
[INFO] Apache Sling (Builder) ............................ SKIPPED
[INFO] ------------------------------------------------------------------------
[INFO] BUILD FAILURE
[INFO] ------------------------------------------------------------------------
[INFO] Total time: 2:09:47.552s
[INFO] Finished at: Thu Aug 13 08:54:10 UTC 2015
[INFO] Final Memory: 183M/461M
[INFO] ------------------------------------------------------------------------
[JENKINS] Archiving disabled
[JENKINS] Archiving disabled
[JENKINS] Archiving disabled
[JENKINS] Archiving disabled
[JENKINS] Archiving disabled
[JENKINS] Archiving disabled
[JENKINS] Archiving disabled
[JENKINS] Archiving disabled
[JENKINS] Archiving disabled
[JENKINS] Archiving disabled
[JENKINS] Archiving disabled
[JENKINS] Archiving disabled
[JENKINS] Archiving disabled
[JENKINS] Archiving disabled
[JENKINS] Archiving disabled
[JENKINS] Archiving disabled
[JENKINS] Archiving disabled
[JENKINS] Archiving disabled
[JENKINS] Archiving disabled
[JENKINS] Archiving disabled
[JENKINS] Archiving disabled
[JENKINS] Archiving disabled
[JENKINS] Archiving disabled
[JENKINS] Archiving disabled
[JENKINS] Archiving disabled
[JENKINS] Archiving disabled
[JENKINS] Archiving disabled
[JENKINS] Archiving disabled
[JENKINS] Archiving disabled
[JENKINS] Archiving disabled
[JENKINS] Archiving disabled
[JENKINS] Archiving disabled
[JENKINS] Archiving disabled
[JENKINS] Archiving disabled
[JENKINS] Archiving disabled
[JENKINS] Archiving disabled
[JENKINS] Archiving disabled
[JENKINS] Archiving disabled
[JENKINS] Archiving disabled
[JENKINS] Archiving disabled
[JENKINS] Archiving disabled
[JENKINS] Archiving disabled
[JENKINS] Archiving disabled
[JENKINS] Archiving disabled
[JENKINS] Archiving disabled
[JENKINS] Archiving disabled
[JENKINS] Archiving disabled
[JENKINS] Archiving disabled
[JENKINS] Archiving disabled
[JENKINS] Archiving disabled
[JENKINS] Archiving disabled
[JENKINS] Archiving disabled
[JENKINS] Archiving disabled
[JENKINS] Archiving disabled
[JENKINS] Archiving disabled
[JENKINS] Archiving disabled
[JENKINS] Archiving disabled
[JENKINS] Archiving disabled
[JENKINS] Archiving disabled
[JENKINS] Archiving disabled
[JENKINS] Archiving disabled
[JENKINS] Archiving disabled
[JENKINS] Archiving disabled
[JENKINS] Archiving disabled
[JENKINS] Archiving disabled
[JENKINS] Archiving disabled
[JENKINS] Archiving disabled
[JENKINS] Archiving disabled
[JENKINS] Archiving disabled
[JENKINS] Archiving disabled
[JENKINS] Archiving disabled
[JENKINS] Archiving disabled
[JENKINS] Archiving disabled
[JENKINS] Archiving disabled
[JENKINS] Archiving disabled
[JENKINS] Archiving disabled
[JENKINS] Archiving disabled
[JENKINS] Archiving disabled
[JENKINS] Archiving disabled
[JENKINS] Archiving disabled
[JENKINS] Archiving disabled
[JENKINS] Archiving disabled
[JENKINS] Archiving disabled
[JENKINS] Archiving disabled
[JENKINS] Archiving disabled
[JENKINS] Archiving disabled
[JENKINS] Archiving disabled
[JENKINS] Archiving disabled
[JENKINS] Archiving disabled
[JENKINS] Archiving disabled
[JENKINS] Archiving disabled
[JENKINS] Archiving disabled
[JENKINS] Archiving disabled
[JENKINS] Archiving disabled
[JENKINS] Archiving disabled
[JENKINS] Archiving disabled
[JENKINS] Archiving disabled
[JENKINS] Archiving disabled
[JENKINS] Archiving disabled
[JENKINS] Archiving disabled
[JENKINS] Archiving disabled
[JENKINS] Archiving disabled
[JENKINS] Archiving disabled
[JENKINS] Archiving disabled
[JENKINS] Archiving disabled
[JENKINS] Archiving disabled
[JENKINS] Archiving disabled
[JENKINS] Archiving disabled
[JENKINS] Archiving disabled
[JENKINS] Archiving disabled
[JENKINS] Archiving disabled
[JENKINS] Archiving disabled
[JENKINS] Archiving disabled
[JENKINS] Archiving disabled
[JENKINS] Archiving disabled
[JENKINS] Archiving disabled
[JENKINS] Archiving disabled
[JENKINS] Archiving disabled
[JENKINS] Archiving disabled
[JENKINS] Archiving disabled
[JENKINS] Archiving disabled
[JENKINS] Archiving disabled
[JENKINS] Archiving disabled
[JENKINS] Archiving disabled
[JENKINS] Archiving disabled
[JENKINS] Archiving disabled
[JENKINS] Archiving disabled
[JENKINS] Archiving disabled
[JENKINS] Archiving disabled
[JENKINS] Archiving disabled
[JENKINS] Archiving disabled
[JENKINS] Archiving disabled
[JENKINS] Archiving disabled
[JENKINS] Archiving disabled
[JENKINS] Archiving disabled
[JENKINS] Archiving disabled
[JENKINS] Archiving disabled
[JENKINS] Archiving disabled
[JENKINS] Archiving disabled
[JENKINS] Archiving disabled
[JENKINS] Archiving disabled
[JENKINS] Archiving disabled
[JENKINS] Archiving disabled
[JENKINS] Archiving disabled
[JENKINS] Archiving disabled
[JENKINS] Archiving disabled
[JENKINS] Archiving disabled
Waiting for Jenkins to finish collecting data
[ERROR] Failed to execute goal org.apache.maven.plugins:maven-surefire-plugin:2.18.1:test
(default-test) on project org.apache.sling.launchpad.installer: Execution default-test of
goal org.apache.maven.plugins:maven-surefire-plugin:2.18.1:test failed: The forked VM terminated
without properly saying goodbye. VM crash or System.exit called?
[ERROR] Command was /bin/sh -c cd <https://builds.apache.org/job/sling-trunk-1.8/ws/trunk/launchpad/installer>
&& /home/jenkins/jenkins-slave/tools/hudson.model.JDK/jdk-1.8.0/jre/bin/java -jar
<https://builds.apache.org/job/sling-trunk-1.8/ws/trunk/launchpad/installer/target/surefire/surefirebooter5594551659199560207.jar>
<https://builds.apache.org/job/sling-trunk-1.8/ws/trunk/launchpad/installer/target/surefire/surefire4795886763336096228tmp>
<https://builds.apache.org/job/sling-trunk-1.8/ws/trunk/launchpad/installer/target/surefire/surefire_554551852713597645533tmp>
[ERROR] -> [Help 1]
[ERROR] 
[ERROR] To see the full stack trace of the errors, re-run Maven with the -e switch.
[ERROR] Re-run Maven using the -X switch to enable full debug logging.
[ERROR] 
[ERROR] For more information about the errors and possible solutions, please read the following
articles:
[ERROR] [Help 1] http://cwiki.apache.org/confluence/display/MAVEN/PluginExecutionException
[ERROR] 
[ERROR] After correcting the problems, you can resume the build with the command
[ERROR]   mvn <goals> -rf :org.apache.sling.launchpad.installer
channel stopped

Mime
View raw message