sling-commits mailing list archives

Site index · List index
Message view « Date » · « Thread »
Top « Date » · « Thread »
From Apache Jenkins Server <jenk...@builds.apache.org>
Subject Build failed in Jenkins: sling-trunk-1.8 #1404
Date Mon, 10 Aug 2015 17:28:17 GMT
See <https://builds.apache.org/job/sling-trunk-1.8/1404/changes>

Changes:

[radu] release: updated dependencies

[radu] [maven-release-plugin] prepare for next development iteration

[radu] [maven-release-plugin] prepare release org.apache.sling.scripting.sightly.js.provider-1.0.8

[radu] SLING-4940 - Add the Sling ScriptCache configuration applied by o.a.s.s.sightly.js.provider
to the provisioning model

* re-added wrongly removed dependency

------------------------------------------
[...truncated 130616 lines...]
[INFO] Apache Sling Scripting Sightly JavaScript Use Provider  SUCCESS [2.513s]
[INFO] Apache Sling Scripting Sightly Read-Eval-Print Loop Environment  SUCCESS [1.838s]
[INFO] Apache Sling Scripting Sightly Integration Tests Content  SUCCESS [3.303s]
[INFO] Apache Sling Adapter Manager Implementation ....... SUCCESS [2.619s]
[INFO] Apache Sling Launchpad Application Builder ........ SUCCESS [17.344s]
[INFO] Apache Sling Scripting Sightly Integration Tests .. SUCCESS [2:34.370s]
[INFO] Apache Sling Scripting Sightly Models Use Provider  SUCCESS [1.881s]
[INFO] Apache Sling Scripting Sightly Reactor ............ SUCCESS [1.421s]
[INFO] Apache Sling Bundle Resource Provider ............. SUCCESS [2.013s]
[INFO] Apache Sling Distributed Event Admin .............. SUCCESS [2.561s]
[INFO] Apache Sling Discovery API ........................ SUCCESS [1.675s]
[INFO] Apache Sling Discovery Commons Bundle ............. SUCCESS [2.417s]
[INFO] Apache Sling Resource-Based Discovery Service ..... SUCCESS [18:02.165s]
[INFO] Apache Sling Discovery Support Bundle ............. SUCCESS [1.918s]
[INFO] Apache Sling Discovery Standalone Implementation .. SUCCESS [1.913s]
[INFO] Apache Sling Event Support ........................ SUCCESS [19:25.396s]
[INFO] Apache Sling Feature Flags ........................ SUCCESS [1.818s]
[INFO] Apache Sling Filesystem Resource Provider ......... SUCCESS [1.951s]
[INFO] Apache Sling javax.activation bundle .............. SUCCESS [1.904s]
[INFO] Apache Sling Service User Mapper .................. SUCCESS [2.749s]
[INFO] Apache Sling Settings ............................. SUCCESS [2.658s]
[INFO] Apache Sling Web Console Branding ................. SUCCESS [1.655s]
[INFO] Apache Sling Web Console Security Provider ........ SUCCESS [1.839s]
[INFO] Apache Sling Explorer ............................. SUCCESS [1.763s]
[INFO] Apache Sling Health Check Core .................... SUCCESS [8.425s]
[INFO] Apache Sling Health Check Annotations ............. SUCCESS [1.643s]
[INFO] Apache Sling Health Check Samples ................. SUCCESS [2.747s]
[INFO] Apache Sling Health Check Support Components ...... SUCCESS [2.541s]
[INFO] Apache Sling Health Check Webconsole Plugin ....... SUCCESS [1.746s]
[INFO] Apache Sling Health Check JUnit Bridge ............ SUCCESS [2.464s]
[INFO] Apache Sling Health Check Integration Tests ....... SUCCESS [29.152s]
[INFO] Apache Sling Health Check Reactor POM ............. SUCCESS [1.143s]
[INFO] Apache Sling Resource Access Security ............. SUCCESS [1.918s]
[INFO] Apache Sling Test Tools ........................... SUCCESS [2.728s]
[INFO] Apache Sling Resource Access Security Integration Tests  SUCCESS [42.530s]
[INFO] Apache Sling Validation Framework API ............. SUCCESS [1.847s]
[INFO] Apache Sling Validation Framework Core Implementation  SUCCESS [4.119s]
[INFO] Apache Sling Validation Framework Testing Services  SUCCESS [2.048s]
[INFO] Apache Sling Validation Framework Integration Tests  SUCCESS [20.675s]
[INFO] Apache Sling Validation Framework Examples ........ SUCCESS [2.075s]
[INFO] Apache Sling Validation Framework Builder ......... SUCCESS [1.167s]
[INFO] Apache Sling Models API ........................... SUCCESS [2.024s]
[INFO] Apache Sling Models Implementation ................ SUCCESS [4.915s]
[INFO] Apache Sling Models Validation Implementation ..... SUCCESS [2.366s]
[INFO] Apache Sling Models Integration Tests ............. SUCCESS [48.400s]
[INFO] Apache Sling Internationalization Support ......... SUCCESS [1:19.396s]
[INFO] Apache Sling XSS Protection Bundle ................ SUCCESS [8.295s]
[INFO] Apache Sling JUnit Core ........................... SUCCESS [2.766s]
[INFO] Apache Sling JUnit Scriptable Tests Provider ...... SUCCESS [2.335s]
[INFO] Apache Sling JUnit Health Checks .................. SUCCESS [2.171s]
[INFO] Apache Sling JUnit Remote Tests Runners ........... SUCCESS [1.984s]
[INFO] Apache Sling JUnit Performance .................... SUCCESS [2.283s]
[INFO] Apache Sling Testing Mock Log Configuration ....... SUCCESS [1.690s]
[INFO] Apache Sling Testing Resource Resolver Mock ....... SUCCESS [2.244s]
[INFO] Apache Sling Testing JCR Mock ..................... SUCCESS [2.833s]
[INFO] Apache Sling Testing OSGi Mock .................... SUCCESS [3.571s]
[INFO] Apache Sling Testing Sling Mock ................... SUCCESS [6.014s]
[INFO] Apache Sling Testing Sling Mock Jackrabbit-based Resource Resolver  SUCCESS [40.928s]
[INFO] Apache Sling Sample Server-Side Tests ............. SUCCESS [2.228s]
[INFO] Apache Sling Failing Server-Side Tests ............ SUCCESS [1.668s]
[INFO] Apache Sling Sample Integration Tests ............. SUCCESS [1:54.757s]
[INFO] Apache Sling Testing Modules Reactor .............. SUCCESS [1.404s]
[INFO] Apache Sling Installer ............................ SUCCESS [3.382s]
[INFO] Apache Sling Installer WebConsole Plugin .......... SUCCESS [1.660s]
[INFO] Apache Sling File Installer ....................... SUCCESS [2.094s]
[INFO] Apache Sling JCR Installer ........................ SUCCESS [2:19.411s]
[INFO] Apache Sling Installer Configuration Admin Support  SUCCESS [2.124s]
[INFO] Apache Sling Deployment Package Installer ......... SUCCESS [4.895s]
[INFO] Apache Sling Subsystems Installer ................. SUCCESS [1.779s]
[INFO] Apache Sling Installer Integration Tests .......... SUCCESS [53.530s]
[INFO] Apache Sling Launchpad API ........................ SUCCESS [1.631s]
[INFO] Apache Sling Launchpad Base ....................... SUCCESS [11.369s]
[INFO] Apache Sling Launchpad Installer .................. FAILURE [38:24.033s]
[INFO] Apache Sling Launchpad Content .................... SKIPPED
[INFO] Apache Sling Launchpad Testing Services ........... SKIPPED
[INFO] Apache Sling Launchpad Testing Services WAR ....... SKIPPED
[INFO] Apache Sling Launchpad Testing Fragment Bundle .... SKIPPED
[INFO] Apache Sling Launchpad Test Bundles ............... SKIPPED
[INFO] Apache Sling Integration Tests .................... SKIPPED
[INFO] Apache Sling Launchpad Testing .................... SKIPPED
[INFO] Apache Sling (Builder) ............................ SKIPPED
[INFO] ------------------------------------------------------------------------
[INFO] BUILD FAILURE
[INFO] ------------------------------------------------------------------------
[INFO] Total time: 1:44:14.194s
[INFO] Finished at: Mon Aug 10 17:28:23 UTC 2015
[INFO] Final Memory: 184M/456M
[INFO] ------------------------------------------------------------------------
[JENKINS] Archiving disabled
[JENKINS] Archiving disabled
[JENKINS] Archiving disabled
[JENKINS] Archiving disabled
[JENKINS] Archiving disabled
[JENKINS] Archiving disabled
[JENKINS] Archiving disabled
[JENKINS] Archiving disabled
[JENKINS] Archiving disabled
[JENKINS] Archiving disabled
[JENKINS] Archiving disabled
[JENKINS] Archiving disabled
[JENKINS] Archiving disabled
[JENKINS] Archiving disabled
[JENKINS] Archiving disabled
[JENKINS] Archiving disabled
[JENKINS] Archiving disabled
[JENKINS] Archiving disabled
[JENKINS] Archiving disabled
[JENKINS] Archiving disabled
[JENKINS] Archiving disabled
[JENKINS] Archiving disabled
[JENKINS] Archiving disabled
[JENKINS] Archiving disabled
[JENKINS] Archiving disabled
[JENKINS] Archiving disabled
[JENKINS] Archiving disabled
[JENKINS] Archiving disabled
[JENKINS] Archiving disabled
[JENKINS] Archiving disabled
[JENKINS] Archiving disabled
[JENKINS] Archiving disabled
[JENKINS] Archiving disabled
[JENKINS] Archiving disabled
[JENKINS] Archiving disabled
[JENKINS] Archiving disabled
[JENKINS] Archiving disabled
[JENKINS] Archiving disabled
[JENKINS] Archiving disabled
[JENKINS] Archiving disabled
[JENKINS] Archiving disabled
[JENKINS] Archiving disabled
[JENKINS] Archiving disabled
[JENKINS] Archiving disabled
[JENKINS] Archiving disabled
[JENKINS] Archiving disabled
[JENKINS] Archiving disabled
[JENKINS] Archiving disabled
[JENKINS] Archiving disabled
[JENKINS] Archiving disabled
[JENKINS] Archiving disabled
[JENKINS] Archiving disabled
[JENKINS] Archiving disabled
[JENKINS] Archiving disabled
[JENKINS] Archiving disabled
[JENKINS] Archiving disabled
[JENKINS] Archiving disabled
[JENKINS] Archiving disabled
[JENKINS] Archiving disabled
[JENKINS] Archiving disabled
[JENKINS] Archiving disabled
[JENKINS] Archiving disabled
[JENKINS] Archiving disabled
[JENKINS] Archiving disabled
[JENKINS] Archiving disabled
[JENKINS] Archiving disabled
[JENKINS] Archiving disabled
[JENKINS] Archiving disabled
[JENKINS] Archiving disabled
[JENKINS] Archiving disabled
[JENKINS] Archiving disabled
[JENKINS] Archiving disabled
[JENKINS] Archiving disabled
[JENKINS] Archiving disabled
[JENKINS] Archiving disabled
[JENKINS] Archiving disabled
[JENKINS] Archiving disabled
[JENKINS] Archiving disabled
[JENKINS] Archiving disabled
[JENKINS] Archiving disabled
[JENKINS] Archiving disabled
[JENKINS] Archiving disabled
[JENKINS] Archiving disabled
[JENKINS] Archiving disabled
[JENKINS] Archiving disabled
[JENKINS] Archiving disabled
[JENKINS] Archiving disabled
[JENKINS] Archiving disabled
[JENKINS] Archiving disabled
[JENKINS] Archiving disabled
[JENKINS] Archiving disabled
[JENKINS] Archiving disabled
[JENKINS] Archiving disabled
[JENKINS] Archiving disabled
[JENKINS] Archiving disabled
[JENKINS] Archiving disabled
[JENKINS] Archiving disabled
[JENKINS] Archiving disabled
[JENKINS] Archiving disabled
[JENKINS] Archiving disabled
[JENKINS] Archiving disabled
[JENKINS] Archiving disabled
[JENKINS] Archiving disabled
[JENKINS] Archiving disabled
[JENKINS] Archiving disabled
[JENKINS] Archiving disabled
[JENKINS] Archiving disabled
[JENKINS] Archiving disabled
[JENKINS] Archiving disabled
[JENKINS] Archiving disabled
[JENKINS] Archiving disabled
[JENKINS] Archiving disabled
[JENKINS] Archiving disabled
[JENKINS] Archiving disabled
[JENKINS] Archiving disabled
[JENKINS] Archiving disabled
[JENKINS] Archiving disabled
[JENKINS] Archiving disabled
[JENKINS] Archiving disabled
[JENKINS] Archiving disabled
[JENKINS] Archiving disabled
[JENKINS] Archiving disabled
[JENKINS] Archiving disabled
[JENKINS] Archiving disabled
[JENKINS] Archiving disabled
[JENKINS] Archiving disabled
[JENKINS] Archiving disabled
[JENKINS] Archiving disabled
[JENKINS] Archiving disabled
[JENKINS] Archiving disabled
[JENKINS] Archiving disabled
[JENKINS] Archiving disabled
[JENKINS] Archiving disabled
[JENKINS] Archiving disabled
[JENKINS] Archiving disabled
[JENKINS] Archiving disabled
[JENKINS] Archiving disabled
[JENKINS] Archiving disabled
[JENKINS] Archiving disabled
[JENKINS] Archiving disabled
[JENKINS] Archiving disabled
[JENKINS] Archiving disabled
[JENKINS] Archiving disabled
[JENKINS] Archiving disabled
[JENKINS] Archiving disabled
[JENKINS] Archiving disabled
[JENKINS] Archiving disabled
Waiting for Jenkins to finish collecting data
[ERROR] Failed to execute goal org.apache.maven.plugins:maven-surefire-plugin:2.18.1:test
(default-test) on project org.apache.sling.launchpad.installer: Execution default-test of
goal org.apache.maven.plugins:maven-surefire-plugin:2.18.1:test failed: The forked VM terminated
without properly saying goodbye. VM crash or System.exit called?
[ERROR] Command was /bin/sh -c cd <https://builds.apache.org/job/sling-trunk-1.8/ws/trunk/launchpad/installer>
&& /home/jenkins/jenkins-slave/tools/hudson.model.JDK/jdk-1.8.0/jre/bin/java -jar
<https://builds.apache.org/job/sling-trunk-1.8/ws/trunk/launchpad/installer/target/surefire/surefirebooter5011671635600259623.jar>
<https://builds.apache.org/job/sling-trunk-1.8/ws/trunk/launchpad/installer/target/surefire/surefire5724837377974121869tmp>
<https://builds.apache.org/job/sling-trunk-1.8/ws/trunk/launchpad/installer/target/surefire/surefire_555254825978387249161tmp>
[ERROR] -> [Help 1]
[ERROR] 
[ERROR] To see the full stack trace of the errors, re-run Maven with the -e switch.
[ERROR] Re-run Maven using the -X switch to enable full debug logging.
[ERROR] 
[ERROR] For more information about the errors and possible solutions, please read the following
articles:
[ERROR] [Help 1] http://cwiki.apache.org/confluence/display/MAVEN/PluginExecutionException
[ERROR] 
[ERROR] After correcting the problems, you can resume the build with the command
[ERROR]   mvn <goals> -rf :org.apache.sling.launchpad.installer
channel stopped

Mime
View raw message