sling-commits mailing list archives

Site index · List index
Message view « Date » · « Thread »
Top « Date » · « Thread »
From Apache Jenkins Server <jenk...@builds.apache.org>
Subject Build failed in Jenkins: sling-contrib-1.7 #310
Date Mon, 24 Aug 2015 16:36:59 GMT
See <https://builds.apache.org/job/sling-contrib-1.7/310/changes>

Changes:

[bdelacretaz] SLING-4513 - change copyright header as authorized in SLING-4778

[bdelacretaz] SLING-4513 - add reactor pom

[bdelacretaz] SLING-4513 - fix build error

[bdelacretaz] SLING-4513 - import donated HApi tools

------------------------------------------
[...truncated 540247 lines...]
	at javax.servlet.http.HttpServlet.service(HttpServlet.java:687)[10:javax.servlet-api:3.1.0]
	at javax.servlet.http.HttpServlet.service(HttpServlet.java:790)[10:javax.servlet-api:3.1.0]
	at org.eclipse.jetty.servlet.ServletHolder.handle(ServletHolder.java:808)[75:org.eclipse.jetty.servlet:9.2.10.v20150310]
	at org.eclipse.jetty.servlet.ServletHandler.doHandle(ServletHandler.java:587)[75:org.eclipse.jetty.servlet:9.2.10.v20150310]
	at org.ops4j.pax.web.service.jetty.internal.HttpServiceServletHandler.doHandle(HttpServiceServletHandler.java:70)[93:org.ops4j.pax.web.pax-web-jetty:4.2.0]
	at org.eclipse.jetty.server.handler.ScopedHandler.handle(ScopedHandler.java:143)[74:org.eclipse.jetty.server:9.2.10.v20150310]
	at org.eclipse.jetty.security.SecurityHandler.handle(SecurityHandler.java:577)[73:org.eclipse.jetty.security:9.2.10.v20150310]
	at org.eclipse.jetty.server.session.SessionHandler.doHandle(SessionHandler.java:223)[74:org.eclipse.jetty.server:9.2.10.v20150310]
	at org.eclipse.jetty.server.handler.ContextHandler.doHandle(ContextHandler.java:1127)[74:org.eclipse.jetty.server:9.2.10.v20150310]
	at org.ops4j.pax.web.service.jetty.internal.HttpServiceContext.doHandle(HttpServiceContext.java:267)[93:org.ops4j.pax.web.pax-web-jetty:4.2.0]
	at org.eclipse.jetty.servlet.ServletHandler.doScope(ServletHandler.java:515)[75:org.eclipse.jetty.servlet:9.2.10.v20150310]
	at org.eclipse.jetty.server.session.SessionHandler.doScope(SessionHandler.java:185)[74:org.eclipse.jetty.server:9.2.10.v20150310]
	at org.eclipse.jetty.server.handler.ContextHandler.doScope(ContextHandler.java:1061)[74:org.eclipse.jetty.server:9.2.10.v20150310]
	at org.eclipse.jetty.server.handler.ScopedHandler.handle(ScopedHandler.java:141)[74:org.eclipse.jetty.server:9.2.10.v20150310]
	at org.ops4j.pax.web.service.jetty.internal.JettyServerHandlerCollection.handle(JettyServerHandlerCollection.java:99)[93:org.ops4j.pax.web.pax-web-jetty:4.2.0]
	at org.eclipse.jetty.server.handler.HandlerWrapper.handle(HandlerWrapper.java:97)[74:org.eclipse.jetty.server:9.2.10.v20150310]
	at org.eclipse.jetty.server.Server.handle(Server.java:497)[74:org.eclipse.jetty.server:9.2.10.v20150310]
	at org.eclipse.jetty.server.HttpChannel.handle(HttpChannel.java:310)[74:org.eclipse.jetty.server:9.2.10.v20150310]
	at org.eclipse.jetty.server.HttpConnection.onFillable(HttpConnection.java:257)[74:org.eclipse.jetty.server:9.2.10.v20150310]
	at org.eclipse.jetty.io.AbstractConnection$2.run(AbstractConnection.java:540)[66:org.eclipse.jetty.io:9.2.10.v20150310]
	at org.eclipse.jetty.util.thread.QueuedThreadPool.runJob(QueuedThreadPool.java:635)[77:org.eclipse.jetty.util:9.2.10.v20150310]
	at org.eclipse.jetty.util.thread.QueuedThreadPool$3.run(QueuedThreadPool.java:555)[77:org.eclipse.jetty.util:9.2.10.v20150310]
	at java.lang.Thread.run(Thread.java:724)[:1.7.0_25]
2015-08-24 16:33:13,863 | WARN  | qtp17265939-94   | HttpChannel                      | 77
- org.eclipse.jetty.util - 9.2.10.v20150310 | Could not send response error 500: java.lang.IllegalStateException:
Committed
2015-08-24 16:33:13,869 | WARN  | qtp17265939-95   | Response                         | 77
- org.eclipse.jetty.util - 9.2.10.v20150310 | Committed before 404 null
2015-08-24 16:33:13,869 | WARN  | qtp17265939-95   | ServletHandler                   | 77
- org.eclipse.jetty.util - 9.2.10.v20150310 | /system/sling/testlog
java.lang.IllegalStateException: Committed
	at org.eclipse.jetty.server.Response.resetBuffer(Response.java:1253)[74:org.eclipse.jetty.server:9.2.10.v20150310]
	at org.eclipse.jetty.server.Response.sendError(Response.java:567)[74:org.eclipse.jetty.server:9.2.10.v20150310]
	at org.eclipse.jetty.server.Response.sendError(Response.java:544)[74:org.eclipse.jetty.server:9.2.10.v20150310]
	at org.eclipse.jetty.servlet.ServletHandler$Default404Servlet.doGet(ServletHandler.java:1805)[75:org.eclipse.jetty.servlet:9.2.10.v20150310]
	at javax.servlet.http.HttpServlet.service(HttpServlet.java:687)[10:javax.servlet-api:3.1.0]
	at javax.servlet.http.HttpServlet.service(HttpServlet.java:790)[10:javax.servlet-api:3.1.0]
	at org.eclipse.jetty.servlet.ServletHolder.handle(ServletHolder.java:808)[75:org.eclipse.jetty.servlet:9.2.10.v20150310]
	at org.eclipse.jetty.servlet.ServletHandler.doHandle(ServletHandler.java:587)[75:org.eclipse.jetty.servlet:9.2.10.v20150310]
	at org.ops4j.pax.web.service.jetty.internal.HttpServiceServletHandler.doHandle(HttpServiceServletHandler.java:70)[93:org.ops4j.pax.web.pax-web-jetty:4.2.0]
	at org.eclipse.jetty.server.handler.ScopedHandler.handle(ScopedHandler.java:143)[74:org.eclipse.jetty.server:9.2.10.v20150310]
	at org.eclipse.jetty.security.SecurityHandler.handle(SecurityHandler.java:577)[73:org.eclipse.jetty.security:9.2.10.v20150310]
	at org.eclipse.jetty.server.session.SessionHandler.doHandle(SessionHandler.java:223)[74:org.eclipse.jetty.server:9.2.10.v20150310]
	at org.eclipse.jetty.server.handler.ContextHandler.doHandle(ContextHandler.java:1127)[74:org.eclipse.jetty.server:9.2.10.v20150310]
	at org.ops4j.pax.web.service.jetty.internal.HttpServiceContext.doHandle(HttpServiceContext.java:267)[93:org.ops4j.pax.web.pax-web-jetty:4.2.0]
	at org.eclipse.jetty.servlet.ServletHandler.doScope(ServletHandler.java:515)[75:org.eclipse.jetty.servlet:9.2.10.v20150310]
	at org.eclipse.jetty.server.session.SessionHandler.doScope(SessionHandler.java:185)[74:org.eclipse.jetty.server:9.2.10.v20150310]
	at org.eclipse.jetty.server.handler.ContextHandler.doScope(ContextHandler.java:1061)[74:org.eclipse.jetty.server:9.2.10.v20150310]
	at org.eclipse.jetty.server.handler.ScopedHandler.handle(ScopedHandler.java:141)[74:org.eclipse.jetty.server:9.2.10.v20150310]
	at org.ops4j.pax.web.service.jetty.internal.JettyServerHandlerCollection.handle(JettyServerHandlerCollection.java:99)[93:org.ops4j.pax.web.pax-web-jetty:4.2.0]
	at org.eclipse.jetty.server.handler.HandlerWrapper.handle(HandlerWrapper.java:97)[74:org.eclipse.jetty.server:9.2.10.v20150310]
	at org.eclipse.jetty.server.Server.handle(Server.java:497)[74:org.eclipse.jetty.server:9.2.10.v20150310]
	at org.eclipse.jetty.server.HttpChannel.handle(HttpChannel.java:310)[74:org.eclipse.jetty.server:9.2.10.v20150310]
	at org.eclipse.jetty.server.HttpConnection.onFillable(HttpConnection.java:257)[74:org.eclipse.jetty.server:9.2.10.v20150310]
	at org.eclipse.jetty.io.AbstractConnection$2.run(AbstractConnection.java:540)[66:org.eclipse.jetty.io:9.2.10.v20150310]
	at org.eclipse.jetty.util.thread.QueuedThreadPool.runJob(QueuedThreadPool.java:635)[77:org.eclipse.jetty.util:9.2.10.v20150310]
	at org.eclipse.jetty.util.thread.QueuedThreadPool$3.run(QueuedThreadPool.java:555)[77:org.eclipse.jetty.util:9.2.10.v20150310]
	at java.lang.Thread.run(Thread.java:724)[:1.7.0_25]
2015-08-24 16:33:13,870 | WARN  | qtp17265939-95   | HttpChannel                      | 77
- org.eclipse.jetty.util - 9.2.10.v20150310 | /system/sling/testlog?X-Sling-Test-Class=org.apache.sling.launchpad.webapp.integrationtest.auth.AuthenticationResponseCodeTest&X-Sling-Test-Name=testPreventLoopIncorrectHttpBasicCredentials
java.lang.IllegalStateException: Committed
	at org.eclipse.jetty.server.Response.resetBuffer(Response.java:1253)[74:org.eclipse.jetty.server:9.2.10.v20150310]
	at org.eclipse.jetty.server.Response.sendError(Response.java:567)[74:org.eclipse.jetty.server:9.2.10.v20150310]
	at org.eclipse.jetty.server.Response.sendError(Response.java:544)[74:org.eclipse.jetty.server:9.2.10.v20150310]
	at org.eclipse.jetty.servlet.ServletHandler$Default404Servlet.doGet(ServletHandler.java:1805)[75:org.eclipse.jetty.servlet:9.2.10.v20150310]
	at javax.servlet.http.HttpServlet.service(HttpServlet.java:687)[10:javax.servlet-api:3.1.0]
	at javax.servlet.http.HttpServlet.service(HttpServlet.java:790)[10:javax.servlet-api:3.1.0]
	at org.eclipse.jetty.servlet.ServletHolder.handle(ServletHolder.java:808)[75:org.eclipse.jetty.servlet:9.2.10.v20150310]
	at org.eclipse.jetty.servlet.ServletHandler.doHandle(ServletHandler.java:587)[75:org.eclipse.jetty.servlet:9.2.10.v20150310]
	at org.ops4j.pax.web.service.jetty.internal.HttpServiceServletHandler.doHandle(HttpServiceServletHandler.java:70)[93:org.ops4j.pax.web.pax-web-jetty:4.2.0]
	at org.eclipse.jetty.server.handler.ScopedHandler.handle(ScopedHandler.java:143)[74:org.eclipse.jetty.server:9.2.10.v20150310]
	at org.eclipse.jetty.security.SecurityHandler.handle(SecurityHandler.java:577)[73:org.eclipse.jetty.security:9.2.10.v20150310]
	at org.eclipse.jetty.server.session.SessionHandler.doHandle(SessionHandler.java:223)[74:org.eclipse.jetty.server:9.2.10.v20150310]
	at org.eclipse.jetty.server.handler.ContextHandler.doHandle(ContextHandler.java:1127)[74:org.eclipse.jetty.server:9.2.10.v20150310]
	at org.ops4j.pax.web.service.jetty.internal.HttpServiceContext.doHandle(HttpServiceContext.java:267)[93:org.ops4j.pax.web.pax-web-jetty:4.2.0]
	at org.eclipse.jetty.servlet.ServletHandler.doScope(ServletHandler.java:515)[75:org.eclipse.jetty.servlet:9.2.10.v20150310]
	at org.eclipse.jetty.server.session.SessionHandler.doScope(SessionHandler.java:185)[74:org.eclipse.jetty.server:9.2.10.v20150310]
	at org.eclipse.jetty.server.handler.ContextHandler.doScope(ContextHandler.java:1061)[74:org.eclipse.jetty.server:9.2.10.v20150310]
	at org.eclipse.jetty.server.handler.ScopedHandler.handle(ScopedHandler.java:141)[74:org.eclipse.jetty.server:9.2.10.v20150310]
	at org.ops4j.pax.web.service.jetty.internal.JettyServerHandlerCollection.handle(JettyServerHandlerCollection.java:99)[93:org.ops4j.pax.web.pax-web-jetty:4.2.0]
	at org.eclipse.jetty.server.handler.HandlerWrapper.handle(HandlerWrapper.java:97)[74:org.eclipse.jetty.server:9.2.10.v20150310]
	at org.eclipse.jetty.server.Server.handle(Server.java:497)[74:org.eclipse.jetty.server:9.2.10.v20150310]
	at org.eclipse.jetty.server.HttpChannel.handle(HttpChannel.java:310)[74:org.eclipse.jetty.server:9.2.10.v20150310]
	at org.eclipse.jetty.server.HttpConnection.onFillable(HttpConnection.java:257)[74:org.eclipse.jetty.server:9.2.10.v20150310]
	at org.eclipse.jetty.io.AbstractConnection$2.run(AbstractConnection.java:540)[66:org.eclipse.jetty.io:9.2.10.v20150310]
	at org.eclipse.jetty.util.thread.QueuedThreadPool.runJob(QueuedThreadPool.java:635)[77:org.eclipse.jetty.util:9.2.10.v20150310]
	at org.eclipse.jetty.util.thread.QueuedThreadPool$3.run(QueuedThreadPool.java:555)[77:org.eclipse.jetty.util:9.2.10.v20150310]
	at java.lang.Thread.run(Thread.java:724)[:1.7.0_25]
2015-08-24 16:33:13,870 | WARN  | qtp17265939-95   | HttpChannel                      | 77
- org.eclipse.jetty.util - 9.2.10.v20150310 | Could not send response error 500: java.lang.IllegalStateException:
Committed

Results :

Tests in error: 
  MappingEventsProxyTest.runWriteableResourcesTest:26 ยป HttpHostConnect Connecti...

Tests run: 1, Failures: 0, Errors: 1, Skipped: 0

[JENKINS] Recording test results
[JENKINS] Archiving disabled
[INFO] ------------------------------------------------------------------------
[INFO] Reactor Summary:
[INFO] 
[INFO] Apache Sling OpenID Authentication ................ SUCCESS [20.053s]
[INFO] Apache Sling Authentication XING API .............. SUCCESS [3.441s]
[INFO] Apache Sling Authentication XING Login ............ SUCCESS [4.990s]
[INFO] Apache Sling Authentication XING OAuth ............ SUCCESS [4.370s]
[INFO] Apache Sling Authentication Selector .............. SUCCESS [3.020s]
[INFO] Apache Sling Commons HTML Utilities ............... SUCCESS [2.713s]
[INFO] Apache Sling APT parser ........................... SUCCESS [4.027s]
[INFO] Apache Sling APT servlet .......................... SUCCESS [3.310s]
[INFO] Apache Sling Resource Collection API .............. SUCCESS [3.912s]
[INFO] Apache Sling DataSource Provider .................. SUCCESS [8.753s]
[INFO] Apache Sling Dojo JavaScript Library .............. SUCCESS [8.062s]
[INFO] Apache Sling Dojo Data Extension .................. SUCCESS [2.275s]
[INFO] Apache Sling FTP Server ........................... SUCCESS [3.980s]
[INFO] Apache Sling Google Web Toolkit Servlet Library ... SUCCESS [4.172s]
[INFO] Apache Sling Google Web Toolkit Sample ............ SUCCESS [27.654s]
[INFO] Apache Sling JMX Resource Provider ................ SUCCESS [2.484s]
[INFO] Apache Sling ClassLoader Leak Detector ............ SUCCESS [2.872s]
[INFO] Apache Sling MongoDB Resource Provider ............ SUCCESS [2.540s]
[INFO] Apache Sling OSGi Bundle Repository ............... SUCCESS [4.007s]
[INFO] Apache Sling Distribution API ..................... SUCCESS [2.608s]
[INFO] Apache Sling Distribution Core .................... SUCCESS [9.581s]
[INFO] Apache Sling Distribution Sample .................. SUCCESS [3.230s]
[INFO] Apache Sling Distribution Integration Tests ....... SUCCESS [2:56.797s]
[INFO] Apache Sling Log Tail Implementation .............. SUCCESS [4.836s]
[INFO] S3 dependencies for Oak ........................... SUCCESS [4.502s]
[INFO] Apache Sling Request Processing Analyzer .......... SUCCESS [3.336s]
[INFO] Apache Sling Resource Merger ...................... SUCCESS [3.985s]
[INFO] Apache Sling Inventory Printer Based on Resources . SUCCESS [2.522s]
[INFO] Apache Sling Rewriter ............................. SUCCESS [6.522s]
[INFO] Apache Sling Security ............................. SUCCESS [4.022s]
[INFO] Apache Sling SLF4J MDC Filter ..................... SUCCESS [11.365s]
[INFO] Apache Sling Query ................................ SUCCESS [4.898s]
[INFO] Apache Sling Superimposing Resource Provider ...... SUCCESS [3.711s]
[INFO] Apache Sling Tenant ............................... SUCCESS [3.801s]
[INFO] Apache Sling URL Rewriter ......................... SUCCESS [2.959s]
[INFO] Apache Sling JCR Java Compiler .................... SUCCESS [10.279s]
[INFO] Apache Sling Repository Accessor .................. SUCCESS [3.493s]
[INFO] Apache Sling Object Content Mapping ............... SUCCESS [4.663s]
[INFO] Apache Sling JCR Prefs ............................ SUCCESS [2.599s]
[INFO] Apache Sling JCR Resource Security ................ SUCCESS [2.189s]
[INFO] Apache Sling Script Console ....................... SUCCESS [3.502s]
[INFO] Apache Sling Atom Tag Library ..................... SUCCESS [3.308s]
[INFO] Apache Sling Scripting Freemarker Support ......... SUCCESS [9.340s]
[INFO] Apache Sling Scripting Groovy Support ............. SUCCESS [2.730s]
[INFO] Apache Sling Scripting Java Support ............... SUCCESS [3.485s]
[INFO] Apache Sling Scripting JST Support ................ SUCCESS [6.191s]
[INFO] Apache Sling Scripting Python Support ............. SUCCESS [3.688s]
[INFO] Apache Sling Scripting Ruby Support ............... SUCCESS [8.012s]
[INFO] Scala Script Engine ............................... SUCCESS [47.935s]
[INFO] Apache Sling Scala Scripting Configuration ........ SUCCESS [4.374s]
[INFO] Scala for Sling Demo Application - Hello World .... SUCCESS [2.179s]
[INFO] Scala for Sling Demo Application - Forum .......... SUCCESS [2.147s]
[INFO] Apache Sling Scripting Thymeleaf .................. SUCCESS [6.119s]
[INFO] Apache Sling Scripting Velocity Support ........... SUCCESS [3.020s]
[INFO] Apache Sling Scripting W3C XML Processing Support . SUCCESS [3.880s]
[INFO] Apache Sling NoSQL Generic Resource Provider ...... SUCCESS [5.350s]
[INFO] Apache Sling NoSQL Couchbase Client ............... SUCCESS [6.335s]
[INFO] Apache Sling NoSQL Couchbase Resource Provider .... SUCCESS [3.506s]
[INFO] Apache Sling Launchpad Contrib Testing ............ SUCCESS [1:20.612s]
[INFO] Apache Sling Launchpad Karaf ...................... SUCCESS [2.782s]
[INFO] Apache Sling Launchpad Karaf - Features ........... SUCCESS [13.228s]
[INFO] Apache Sling Launchpad Karaf - Integration Tests .. SUCCESS [26:03.738s]
[INFO] Apache Sling Launchpad Karaf - Launchpad Jackrabbit Derby Integration Tests  SUCCESS
[2:48.426s]
[INFO] Apache Sling Launchpad Karaf - Launchpad Oak Tar Integration Tests  FAILURE [10:53.069s]
[INFO] Apache Sling Launchpad Karaf Builder .............. SKIPPED
[INFO] Apache Sling Contrib (Builder) .................... SKIPPED
[INFO] ------------------------------------------------------------------------
[INFO] BUILD FAILURE
[INFO] ------------------------------------------------------------------------
[INFO] Total time: 50:40.727s
[INFO] Finished at: Mon Aug 24 16:37:47 UTC 2015
[INFO] Final Memory: 129M/330M
[INFO] ------------------------------------------------------------------------
[JENKINS] Archiving disabled
[JENKINS] Archiving disabled
[JENKINS] Archiving disabled
[JENKINS] Archiving disabled
[JENKINS] Archiving disabled
[JENKINS] Archiving disabled
[JENKINS] Archiving disabled
[JENKINS] Archiving disabled
[JENKINS] Archiving disabled
[JENKINS] Archiving disabled
[JENKINS] Archiving disabled
[JENKINS] Archiving disabled
[JENKINS] Archiving disabled
[JENKINS] Archiving disabled
[JENKINS] Archiving disabled
[JENKINS] Archiving disabled
[JENKINS] Archiving disabled
[JENKINS] Archiving disabled
[JENKINS] Archiving disabled
[JENKINS] Archiving disabled
[JENKINS] Archiving disabled
[JENKINS] Archiving disabled
[JENKINS] Archiving disabled
[JENKINS] Archiving disabled
[JENKINS] Archiving disabled
[JENKINS] Archiving disabled
[JENKINS] Archiving disabled
[JENKINS] Archiving disabled
[JENKINS] Archiving disabled
[JENKINS] Archiving disabled
[JENKINS] Archiving disabled
[JENKINS] Archiving disabled
[JENKINS] Archiving disabled
[JENKINS] Archiving disabled
[JENKINS] Archiving disabled
[JENKINS] Archiving disabled
[JENKINS] Archiving disabled
[JENKINS] Archiving disabled
[JENKINS] Archiving disabled
[JENKINS] Archiving disabled
[JENKINS] Archiving disabled
[JENKINS] Archiving disabled
[JENKINS] Archiving disabled
[JENKINS] Archiving disabled
[JENKINS] Archiving disabled
[JENKINS] Archiving disabled
[JENKINS] Archiving disabled
[JENKINS] Archiving disabled
[JENKINS] Archiving disabled
[JENKINS] Archiving disabled
[JENKINS] Archiving disabled
[JENKINS] Archiving disabled
[JENKINS] Archiving disabled
[JENKINS] Archiving disabled
[JENKINS] Archiving disabled
[JENKINS] Archiving disabled
[JENKINS] Archiving disabled
[JENKINS] Archiving disabled
[JENKINS] Archiving disabled
[JENKINS] Archiving disabled
[JENKINS] Archiving disabled
[JENKINS] Archiving disabled
[JENKINS] Archiving disabled
[JENKINS] Archiving disabled
[JENKINS] Archiving disabled
[JENKINS] Archiving disabled
Waiting for Jenkins to finish collecting data
[ERROR] Failed to execute goal org.apache.maven.plugins:maven-failsafe-plugin:2.18.1:integration-test
(default) on project org.apache.sling.launchpad.karaf-launchpad-oak-tar-integration-tests:
Execution default of goal org.apache.maven.plugins:maven-failsafe-plugin:2.18.1:integration-test
failed: java.lang.RuntimeException: org.apache.maven.surefire.report.ReporterException: When
writing xml report stdout/stderr: /tmp/stdout3034584036857285007deferred (No such file or
directory) -> [Help 1]
[ERROR] 
[ERROR] To see the full stack trace of the errors, re-run Maven with the -e switch.
[ERROR] Re-run Maven using the -X switch to enable full debug logging.
[ERROR] 
[ERROR] For more information about the errors and possible solutions, please read the following
articles:
[ERROR] [Help 1] http://cwiki.apache.org/confluence/display/MAVEN/PluginExecutionException
[ERROR] 
[ERROR] After correcting the problems, you can resume the build with the command
[ERROR]   mvn <goals> -rf :org.apache.sling.launchpad.karaf-launchpad-oak-tar-integration-tests
channel stopped


Mime
View raw message