sling-commits mailing list archives

Site index · List index
Message view « Date » · « Thread »
Top « Date » · « Thread »
From Apache Jenkins Server <jenk...@builds.apache.org>
Subject Build failed in Jenkins: sling-contrib-1.7 #226
Date Tue, 07 Jul 2015 10:08:49 GMT
See <https://builds.apache.org/job/sling-contrib-1.7/226/changes>

Changes:

[olli] [maven-release-plugin] prepare for next development iteration

[olli] [maven-release-plugin] prepare release org.apache.sling.scripting.thymeleaf-0.0.6

[olli] take over update from org.apache.sling.scripting.core (add some javadoc)

[olli] add some javadoc

------------------------------------------
[...truncated 382810 lines...]
	at org.apache.sling.resourceresolver.impl.CommonResourceResolverFactoryImpl$ResolverWeakReference.close(CommonResourceResolverFactoryImpl.java:421)[91:org.apache.sling.resourceresolver:1.2.4]
	at org.apache.sling.resourceresolver.impl.CommonResourceResolverFactoryImpl$1.run(CommonResourceResolverFactoryImpl.java:105)[91:org.apache.sling.resourceresolver:1.2.4]
2015-07-07 10:08:25,889 | WARN  | Finalizer Thread | SessionState                     | 153
- org.apache.sling.jcr.jackrabbit.server - 2.2.0 | session-admin-13503 has already been closed.
See the attached exception for a trace of where this session was closed.
java.lang.Exception: Stack trace of  where session-admin-13503 was originally closed
	at org.apache.jackrabbit.core.session.SessionState.close(SessionState.java:275)
	at org.apache.jackrabbit.core.SessionImpl.logout(SessionImpl.java:943)
	at org.apache.jackrabbit.core.XASessionImpl.logout(XASessionImpl.java:392)
	at org.apache.jackrabbit.core.RepositoryImpl.doShutdown(RepositoryImpl.java:1085)
	at org.apache.jackrabbit.core.RepositoryImpl.shutdown(RepositoryImpl.java:1048)
	at org.apache.sling.jcr.jackrabbit.server.impl.SlingServerRepositoryManager.disposeRepository(SlingServerRepositoryManager.java:300)
	at org.apache.sling.jcr.base.AbstractSlingRepositoryManager.stop(AbstractSlingRepositoryManager.java:361)
	at org.apache.sling.jcr.jackrabbit.server.impl.SlingServerRepositoryManager.deactivate(SlingServerRepositoryManager.java:355)
	at sun.reflect.NativeMethodAccessorImpl.invoke0(Native Method)[:1.7.0_25]
	at sun.reflect.NativeMethodAccessorImpl.invoke(NativeMethodAccessorImpl.java:57)[:1.7.0_25]
	at sun.reflect.DelegatingMethodAccessorImpl.invoke(DelegatingMethodAccessorImpl.java:43)[:1.7.0_25]
	at java.lang.reflect.Method.invoke(Method.java:606)[:1.7.0_25]
	at org.apache.felix.scr.impl.helper.BaseMethod.invokeMethod(BaseMethod.java:231)[43:org.apache.felix.scr:1.8.2]
	at org.apache.felix.scr.impl.helper.BaseMethod.access$500(BaseMethod.java:39)[43:org.apache.felix.scr:1.8.2]
	at org.apache.felix.scr.impl.helper.BaseMethod$Resolved.invoke(BaseMethod.java:624)[43:org.apache.felix.scr:1.8.2]
	at org.apache.felix.scr.impl.helper.BaseMethod.invoke(BaseMethod.java:508)[43:org.apache.felix.scr:1.8.2]
	at org.apache.felix.scr.impl.helper.ActivateMethod.invoke(ActivateMethod.java:149)[43:org.apache.felix.scr:1.8.2]
	at org.apache.felix.scr.impl.manager.SingleComponentManager.disposeImplementationObject(SingleComponentManager.java:355)[43:org.apache.felix.scr:1.8.2]
	at org.apache.felix.scr.impl.manager.SingleComponentManager.deleteComponent(SingleComponentManager.java:170)[43:org.apache.felix.scr:1.8.2]
	at org.apache.felix.scr.impl.manager.AbstractComponentManager.doDeactivate(AbstractComponentManager.java:908)[43:org.apache.felix.scr:1.8.2]
	at org.apache.felix.scr.impl.manager.AbstractComponentManager.deactivateInternal(AbstractComponentManager.java:883)[43:org.apache.felix.scr:1.8.2]
	at org.apache.felix.scr.impl.manager.AbstractComponentManager.dispose(AbstractComponentManager.java:580)[43:org.apache.felix.scr:1.8.2]
	at org.apache.felix.scr.impl.config.ConfigurableComponentHolder.disposeComponents(ConfigurableComponentHolder.java:406)[43:org.apache.felix.scr:1.8.2]
	at org.apache.felix.scr.impl.BundleComponentActivator.dispose(BundleComponentActivator.java:335)[43:org.apache.felix.scr:1.8.2]
	at org.apache.felix.scr.impl.Activator.disposeComponents(Activator.java:313)[43:org.apache.felix.scr:1.8.2]
	at org.apache.felix.scr.impl.Activator.access$300(Activator.java:45)[43:org.apache.felix.scr:1.8.2]
	at org.apache.felix.scr.impl.Activator$ScrExtension.destroy(Activator.java:198)[43:org.apache.felix.scr:1.8.2]
	at org.apache.felix.utils.extender.AbstractExtender$2.run(AbstractExtender.java:290)[43:org.apache.felix.scr:1.8.2]
	at java.util.concurrent.Executors$RunnableAdapter.call(Executors.java:471)[:1.7.0_25]
	at java.util.concurrent.FutureTask$Sync.innerRun(FutureTask.java:334)[:1.7.0_25]
	at java.util.concurrent.FutureTask.run(FutureTask.java:166)[:1.7.0_25]
	at org.apache.felix.utils.extender.AbstractExtender.destroyExtension(AbstractExtender.java:312)[43:org.apache.felix.scr:1.8.2]
	at org.apache.felix.utils.extender.AbstractExtender.bundleChanged(AbstractExtender.java:186)[43:org.apache.felix.scr:1.8.2]
	at org.apache.felix.framework.util.EventDispatcher.invokeBundleListenerCallback(EventDispatcher.java:868)[org.apache.felix.framework-4.2.1.jar:]
	at org.apache.felix.framework.util.EventDispatcher.fireEventImmediately(EventDispatcher.java:789)[org.apache.felix.framework-4.2.1.jar:]
	at org.apache.felix.framework.util.EventDispatcher.fireBundleEvent(EventDispatcher.java:514)[org.apache.felix.framework-4.2.1.jar:]
	at org.apache.felix.framework.Felix.fireBundleEvent(Felix.java:4403)[org.apache.felix.framework-4.2.1.jar:]
	at org.apache.felix.framework.Felix.stopBundle(Felix.java:2520)[org.apache.felix.framework-4.2.1.jar:]
	at org.apache.felix.framework.Felix.setActiveStartLevel(Felix.java:1309)[org.apache.felix.framework-4.2.1.jar:]
	at org.apache.felix.framework.FrameworkStartLevelImpl.run(FrameworkStartLevelImpl.java:304)[org.apache.felix.framework-4.2.1.jar:]
	at java.lang.Thread.run(Thread.java:724)[:1.7.0_25]
[org.ops4j.pax.exam.spi.PaxExamRuntime] : test container stopped
[org.ops4j.pax.exam.spi.PaxExamRuntime] : command = quit
[org.ops4j.pax.exam.spi.PaxExamRuntime] : quitting PaxExamRuntime

173960 [pool-1-thread-1 for channel] INFO org.ops4j.exec.DefaultJavaRunner - Platform has
been shutdown.
[INFO] 
[INFO] --- ianal-maven-plugin:1.0-alpha-1:verify-legal-files (default) @ org.apache.sling.launchpad.karaf-launchpad-jackrabbit-derby-integration-tests
---
[INFO] Checking legal files in: org.apache.sling.launchpad.karaf-launchpad-jackrabbit-derby-integration-tests-0.0.1-SNAPSHOT.jar
[INFO] Checking legal files in: org.apache.sling.launchpad.karaf-launchpad-jackrabbit-derby-integration-tests-0.0.1-SNAPSHOT-sources.jar
[INFO] 
[INFO] --- maven-bundle-plugin:2.5.3:baseline (baseline) @ org.apache.sling.launchpad.karaf-launchpad-jackrabbit-derby-integration-tests
---
[INFO] Unable to find a previous version of the project in the repository
[INFO] Not generating Baseline report as there is no previous version of the library to compare
against
[INFO] 
[INFO] --- apache-rat-plugin:0.11:check (default) @ org.apache.sling.launchpad.karaf-launchpad-jackrabbit-derby-integration-tests
---
[INFO] 51 implicit excludes (use -debug for more details).
[INFO] Exclude: src/main/appended-resources/META-INF/*
[INFO] Exclude: velocity.log
[INFO] Exclude: target/*
[INFO] Exclude: README.md
[INFO] Exclude: maven-eclipse.xml
[INFO] Exclude: .*
[INFO] Exclude: .*/**
[INFO] Exclude: **/*.json
[INFO] Exclude: DEPENDENCIES
[INFO] Exclude: **/*.rej
[INFO] 2 resources included (use -debug for more details)
[INFO] Rat check: Summary of files. Unapproved: 0 unknown: 0 generated: 0 approved: 2 licence.
[INFO] 
[INFO] --- maven-failsafe-plugin:2.18.1:verify (default) @ org.apache.sling.launchpad.karaf-launchpad-jackrabbit-derby-integration-tests
---
[INFO] Failsafe report directory: <https://builds.apache.org/job/sling-contrib-1.7/ws/trunk/launchpad/karaf/org.apache.sling.launchpad.karaf-launchpad-jackrabbit-derby-integration-tests/target/failsafe-reports>
[ERROR] There are test failures.

Please refer to <https://builds.apache.org/job/sling-contrib-1.7/ws/trunk/launchpad/karaf/org.apache.sling.launchpad.karaf-launchpad-jackrabbit-derby-integration-tests/target/failsafe-reports>
for the individual test results.
[JENKINS] Recording test results[INFO] 
[INFO] --- maven-install-plugin:2.5.2:install (default-install) @ org.apache.sling.launchpad.karaf-launchpad-jackrabbit-derby-integration-tests
---
[INFO] Installing <https://builds.apache.org/job/sling-contrib-1.7/ws/trunk/launchpad/karaf/org.apache.sling.launchpad.karaf-launchpad-jackrabbit-derby-integration-tests/target/org.apache.sling.launchpad.karaf-launchpad-jackrabbit-derby-integration-tests-0.0.1-SNAPSHOT.jar>
to /home/jenkins/jenkins-slave/maven-repositories/1/org/apache/sling/org.apache.sling.launchpad.karaf-launchpad-jackrabbit-derby-integration-tests/0.0.1-SNAPSHOT/org.apache.sling.launchpad.karaf-launchpad-jackrabbit-derby-integration-tests-0.0.1-SNAPSHOT.jar
[INFO] Installing <https://builds.apache.org/job/sling-contrib-1.7/ws/trunk/launchpad/karaf/org.apache.sling.launchpad.karaf-launchpad-jackrabbit-derby-integration-tests/pom.xml>
to /home/jenkins/jenkins-slave/maven-repositories/1/org/apache/sling/org.apache.sling.launchpad.karaf-launchpad-jackrabbit-derby-integration-tests/0.0.1-SNAPSHOT/org.apache.sling.launchpad.karaf-launchpad-jackrabbit-derby-integration-tests-0.0.1-SNAPSHOT.pom

[INFO] Installing <https://builds.apache.org/job/sling-contrib-1.7/ws/trunk/launchpad/karaf/org.apache.sling.launchpad.karaf-launchpad-jackrabbit-derby-integration-tests/target/org.apache.sling.launchpad.karaf-launchpad-jackrabbit-derby-integration-tests-0.0.1-SNAPSHOT-sources.jar>
to /home/jenkins/jenkins-slave/maven-repositories/1/org/apache/sling/org.apache.sling.launchpad.karaf-launchpad-jackrabbit-derby-integration-tests/0.0.1-SNAPSHOT/org.apache.sling.launchpad.karaf-launchpad-jackrabbit-derby-integration-tests-0.0.1-SNAPSHOT-sources.jar
[INFO] 
[INFO] --- maven-bundle-plugin:2.5.3:install (default-install) @ org.apache.sling.launchpad.karaf-launchpad-jackrabbit-derby-integration-tests
---
[INFO] Local OBR update disabled (enable with -DobrRepository)
[JENKINS] Archiving disabled
[INFO]                                                                         
[INFO] ------------------------------------------------------------------------
[INFO] Building Apache Sling Launchpad Karaf - Launchpad Oak Tar Integration Tests 0.0.1-SNAPSHOT
[INFO] ------------------------------------------------------------------------
Downloading: http://repository.apache.org/snapshots/org/apache/karaf/apache-karaf/4.0.1-SNAPSHOT/apache-karaf-4.0.1-SNAPSHOT.pom
[WARNING] The POM for org.apache.karaf:apache-karaf:tar.gz:4.0.1-SNAPSHOT is missing, no dependency
information available
Downloading: http://repository.apache.org/snapshots/org/apache/karaf/apache-karaf/4.0.1-SNAPSHOT/apache-karaf-4.0.1-SNAPSHOT.tar.gz
[JENKINS] Archiving disabled
[INFO] ------------------------------------------------------------------------
[INFO] Reactor Summary:
[INFO] 
[INFO] Apache Sling OpenID Authentication ................ SUCCESS [16.385s]
[INFO] Apache Sling Authentication XING API .............. SUCCESS [2.317s]
[INFO] Apache Sling Authentication XING Login ............ SUCCESS [3.877s]
[INFO] Apache Sling Authentication XING OAuth ............ SUCCESS [3.912s]
[INFO] Apache Sling Authentication Selector .............. SUCCESS [2.057s]
[INFO] Apache Sling Commons HTML Utilities ............... SUCCESS [2.052s]
[INFO] Apache Sling APT parser ........................... SUCCESS [3.173s]
[INFO] Apache Sling APT servlet .......................... SUCCESS [1.988s]
[INFO] Apache Sling Resource Collection API .............. SUCCESS [2.520s]
[INFO] Apache Sling DataSource Provider .................. SUCCESS [7.057s]
[INFO] Apache Sling Dojo JavaScript Library .............. SUCCESS [6.660s]
[INFO] Apache Sling Dojo Data Extension .................. SUCCESS [1.826s]
[INFO] Apache Sling FTP Server ........................... SUCCESS [2.834s]
[INFO] Apache Sling Google Web Toolkit Servlet Library ... SUCCESS [3.676s]
[INFO] Apache Sling Google Web Toolkit Sample ............ SUCCESS [27.520s]
[INFO] Apache Sling JMX Resource Provider ................ SUCCESS [2.402s]
[INFO] Apache Sling ClassLoader Leak Detector ............ SUCCESS [1.774s]
[INFO] Apache Sling MongoDB Resource Provider ............ SUCCESS [1.928s]
[INFO] Apache Sling OSGi Bundle Repository ............... SUCCESS [2.789s]
[INFO] Apache Sling Distribution API ..................... SUCCESS [1.883s]
[INFO] Apache Sling Distribution Core .................... SUCCESS [6.952s]
[INFO] Apache Sling Distribution Sample .................. SUCCESS [4.243s]
[INFO] Apache Sling Distribution Integration Tests ....... SUCCESS [2:54.294s]
[INFO] S3 dependencies for Oak ........................... SUCCESS [6.432s]
[INFO] Apache Sling Request Processing Analyzer .......... SUCCESS [2.079s]
[INFO] Apache Sling Resource Merger ...................... SUCCESS [3.065s]
[INFO] Apache Sling Inventory Printer Based on Resources . SUCCESS [1.999s]
[INFO] Apache Sling Rewriter ............................. SUCCESS [3.692s]
[INFO] Apache Sling Security ............................. SUCCESS [2.836s]
[INFO] Apache Sling SLF4J MDC Filter ..................... SUCCESS [8.254s]
[INFO] Apache Sling Query ................................ SUCCESS [4.015s]
[INFO] Apache Sling Superimposing Resource Provider ...... SUCCESS [3.206s]
[INFO] Apache Sling Tenant ............................... SUCCESS [2.461s]
[INFO] Apache Sling URL Rewriter ......................... SUCCESS [2.021s]
[INFO] Apache Sling JCR Java Compiler .................... SUCCESS [2.868s]
[INFO] Apache Sling Repository Accessor .................. SUCCESS [2.105s]
[INFO] Apache Sling Object Content Mapping ............... SUCCESS [3.550s]
[INFO] Apache Sling JCR Prefs ............................ SUCCESS [1.876s]
[INFO] Apache Sling JCR Resource Security ................ SUCCESS [1.842s]
[INFO] Apache Sling Script Console ....................... SUCCESS [2.098s]
[INFO] Apache Sling Atom Tag Library ..................... SUCCESS [2.303s]
[INFO] Apache Sling Scripting Freemarker Support ......... SUCCESS [8.662s]
[INFO] Apache Sling Scripting Groovy Support ............. SUCCESS [2.258s]
[INFO] Apache Sling Scripting Java Support ............... SUCCESS [3.338s]
[INFO] Apache Sling Scripting JST Support ................ SUCCESS [5.414s]
[INFO] Apache Sling Scripting Python Support ............. SUCCESS [5.394s]
[INFO] Apache Sling Scripting Ruby Support ............... SUCCESS [7.790s]
[INFO] Scala Script Engine ............................... SUCCESS [47.812s]
[INFO] Apache Sling Scala Scripting Configuration ........ SUCCESS [2.820s]
[INFO] Scala for Sling Demo Application - Hello World .... SUCCESS [1.795s]
[INFO] Scala for Sling Demo Application - Forum .......... SUCCESS [1.755s]
[INFO] Apache Sling Scripting Thymeleaf .................. SUCCESS [7.640s]
[INFO] Apache Sling Scripting Velocity Support ........... SUCCESS [2.498s]
[INFO] Apache Sling Scripting W3C XML Processing Support . SUCCESS [3.060s]
[INFO] Apache Sling NoSQL Generic Resource Provider ...... SUCCESS [4.482s]
[INFO] Apache Sling NoSQL Couchbase Client ............... SUCCESS [3.539s]
[INFO] Apache Sling NoSQL Couchbase Resource Provider .... SUCCESS [3.189s]
[INFO] Apache Sling Launchpad Contrib Testing ............ SUCCESS [52.790s]
[INFO] Apache Sling Launchpad Karaf ...................... SUCCESS [2.250s]
[INFO] Apache Sling Launchpad Karaf - Features ........... SUCCESS [2.816s]
[INFO] Apache Sling Launchpad Karaf - Integration Tests .. SUCCESS [37:15.119s]
[INFO] Apache Sling Launchpad Karaf - Launchpad Jackrabbit Derby Integration Tests  SUCCESS
[2:57.882s]
[INFO] Apache Sling Launchpad Karaf - Launchpad Oak Tar Integration Tests  FAILURE [0.193s]
[INFO] Apache Sling Launchpad Karaf Builder .............. SKIPPED
[INFO] Apache Sling Contrib (Builder) .................... SKIPPED
[INFO] ------------------------------------------------------------------------
[INFO] BUILD FAILURE
[INFO] ------------------------------------------------------------------------
[INFO] Total time: 49:15.172s
[INFO] Finished at: Tue Jul 07 10:08:27 UTC 2015
[INFO] Final Memory: 125M/352M
[INFO] ------------------------------------------------------------------------
[JENKINS] Archiving disabled
[JENKINS] Archiving disabled
[JENKINS] Archiving disabled
[JENKINS] Archiving disabled
[JENKINS] Archiving disabled
[JENKINS] Archiving disabled
[JENKINS] Archiving disabled
[JENKINS] Archiving disabled
[JENKINS] Archiving disabled
[JENKINS] Archiving disabled
[JENKINS] Archiving disabled
[JENKINS] Archiving disabled
[JENKINS] Archiving disabled
[JENKINS] Archiving disabled
[JENKINS] Archiving disabled
[JENKINS] Archiving disabled
[JENKINS] Archiving disabled
[JENKINS] Archiving disabled
[JENKINS] Archiving disabled
[JENKINS] Archiving disabled
[JENKINS] Archiving disabled
[JENKINS] Archiving disabled
[JENKINS] Archiving disabled
[JENKINS] Archiving disabled
[JENKINS] Archiving disabled
[JENKINS] Archiving disabled
[JENKINS] Archiving disabled
[JENKINS] Archiving disabled
[JENKINS] Archiving disabled
[JENKINS] Archiving disabled
[JENKINS] Archiving disabled
[JENKINS] Archiving disabled
[JENKINS] Archiving disabled
[JENKINS] Archiving disabled
[JENKINS] Archiving disabled
[JENKINS] Archiving disabled
[JENKINS] Archiving disabled
[JENKINS] Archiving disabled
[JENKINS] Archiving disabled
[JENKINS] Archiving disabled
[JENKINS] Archiving disabled
[JENKINS] Archiving disabled
[JENKINS] Archiving disabled
[JENKINS] Archiving disabled
[JENKINS] Archiving disabled
[JENKINS] Archiving disabled
[JENKINS] Archiving disabled
[JENKINS] Archiving disabled
[JENKINS] Archiving disabled
[JENKINS] Archiving disabled
[JENKINS] Archiving disabled
[JENKINS] Archiving disabled
[JENKINS] Archiving disabled
[JENKINS] Archiving disabled
[JENKINS] Archiving disabled
[JENKINS] Archiving disabled
[JENKINS] Archiving disabled
[JENKINS] Archiving disabled
[JENKINS] Archiving disabled
[JENKINS] Archiving disabled
[JENKINS] Archiving disabled
[JENKINS] Archiving disabled
[JENKINS] Archiving disabled
[JENKINS] Archiving disabled
[JENKINS] Archiving disabled
Waiting for Jenkins to finish collecting data
[ERROR] Failed to execute goal on project org.apache.sling.launchpad.karaf-launchpad-oak-tar-integration-tests:
Could not resolve dependencies for project org.apache.sling:org.apache.sling.launchpad.karaf-launchpad-oak-tar-integration-tests:bundle:0.0.1-SNAPSHOT:
Could not find artifact org.apache.karaf:apache-karaf:tar.gz:4.0.1-SNAPSHOT in Nexus (http://repository.apache.org/snapshots)
-> [Help 1]
[ERROR] 
[ERROR] To see the full stack trace of the errors, re-run Maven with the -e switch.
[ERROR] Re-run Maven using the -X switch to enable full debug logging.
[ERROR] 
[ERROR] For more information about the errors and possible solutions, please read the following
articles:
[ERROR] [Help 1] http://cwiki.apache.org/confluence/display/MAVEN/DependencyResolutionException
[ERROR] 
[ERROR] After correcting the problems, you can resume the build with the command
[ERROR]   mvn <goals> -rf :org.apache.sling.launchpad.karaf-launchpad-oak-tar-integration-tests
channel stopped

Mime
View raw message