sling-commits mailing list archives

Site index · List index
Message view « Date » · « Thread »
Top « Date » · « Thread »
From Apache Jenkins Server <jenk...@builds.apache.org>
Subject Build failed in Jenkins: sling-contrib-1.7 #211
Date Mon, 29 Jun 2015 10:17:43 GMT
See <https://builds.apache.org/job/sling-contrib-1.7/211/>

------------------------------------------
[...truncated 4655 lines...]
org.ops4j.pax.logging.pax-logging-api[org.ops4j.pax.exam.raw.extender.intern.TestBundleObserver]
: Unregistered testcase [org.ops4j.pax.exam.raw.extender.intern.Probe@19342e7.]
org.ops4j.pax.logging.pax-logging-api[org.ops4j.pax.swissbox.extender.BundleWatcher] : Releasing
bundle [org.ops4j.pax.exam.extender.service]
org.ops4j.pax.logging.pax-logging-api[org.ops4j.pax.swissbox.extender.BundleWatcher] : Releasing
bundle [org.apache.felix.framework]
org.ops4j.pax.logging.pax-logging-api[org.ops4j.pax.swissbox.extender.BundleWatcher] : Releasing
bundle [org.ops4j.pax.exam.inject]

2722 [main] INFO org.ops4j.exec.DefaultJavaRunner - Platform has been shutdown.
2723 [main] INFO org.ops4j.pax.exam.spi.reactors.ReactorManager - suite finished
Tests run: 1, Failures: 0, Errors: 0, Skipped: 0, Time elapsed: 2.558 sec - in org.apache.sling.datasource.DataSourceIT

Results :

Tests run: 1, Failures: 0, Errors: 0, Skipped: 0

[JENKINS] Recording test results
[INFO] 
[INFO] --- ianal-maven-plugin:1.0-alpha-1:verify-legal-files (default) @ org.apache.sling.datasource
---
[INFO] Checking legal files in: org.apache.sling.datasource-1.0.1-SNAPSHOT.jar
[INFO] Checking legal files in: org.apache.sling.datasource-1.0.1-SNAPSHOT-sources.jar
[INFO] 
[INFO] --- apache-rat-plugin:0.11:check (default) @ org.apache.sling.datasource ---
[INFO] 51 implicit excludes (use -debug for more details).
[INFO] Exclude: src/main/appended-resources/META-INF/*
[INFO] Exclude: velocity.log
[INFO] Exclude: target/*
[INFO] Exclude: README.md
[INFO] Exclude: **/*.json
[INFO] 10 resources included (use -debug for more details)
[INFO] Rat check: Summary of files. Unapproved: 0 unknown: 0 generated: 0 approved: 10 licence.
[INFO] 
[INFO] --- maven-bundle-plugin:2.5.3:baseline (baseline) @ org.apache.sling.datasource ---
[INFO] artifact org.apache.sling:org.apache.sling.datasource: checking for updates from Nexus
[INFO] artifact org.apache.sling:org.apache.sling.datasource: checking for updates from central
[INFO] Baseline Report - Generated by Apache Felix Maven Bundle Plugin on 2015-06-29T10:15Z
based on Bnd - see http://www.aqute.biz/Bnd/Bnd
[INFO] Comparing bundle org.apache.sling.datasource version 1.0.1-SNAPSHOT to version (,1.0.1-SNAPSHOT)
[INFO] 
[INFO]   PACKAGE_NAME                                       DELTA      CUR_VER    BASE_VER
  REC_VER    WARNINGS  
[INFO] = ================================================== ========== ========== ==========
========== ==========
[INFO] Baseline analysis complete, 0 error(s), 0 warning(s)
[INFO] 
[INFO] --- maven-failsafe-plugin:2.18.1:verify (default) @ org.apache.sling.datasource ---
[INFO] Failsafe report directory: <https://builds.apache.org/job/sling-contrib-1.7/ws/trunk/extensions/datasource/target/failsafe-reports>
[JENKINS] Recording test results[INFO] 
[INFO] --- maven-install-plugin:2.5.2:install (default-install) @ org.apache.sling.datasource
---
[INFO] Installing <https://builds.apache.org/job/sling-contrib-1.7/ws/trunk/extensions/datasource/target/org.apache.sling.datasource-1.0.1-SNAPSHOT.jar>
to /home/jenkins/jenkins-slave/maven-repositories/1/org/apache/sling/org.apache.sling.datasource/1.0.1-SNAPSHOT/org.apache.sling.datasource-1.0.1-SNAPSHOT.jar
[INFO] Installing <https://builds.apache.org/job/sling-contrib-1.7/ws/trunk/extensions/datasource/pom.xml>
to /home/jenkins/jenkins-slave/maven-repositories/1/org/apache/sling/org.apache.sling.datasource/1.0.1-SNAPSHOT/org.apache.sling.datasource-1.0.1-SNAPSHOT.pom

[INFO] Installing <https://builds.apache.org/job/sling-contrib-1.7/ws/trunk/extensions/datasource/target/org.apache.sling.datasource-1.0.1-SNAPSHOT-sources.jar>
to /home/jenkins/jenkins-slave/maven-repositories/1/org/apache/sling/org.apache.sling.datasource/1.0.1-SNAPSHOT/org.apache.sling.datasource-1.0.1-SNAPSHOT-sources.jar
[INFO] 
[INFO] --- maven-bundle-plugin:2.5.3:install (default-install) @ org.apache.sling.datasource
---
[INFO] Local OBR update disabled (enable with -DobrRepository)
[JENKINS] Archiving disabled
[INFO]                                                                         
[INFO] ------------------------------------------------------------------------
[INFO] Building Apache Sling Dojo JavaScript Library 1.1.0.002-SNAPSHOT
[INFO] ------------------------------------------------------------------------
[INFO] 
[INFO] --- maven-clean-plugin:2.5:clean (default-clean) @ org.apache.sling.extensions.dojo
---
[INFO] 
[INFO] --- maven-enforcer-plugin:1.3.1:enforce (enforce-java) @ org.apache.sling.extensions.dojo
---
[INFO] 
[INFO] --- maven-antrun-plugin:1.8:run (set-bundle-required-execution-environment) @ org.apache.sling.extensions.dojo
---
[INFO] Executing tasks

main:
[INFO] Executed tasks
[INFO] 
[INFO] --- maven-remote-resources-plugin:1.5:process (default) @ org.apache.sling.extensions.dojo
---
[INFO] 
[INFO] --- maven-resources-plugin:2.7:resources (default-resources) @ org.apache.sling.extensions.dojo
---
[INFO] Using 'UTF-8' encoding to copy filtered resources.
[INFO] Copying 4 resources
[INFO] Copying 3 resources
[INFO] 
[INFO] --- maven-antrun-plugin:1.8:run (check-memory-task) @ org.apache.sling.extensions.dojo
---
[INFO] Executing tasks

main:
     [echo] **************** WARNING (SLING-443/SLING-1782) ******************************
     [echo] On most platforms, you'll get OutOfMemoryErrors when building unless you set
     [echo] on 32bit platforms: MAVEN_OPTS="-Xmx256M -XX:MaxPermSize=256M", see SLING-443
     [echo] on 64bit platforms: MAVEN_OPTS="-Xmx512M -XX:MaxPermSize=512M", see SLING-1782
     [echo] ******************************************************************************
[INFO] Executed tasks
[INFO] 
[INFO] --- maven-antrun-plugin:1.8:run (download-dojo) @ org.apache.sling.extensions.dojo
---
[WARNING] Parameter tasks is deprecated, use target instead
[INFO] Executing tasks

main:
    [mkdir] Created dir: <https://builds.apache.org/job/sling-contrib-1.7/ws/trunk/extensions/dojo/download-cache>
    [mkdir] Created dir: <https://builds.apache.org/job/sling-contrib-1.7/ws/trunk/extensions/dojo/target/dojo>
      [get] Getting: http://download.dojotoolkit.org/release-1.1.1/dojo-release-1.1.1-src.tar.gz
      [get] To: <https://builds.apache.org/job/sling-contrib-1.7/ws/trunk/extensions/dojo/download-cache/dojo-release-1.1.1-src.tar.gz>
      [get] Error getting http://download.dojotoolkit.org/release-1.1.1/dojo-release-1.1.1-src.tar.gz
to <https://builds.apache.org/job/sling-contrib-1.7/ws/trunk/extensions/dojo/download-cache/dojo-release-1.1.1-src.tar.gz>
[JENKINS] Archiving disabled
[INFO] ------------------------------------------------------------------------
[INFO] Reactor Summary:
[INFO] 
[INFO] Apache Sling OpenID Authentication ................ SUCCESS [19.803s]
[INFO] Apache Sling Authentication XING API .............. SUCCESS [6.464s]
[INFO] Apache Sling Authentication XING Login ............ SUCCESS [5.065s]
[INFO] Apache Sling Authentication XING OAuth ............ SUCCESS [4.909s]
[INFO] Apache Sling Authentication Selector .............. SUCCESS [4.671s]
[INFO] Apache Sling Commons HTML Utilities ............... SUCCESS [3.907s]
[INFO] Apache Sling APT parser ........................... SUCCESS [4.730s]
[INFO] Apache Sling APT servlet .......................... SUCCESS [3.300s]
[INFO] Apache Sling Resource Collection API .............. SUCCESS [7.473s]
[INFO] Apache Sling DataSource Provider .................. SUCCESS [8.184s]
[INFO] Apache Sling Dojo JavaScript Library .............. FAILURE [2:07.886s]
[INFO] Apache Sling Dojo Data Extension .................. SKIPPED
[INFO] Apache Sling FTP Server ........................... SKIPPED
[INFO] Apache Sling Google Web Toolkit Servlet Library ... SKIPPED
[INFO] Apache Sling Google Web Toolkit Sample ............ SKIPPED
[INFO] Apache Sling JMX Resource Provider ................ SKIPPED
[INFO] Apache Sling ClassLoader Leak Detector ............ SKIPPED
[INFO] Apache Sling MongoDB Resource Provider ............ SKIPPED
[INFO] Apache Sling OSGi Bundle Repository ............... SKIPPED
[INFO] Apache Sling Distribution API ..................... SKIPPED
[INFO] Apache Sling Distribution Core .................... SKIPPED
[INFO] Apache Sling Distribution Sample .................. SKIPPED
[INFO] Apache Sling Distribution Integration Tests ....... SKIPPED
[INFO] S3 dependencies for Oak ........................... SKIPPED
[INFO] Apache Sling Request Processing Analyzer .......... SKIPPED
[INFO] Apache Sling Resource Merger ...................... SKIPPED
[INFO] Apache Sling Inventory Printer Based on Resources . SKIPPED
[INFO] Apache Sling Rewriter ............................. SKIPPED
[INFO] Apache Sling Security ............................. SKIPPED
[INFO] Apache Sling SLF4J MDC Filter ..................... SKIPPED
[INFO] Apache Sling Query ................................ SKIPPED
[INFO] Apache Sling Superimposing Resource Provider ...... SKIPPED
[INFO] Apache Sling Tenant ............................... SKIPPED
[INFO] Apache Sling URL Rewriter ......................... SKIPPED
[INFO] Apache Sling JCR Java Compiler .................... SKIPPED
[INFO] Apache Sling Repository Accessor .................. SKIPPED
[INFO] Apache Sling Object Content Mapping ............... SKIPPED
[INFO] Apache Sling JCR Prefs ............................ SKIPPED
[INFO] Apache Sling JCR Resource Security ................ SKIPPED
[INFO] Apache Sling Script Console ....................... SKIPPED
[INFO] Apache Sling Atom Tag Library ..................... SKIPPED
[INFO] Apache Sling Scripting Freemarker Support ......... SKIPPED
[INFO] Apache Sling Scripting Groovy Support ............. SKIPPED
[INFO] Apache Sling Scripting Java Support ............... SKIPPED
[INFO] Apache Sling Scripting JST Support ................ SKIPPED
[INFO] Apache Sling Scripting Python Support ............. SKIPPED
[INFO] Apache Sling Scripting Ruby Support ............... SKIPPED
[INFO] Scala Script Engine ............................... SKIPPED
[INFO] Apache Sling Scala Scripting Configuration ........ SKIPPED
[INFO] Scala for Sling Demo Application - Hello World .... SKIPPED
[INFO] Scala for Sling Demo Application - Forum .......... SKIPPED
[INFO] Apache Sling Scripting Thymeleaf .................. SKIPPED
[INFO] Apache Sling Scripting Velocity Support ........... SKIPPED
[INFO] Apache Sling Scripting W3C XML Processing Support . SKIPPED
[INFO] Apache Sling NoSQL Generic Resource Provider ...... SKIPPED
[INFO] Apache Sling NoSQL Couchbase Client ............... SKIPPED
[INFO] Apache Sling NoSQL Couchbase Resource Provider .... SKIPPED
[INFO] Apache Sling Launchpad Contrib Testing ............ SKIPPED
[INFO] Apache Sling Launchpad Karaf ...................... SKIPPED
[INFO] Apache Sling Launchpad Karaf - Features ........... SKIPPED
[INFO] Apache Sling Launchpad Karaf - Integration Tests .. SKIPPED
[INFO] Apache Sling Launchpad Karaf - Launchpad Jackrabbit Derby Integration Tests  SKIPPED
[INFO] Apache Sling Launchpad Karaf - Launchpad Oak Tar Integration Tests  SKIPPED
[INFO] Apache Sling Launchpad Karaf Builder .............. SKIPPED
[INFO] Apache Sling Contrib (Builder) .................... SKIPPED
[INFO] ------------------------------------------------------------------------
[INFO] BUILD FAILURE
[INFO] ------------------------------------------------------------------------
[INFO] Total time: 3:25.348s
[INFO] Finished at: Mon Jun 29 10:17:29 UTC 2015
[INFO] Final Memory: 56M/233M
[INFO] ------------------------------------------------------------------------
[JENKINS] Archiving disabled
[JENKINS] Archiving disabled
[JENKINS] Archiving disabled
[JENKINS] Archiving disabled
[JENKINS] Archiving disabled
[JENKINS] Archiving disabled
[JENKINS] Archiving disabled
[JENKINS] Archiving disabled
[JENKINS] Archiving disabled
[JENKINS] Archiving disabled
[JENKINS] Archiving disabled
[JENKINS] Archiving disabled
[JENKINS] Archiving disabled
[JENKINS] Archiving disabled
[JENKINS] Archiving disabled
[JENKINS] Archiving disabled
[JENKINS] Archiving disabled
[JENKINS] Archiving disabled
[JENKINS] Archiving disabled
[JENKINS] Archiving disabled
[JENKINS] Archiving disabled
[JENKINS] Archiving disabled
[JENKINS] Archiving disabled
[JENKINS] Archiving disabled
[JENKINS] Archiving disabled
[JENKINS] Archiving disabled
[JENKINS] Archiving disabled
[JENKINS] Archiving disabled
[JENKINS] Archiving disabled
[JENKINS] Archiving disabled
[JENKINS] Archiving disabled
[JENKINS] Archiving disabled
[JENKINS] Archiving disabled
[JENKINS] Archiving disabled
[JENKINS] Archiving disabled
[JENKINS] Archiving disabled
[JENKINS] Archiving disabled
[JENKINS] Archiving disabled
[JENKINS] Archiving disabled
[JENKINS] Archiving disabled
[JENKINS] Archiving disabled
[JENKINS] Archiving disabled
[JENKINS] Archiving disabled
[JENKINS] Archiving disabled
[JENKINS] Archiving disabled
[JENKINS] Archiving disabled
[JENKINS] Archiving disabled
[JENKINS] Archiving disabled
[JENKINS] Archiving disabled
[JENKINS] Archiving disabled
[JENKINS] Archiving disabled
[JENKINS] Archiving disabled
[JENKINS] Archiving disabled
[JENKINS] Archiving disabled
[JENKINS] Archiving disabled
[JENKINS] Archiving disabled
[JENKINS] Archiving disabled
[JENKINS] Archiving disabled
[JENKINS] Archiving disabled
[JENKINS] Archiving disabled
[JENKINS] Archiving disabled
[JENKINS] Archiving disabled
[JENKINS] Archiving disabled
[JENKINS] Archiving disabled
[JENKINS] Archiving disabled
Waiting for Jenkins to finish collecting data[ERROR] Failed to execute goal org.apache.maven.plugins:maven-antrun-plugin:1.8:run
(download-dojo) on project org.apache.sling.extensions.dojo: An Ant BuildException has occured:
java.net.ConnectException: Connection timed out
[ERROR] around Ant part ...<get dest="./download-cache/dojo-release-1.1.1-src.tar.gz" src="http://download.dojotoolkit.org/release-1.1.1/dojo-release-1.1.1-src.tar.gz"
usetimestamp="true"/>... @ 19:165 in <https://builds.apache.org/job/sling-contrib-1.7/ws/trunk/extensions/dojo/target/antrun/build-main.xml>
[ERROR] -> [Help 1]
[ERROR] 
[ERROR] To see the full stack trace of the errors, re-run Maven with the -e switch.
[ERROR] Re-run Maven using the -X switch to enable full debug logging.
[ERROR] 
[ERROR] For more information about the errors and possible solutions, please read the following
articles:
[ERROR] [Help 1] http://cwiki.apache.org/confluence/display/MAVEN/MojoExecutionException
[ERROR] 
[ERROR] After correcting the problems, you can resume the build with the command
[ERROR]   mvn <goals> -rf :org.apache.sling.extensions.dojo

channel stopped

Mime
View raw message