sling-commits mailing list archives

Site index · List index
Message view « Date » · « Thread »
Top « Date » · « Thread »
From Apache Jenkins Server <jenk...@builds.apache.org>
Subject Build failed in Jenkins: sling-trunk-1.7 #1974
Date Fri, 26 Jun 2015 09:08:12 GMT
See <https://builds.apache.org/job/sling-trunk-1.7/1974/changes>

Changes:

[asanso] [maven-release-plugin] prepare for next development iteration

[asanso] [maven-release-plugin] prepare release org.apache.sling.featureflags-1.0.2

[asanso] SLING-4836 - Escape output in Apache Sling Feature Flags webconsole plugin 
* applied patch from  Alexandre Collignon (Thanks!)

------------------------------------------
[...truncated 319602 lines...]
[INFO] Apache Sling Discovery Support Bundle ............. SUCCESS [11.019s]
[INFO] Apache Sling Discovery Standalone Implementation .. SUCCESS [11.159s]
[INFO] Apache Sling Event Support ........................ SUCCESS [12:18.577s]
[INFO] Apache Sling Feature Flags ........................ SUCCESS [14.296s]
[INFO] Apache Sling Filesystem Resource Provider ......... SUCCESS [12.746s]
[INFO] Apache Sling javax.activation bundle .............. SUCCESS [23.632s]
[INFO] Apache Sling Service User Mapper .................. SUCCESS [15.118s]
[INFO] Apache Sling Settings ............................. SUCCESS [19.110s]
[INFO] Apache Sling Web Console Branding ................. SUCCESS [14.316s]
[INFO] Apache Sling Web Console Security Provider ........ SUCCESS [16.739s]
[INFO] Apache Sling Explorer ............................. SUCCESS [12.376s]
[INFO] Apache Sling Health Check Core .................... SUCCESS [18.642s]
[INFO] Apache Sling Health Check Annotations ............. SUCCESS [11.444s]
[INFO] Apache Sling Health Check Samples ................. SUCCESS [20.925s]
[INFO] Apache Sling Health Check Support Components ...... SUCCESS [11.930s]
[INFO] Apache Sling Health Check Webconsole Plugin ....... SUCCESS [11.918s]
[INFO] Apache Sling Health Check JUnit Bridge ............ SUCCESS [12.256s]
[INFO] Apache Sling Health Check Integration Tests ....... SUCCESS [34.964s]
[INFO] Apache Sling Health Check Reactor POM ............. SUCCESS [7.356s]
[INFO] Apache Sling Resource Access Security ............. SUCCESS [16.463s]
[INFO] Apache Sling Resource Access Security Integration Tests  SUCCESS [5:23.991s]
[INFO] Apache Sling Validation Framework API ............. SUCCESS [11.525s]
[INFO] Apache Sling Validation Framework Core Implementation  SUCCESS [18.931s]
[INFO] Apache Sling Validation Framework Testing Services  SUCCESS [11.871s]
[INFO] Apache Sling Validation Framework Integration Tests  SUCCESS [1:13.798s]
[INFO] Apache Sling Validation Framework Examples ........ SUCCESS [11.076s]
[INFO] Apache Sling Validation Framework Builder ......... SUCCESS [8.107s]
[INFO] Apache Sling Models API ........................... SUCCESS [10.987s]
[INFO] Apache Sling Models Implementation ................ SUCCESS [16.743s]
[INFO] Apache Sling Models Validation Implementation ..... SUCCESS [13.435s]
[INFO] Apache Sling Models Integration Tests ............. FAILURE [1:05.197s]
[INFO] Apache Sling Test Tools ........................... SKIPPED
[INFO] Apache Sling JUnit Core ........................... SKIPPED
[INFO] Apache Sling JUnit Scriptable Tests Provider ...... SKIPPED
[INFO] Apache Sling JUnit Health Checks .................. SKIPPED
[INFO] Apache Sling JUnit Remote Tests Runners ........... SKIPPED
[INFO] Apache Sling JUnit Performance .................... SKIPPED
[INFO] Apache Sling Testing Mock Log Configuration ....... SKIPPED
[INFO] Apache Sling Testing Resource Resolver Mock ....... SKIPPED
[INFO] Apache Sling Testing Sling Mock Jackrabbit-based Resource Resolver  SKIPPED
[INFO] Apache Sling Sample Server-Side Tests ............. SKIPPED
[INFO] Apache Sling Failing Server-Side Tests ............ SKIPPED
[INFO] Apache Sling Sample Integration Tests ............. SKIPPED
[INFO] Apache Sling Testing Modules Reactor .............. SKIPPED
[INFO] Apache Sling Installer ............................ SKIPPED
[INFO] Apache Sling Installer WebConsole Plugin .......... SKIPPED
[INFO] Apache Sling File Installer ....................... SKIPPED
[INFO] Apache Sling JCR Installer ........................ SKIPPED
[INFO] Apache Sling Installer Configuration Admin Support  SKIPPED
[INFO] Apache Sling Deployment Package Installer ......... SKIPPED
[INFO] Apache Sling Subsystems Installer ................. SKIPPED
[INFO] Apache Sling Installer Integration Tests .......... SKIPPED
[INFO] Apache Sling Launchpad API ........................ SKIPPED
[INFO] Apache Sling Launchpad Base ....................... SKIPPED
[INFO] Apache Sling Launchpad Installer .................. SKIPPED
[INFO] Apache Sling Launchpad Content .................... SKIPPED
[INFO] Apache Sling Launchpad Testing Services ........... SKIPPED
[INFO] Apache Sling Launchpad Testing Services WAR ....... SKIPPED
[INFO] Apache Sling Launchpad Testing Fragment Bundle .... SKIPPED
[INFO] Apache Sling Launchpad Test Bundles ............... SKIPPED
[INFO] Apache Sling Integration Tests .................... SKIPPED
[INFO] Apache Sling Launchpad Testing .................... SKIPPED
[INFO] Apache Sling (Builder) ............................ SKIPPED
[INFO] ------------------------------------------------------------------------
[INFO] BUILD FAILURE
[INFO] ------------------------------------------------------------------------
[INFO] Total time: 1:17:33.435s
[INFO] Finished at: Fri Jun 26 09:06:54 UTC 2015
[INFO] Final Memory: 175M/391M
[INFO] ------------------------------------------------------------------------
[JENKINS] Archiving disabled
[JENKINS] Archiving disabled
[JENKINS] Archiving disabled
[JENKINS] Archiving disabled
[JENKINS] Archiving disabled
[JENKINS] Archiving disabled
[JENKINS] Archiving disabled
[JENKINS] Archiving disabled
[JENKINS] Archiving disabled
[JENKINS] Archiving disabled
[JENKINS] Archiving disabled
[JENKINS] Archiving disabled
[JENKINS] Archiving disabled
[JENKINS] Archiving disabled
[JENKINS] Archiving disabled
[JENKINS] Archiving disabled
[JENKINS] Archiving disabled
[JENKINS] Archiving disabled
[JENKINS] Archiving disabled
[JENKINS] Archiving disabled
[JENKINS] Archiving disabled
[JENKINS] Archiving disabled
[JENKINS] Archiving disabled
[JENKINS] Archiving disabled
[JENKINS] Archiving disabled
[JENKINS] Archiving disabled
[JENKINS] Archiving disabled
[JENKINS] Archiving disabled
[JENKINS] Archiving disabled
[JENKINS] Archiving disabled
[JENKINS] Archiving disabled
[JENKINS] Archiving disabled
[JENKINS] Archiving disabled
[JENKINS] Archiving disabled
[JENKINS] Archiving disabled
[JENKINS] Archiving disabled
[JENKINS] Archiving disabled
[JENKINS] Archiving disabled
[JENKINS] Archiving disabled
[JENKINS] Archiving disabled
[JENKINS] Archiving disabled
[JENKINS] Archiving disabled
[JENKINS] Archiving disabled
[JENKINS] Archiving disabled
[JENKINS] Archiving disabled
[JENKINS] Archiving disabled
[JENKINS] Archiving disabled
[JENKINS] Archiving disabled
[JENKINS] Archiving disabled
[JENKINS] Archiving disabled
[JENKINS] Archiving disabled
[JENKINS] Archiving disabled
[JENKINS] Archiving disabled
[JENKINS] Archiving disabled
[JENKINS] Archiving disabled
[JENKINS] Archiving disabled
[JENKINS] Archiving disabled
[JENKINS] Archiving disabled
[JENKINS] Archiving disabled
[JENKINS] Archiving disabled
[JENKINS] Archiving disabled
[JENKINS] Archiving disabled
[JENKINS] Archiving disabled
[JENKINS] Archiving disabled
[JENKINS] Archiving disabled
[JENKINS] Archiving disabled
[JENKINS] Archiving disabled
[JENKINS] Archiving disabled
[JENKINS] Archiving disabled
[JENKINS] Archiving disabled
[JENKINS] Archiving disabled
[JENKINS] Archiving disabled
[JENKINS] Archiving disabled
[JENKINS] Archiving disabled
[JENKINS] Archiving disabled
[JENKINS] Archiving disabled
[JENKINS] Archiving disabled
[JENKINS] Archiving disabled
[JENKINS] Archiving disabled
[JENKINS] Archiving disabled
[JENKINS] Archiving disabled
[JENKINS] Archiving disabled
[JENKINS] Archiving disabled
[JENKINS] Archiving disabled
[JENKINS] Archiving disabled
[JENKINS] Archiving disabled
[JENKINS] Archiving disabled
[JENKINS] Archiving disabled
[JENKINS] Archiving disabled
[JENKINS] Archiving disabled
[JENKINS] Archiving disabled
[JENKINS] Archiving disabled
[JENKINS] Archiving disabled
[JENKINS] Archiving disabled
[JENKINS] Archiving disabled
[JENKINS] Archiving disabled
[JENKINS] Archiving disabled
[JENKINS] Archiving disabled
[JENKINS] Archiving disabled
[JENKINS] Archiving disabled
[JENKINS] Archiving disabled
[JENKINS] Archiving disabled
[JENKINS] Archiving disabled
[JENKINS] Archiving disabled
[JENKINS] Archiving disabled
[JENKINS] Archiving disabled
[JENKINS] Archiving disabled
[JENKINS] Archiving disabled
[JENKINS] Archiving disabled
[JENKINS] Archiving disabled
[JENKINS] Archiving disabled
[JENKINS] Archiving disabled
[JENKINS] Archiving disabled
[JENKINS] Archiving disabled
[JENKINS] Archiving disabled
[JENKINS] Archiving disabled
[JENKINS] Archiving disabled
[JENKINS] Archiving disabled
[JENKINS] Archiving disabled
[JENKINS] Archiving disabled
[JENKINS] Archiving disabled
[JENKINS] Archiving disabled
[JENKINS] Archiving disabled
[JENKINS] Archiving disabled
[JENKINS] Archiving disabled
[JENKINS] Archiving disabled
[JENKINS] Archiving disabled
[JENKINS] Archiving disabled
[JENKINS] Archiving disabled
[JENKINS] Archiving disabled
[JENKINS] Archiving disabled
[JENKINS] Archiving disabled
[JENKINS] Archiving disabled
[JENKINS] Archiving disabled
[JENKINS] Archiving disabled
[JENKINS] Archiving disabled
[JENKINS] Archiving disabled
[JENKINS] Archiving disabled
[JENKINS] Archiving disabled
[JENKINS] Archiving disabled
[JENKINS] Archiving disabled
[JENKINS] Archiving disabled
[JENKINS] Archiving disabled
[JENKINS] Archiving disabled
[JENKINS] Archiving disabled
[JENKINS] Archiving disabled
[JENKINS] Archiving disabled
Waiting for Jenkins to finish collecting data
[ERROR] Failed to execute goal org.apache.maven.plugins:maven-failsafe-plugin:2.18.1:integration-test
(integration-test) on project org.apache.sling.models.integration-tests: Execution integration-test
of goal org.apache.maven.plugins:maven-failsafe-plugin:2.18.1:integration-test failed: There
was an error in the forked process
[ERROR] java.lang.AssertionError: Server not ready after 60 seconds, giving up
[ERROR] at org.junit.Assert.fail(Assert.java:88)
[ERROR] at org.apache.sling.testing.tools.sling.SlingTestBase.waitForServerReady(SlingTestBase.java:308)
[ERROR] at org.apache.sling.testing.tools.sling.SlingTestBase.startServerIfNeeded(SlingTestBase.java:152)
[ERROR] at org.apache.sling.testing.tools.sling.SlingTestBase.getServerBaseUrl(SlingTestBase.java:213)
[ERROR] at org.apache.sling.models.it.RemoteIT.getJunitServletUrl(RemoteIT.java:28)
[ERROR] at org.apache.sling.junit.remote.testrunner.SlingRemoteTestRunner.maybeExecuteTests(SlingRemoteTestRunner.java:95)
[ERROR] at org.apache.sling.junit.remote.testrunner.SlingRemoteTestRunner.getChildren(SlingRemoteTestRunner.java:138)
[ERROR] at org.junit.runners.ParentRunner.getFilteredChildren(ParentRunner.java:363)
[ERROR] at org.junit.runners.ParentRunner.getDescription(ParentRunner.java:297)
[ERROR] at org.junit.runners.Suite.describeChild(Suite.java:122)
[ERROR] at org.junit.runners.Suite.describeChild(Suite.java:26)
[ERROR] at org.junit.runners.ParentRunner.getDescription(ParentRunner.java:298)
[ERROR] at org.apache.maven.surefire.common.junit4.JUnit4ProviderUtil.createSuiteDescription(JUnit4ProviderUtil.java:113)
[ERROR] at org.apache.maven.surefire.junit4.JUnit4Provider.createTestsDescription(JUnit4Provider.java:257)
[ERROR] at org.apache.maven.surefire.junit4.JUnit4Provider.invoke(JUnit4Provider.java:124)
[ERROR] at org.apache.maven.surefire.booter.ForkedBooter.invokeProviderInSameClassLoader(ForkedBooter.java:203)
[ERROR] at org.apache.maven.surefire.booter.ForkedBooter.runSuitesInProcess(ForkedBooter.java:155)
[ERROR] at org.apache.maven.surefire.booter.ForkedBooter.main(ForkedBooter.java:103)
[ERROR] -> [Help 1]
[ERROR] 
[ERROR] To see the full stack trace of the errors, re-run Maven with the -e switch.
[ERROR] Re-run Maven using the -X switch to enable full debug logging.
[ERROR] 
[ERROR] For more information about the errors and possible solutions, please read the following
articles:
[ERROR] [Help 1] http://cwiki.apache.org/confluence/display/MAVEN/PluginExecutionException
[ERROR] 
[ERROR] After correcting the problems, you can resume the build with the command
[ERROR]   mvn <goals> -rf :org.apache.sling.models.integration-tests
channel stopped

Mime
View raw message