sling-commits mailing list archives

Site index · List index
Message view « Date » · « Thread »
Top « Date » · « Thread »
From Continuum VMBuild Server <contin...@apache.org>
Subject [continuum] BUILD FAILURE: Sling - Launchpad Web Application
Date Wed, 30 Apr 2008 06:34:47 GMT
Online report : http://vmbuild.apache.org/continuum/buildResult.action?buildId=82735&projectId=535

Build statistics:
  State: Failed
  Previous State: Error
  Started at: Tue 29 Apr 2008 23:32:30 -0700
  Finished at: Tue 29 Apr 2008 23:34:36 -0700
  Total time: 2m 5s
  Build Trigger: Schedule
  Build Number: 60
  Exit code: 1
  Building machine hostname: vmbuild.apache.org
  Operating system : Linux(unknown)
  Java Home version : 
          java version "1.6.0_05"
          Java(TM) SE Runtime Environment (build 1.6.0_05-b13)
          Java HotSpot(TM) Client VM (build 10.0-b19, mixed mode, sharing)
        
  Builder version :
          Maven version: 2.0.7
          Java version: 1.6.0_05
          OS name: "linux" version: "2.6.20-16-server" arch: "i386"
    
****************************************************************************
SCM Changes:
****************************************************************************
Changed: bdelacretaz @ Tue 29 Apr 2008 22:39:41 -0700
Comment: SLING-396 - add missing jcr-client.properties
Files changed:
  /incubator/sling/trunk/launchpad/webapp/pom.xml ( 652267 )

Changed: bdelacretaz @ Tue 29 Apr 2008 22:43:07 -0700
Comment: SLING-399 - Remove useless launchpad.app bundle from launchpad.webapp
Files changed:
  /incubator/sling/trunk/launchpad/webapp/pom.xml ( 652270 )

Changed: cziegeler @ Tue 29 Apr 2008 23:21:49 -0700
Comment: Exclude launchpad base from app and webapp.
Files changed:
  /incubator/sling/trunk/launchpad/app/pom.xml ( 652291 )
  /incubator/sling/trunk/launchpad/webapp/pom.xml ( 652291 )

****************************************************************************
Dependencies Changes:
****************************************************************************
org.apache.sling:org.apache.sling.scripting.javascript:2.0.0-incubator-SNAPSHOT

org.apache.sling:org.apache.sling.servlets.post:2.0.0-incubator-SNAPSHOT


****************************************************************************
Build Defintion:
****************************************************************************
POM filename: pom.xml
Goals: clean install   
Arguments: --batch-mode --non-recursive
Build Fresh: false
Always Build: false
Default Build Definition: true
Schedule: DEFAULT_SCHEDULE
Description: 


****************************************************************************
Test Summary:
****************************************************************************
Tests: 146
Failures: 146
Total time: 61468

****************************************************************************
Output:
****************************************************************************
[INFO] Scanning for projects...
[INFO] ----------------------------------------------------------------------------
[INFO] Building Sling - Launchpad Web Application
[INFO]    task-segment: [clean, install]
[INFO] ----------------------------------------------------------------------------
[INFO] [clean:clean]
[INFO] Deleting directory /home/continuum/data/working-directory/535/target
[INFO] Deleting directory /home/continuum/data/working-directory/535/target/classes
[INFO] Deleting directory /home/continuum/data/working-directory/535/target/test-classes
[INFO] Deleting directory /home/continuum/data/working-directory/535/target/site
[INFO] snapshot org.apache.sling:org.apache.sling.launchpad.app:2.0.0-incubator-SNAPSHOT: checking for updates from apache.snapshots
[INFO] [enforcer:enforce {execution: enforce-java}]
[INFO] [dependency:unpack-dependencies {execution: unpack-dependencies}]
[INFO] Expanding: /home/continuum/.m2/repository/org/apache/sling/org.apache.sling.launchpad.app/2.0.0-incubator-SNAPSHOT/org.apache.sling.launchpad.app-2.0.0-incubator-SNAPSHOT.jar into /home/continuum/data/working-directory/535/target/launchpad-app
[INFO] Expanding: /home/continuum/.m2/repository/org/eclipse/equinox/http/servlet/1.0.0-v20070606/servlet-1.0.0-v20070606.jar into /home/continuum/data/working-directory/535/target/launchpad-app
[INFO] [dependency:copy-dependencies {execution: copy-dependencies}]
[INFO] Copying org.apache.sling.scripting.javascript-2.0.0-incubator-SNAPSHOT.jar to /home/continuum/data/working-directory/535/target/org.apache.sling.launchpad.webapp-2.0.0-incubator-SNAPSHOT/WEB-INF/resources/bundles/org.apache.sling.scripting.javascript-2.0.0-incubator-SNAPSHOT.jar
[INFO] Copying org.apache.sling.servlets.post-2.0.0-incubator-SNAPSHOT.jar to /home/continuum/data/working-directory/535/target/org.apache.sling.launchpad.webapp-2.0.0-incubator-SNAPSHOT/WEB-INF/resources/bundles/org.apache.sling.servlets.post-2.0.0-incubator-SNAPSHOT.jar
[INFO] [resources:resources]
[INFO] Using default encoding to copy filtered resources.
[INFO] [compiler:compile]
[INFO] No sources to compile
[INFO] [resources:testResources]
[INFO] Using default encoding to copy filtered resources.
[INFO] [compiler:testCompile]
[INFO] Compiling 40 source files to /home/continuum/data/working-directory/535/target/test-classes
[INFO] [surefire:test]
[INFO] Surefire report directory: /home/continuum/data/working-directory/535/target/surefire-reports

-------------------------------------------------------
 T E S T S
-------------------------------------------------------
There are no tests to run.

Results :

Tests run: 0, Failures: 0, Errors: 0, Skipped: 0

[INFO] [war:war]
[INFO] Exploding webapp...
[INFO] Assembling webapp org.apache.sling.launchpad.webapp in /home/continuum/data/working-directory/535/target/org.apache.sling.launchpad.webapp-2.0.0-incubator-SNAPSHOT
[INFO] Copy webapp webResources to /home/continuum/data/working-directory/535/target/org.apache.sling.launchpad.webapp-2.0.0-incubator-SNAPSHOT
[INFO] Copy webapp webResources to /home/continuum/data/working-directory/535/target/org.apache.sling.launchpad.webapp-2.0.0-incubator-SNAPSHOT
[INFO] Copy webapp webResources to /home/continuum/data/working-directory/535/target/org.apache.sling.launchpad.webapp-2.0.0-incubator-SNAPSHOT
[INFO] Copy webapp webResources to /home/continuum/data/working-directory/535/target/org.apache.sling.launchpad.webapp-2.0.0-incubator-SNAPSHOT
[INFO] Generating war /home/continuum/data/working-directory/535/target/org.apache.sling.launchpad.webapp-2.0.0-incubator-SNAPSHOT.war
[INFO] Building war: /home/continuum/data/working-directory/535/target/org.apache.sling.launchpad.webapp-2.0.0-incubator-SNAPSHOT.war
[INFO] Preparing source:jar
[WARNING] Removing: jar from forked lifecycle, to prevent recursive invocation.
[INFO] [enforcer:enforce {execution: enforce-java}]
[INFO] [source:jar {execution: attach-sources}]
[INFO] Building jar: /home/continuum/data/working-directory/535/target/org.apache.sling.launchpad.webapp-2.0.0-incubator-SNAPSHOT-sources.jar
[INFO] [cargo:start {execution: start-container}]
[INFO] [beddedLocalContainer] Jetty 6.x Embedded starting...
2008-04-29 23:33:24.806::INFO:  Logging to STDERR via org.mortbay.log.StdErrLog
2008-04-29 23:33:24.935::INFO:  jetty-6.1.1rc1
2008-04-29 23:33:25.553::INFO:  Extract jar:file:/home/continuum/data/working-directory/535/target/org.apache.sling.launchpad.webapp-2.0.0-incubator-SNAPSHOT.war!/ to /tmp/Jetty_0_0_0_0_8888_org.apache.sling.launchpad.webapp-2.0.0-incubator-SNAPSHOT.war__org_apache_sling_launchpad_webapp-2_0_0-incubator-SNAPSHOT__tvdn0n/webapp
2008-04-29 23:33:27.650::WARN:  failed sling
javax.servlet.UnavailableException: org.apache.sling.launcher.webapp.SlingServlet
	at org.mortbay.jetty.servlet.Holder.doStart(Holder.java:78)
	at org.mortbay.jetty.servlet.ServletHolder.doStart(ServletHolder.java:235)
	at org.mortbay.component.AbstractLifeCycle.start(AbstractLifeCycle.java:40)
	at org.mortbay.jetty.servlet.ServletHandler.initialize(ServletHandler.java:593)
	at org.mortbay.jetty.servlet.Context.startContext(Context.java:139)
	at org.mortbay.jetty.webapp.WebAppContext.startContext(WebAppContext.java:1191)
	at org.mortbay.jetty.handler.ContextHandler.doStart(ContextHandler.java:481)
	at org.mortbay.jetty.webapp.WebAppContext.doStart(WebAppContext.java:434)
	at org.mortbay.component.AbstractLifeCycle.start(AbstractLifeCycle.java:40)
	at org.mortbay.jetty.handler.HandlerCollection.doStart(HandlerCollection.java:147)
	at org.mortbay.jetty.handler.ContextHandlerCollection.doStart(ContextHandlerCollection.java:120)
	at org.mortbay.component.AbstractLifeCycle.start(AbstractLifeCycle.java:40)
	at org.mortbay.jetty.handler.HandlerCollection.doStart(HandlerCollection.java:147)
	at org.mortbay.component.AbstractLifeCycle.start(AbstractLifeCycle.java:40)
	at org.mortbay.jetty.handler.HandlerWrapper.doStart(HandlerWrapper.java:117)
	at org.mortbay.jetty.Server.doStart(Server.java:210)
	at org.mortbay.component.AbstractLifeCycle.start(AbstractLifeCycle.java:40)
	at sun.reflect.NativeMethodAccessorImpl.invoke0(Native Method)
	at sun.reflect.NativeMethodAccessorImpl.invoke(NativeMethodAccessorImpl.java:39)
	at sun.reflect.DelegatingMethodAccessorImpl.invoke(DelegatingMethodAccessorImpl.java:25)
	at java.lang.reflect.Method.invoke(Method.java:597)
	at org.codehaus.cargo.container.jetty.internal.JettyExecutorThread.run(JettyExecutorThread.java:68)
2008-04-29 23:33:27.652::WARN:  Failed startup of context org.mortbay.jetty.webapp.WebAppContext@191f022{/org.apache.sling.launchpad.webapp-2.0.0-incubator-SNAPSHOT,jar:file:/home/continuum/data/working-directory/535/target/org.apache.sling.launchpad.webapp-2.0.0-incubator-SNAPSHOT.war!/}
javax.servlet.UnavailableException: org.apache.sling.launcher.webapp.SlingServlet
	at org.mortbay.jetty.servlet.Holder.doStart(Holder.java:78)
	at org.mortbay.jetty.servlet.ServletHolder.doStart(ServletHolder.java:235)
	at org.mortbay.component.AbstractLifeCycle.start(AbstractLifeCycle.java:40)
	at org.mortbay.jetty.servlet.ServletHandler.initialize(ServletHandler.java:593)
	at org.mortbay.jetty.servlet.Context.startContext(Context.java:139)
	at org.mortbay.jetty.webapp.WebAppContext.startContext(WebAppContext.java:1191)
	at org.mortbay.jetty.handler.ContextHandler.doStart(ContextHandler.java:481)
	at org.mortbay.jetty.webapp.WebAppContext.doStart(WebAppContext.java:434)
	at org.mortbay.component.AbstractLifeCycle.start(AbstractLifeCycle.java:40)
	at org.mortbay.jetty.handler.HandlerCollection.doStart(HandlerCollection.java:147)
	at org.mortbay.jetty.handler.ContextHandlerCollection.doStart(ContextHandlerCollection.java:120)
	at org.mortbay.component.AbstractLifeCycle.start(AbstractLifeCycle.java:40)
	at org.mortbay.jetty.handler.HandlerCollection.doStart(HandlerCollection.java:147)
	at org.mortbay.component.AbstractLifeCycle.start(AbstractLifeCycle.java:40)
	at org.mortbay.jetty.handler.HandlerWrapper.doStart(HandlerWrapper.java:117)
	at org.mortbay.jetty.Server.doStart(Server.java:210)
	at org.mortbay.component.AbstractLifeCycle.start(AbstractLifeCycle.java:40)
	at sun.reflect.NativeMethodAccessorImpl.invoke0(Native Method)
	at sun.reflect.NativeMethodAccessorImpl.invoke(NativeMethodAccessorImpl.java:39)
	at sun.reflect.DelegatingMethodAccessorImpl.invoke(DelegatingMethodAccessorImpl.java:25)
	at java.lang.reflect.Method.invoke(Method.java:597)
	at org.codehaus.cargo.container.jetty.internal.JettyExecutorThread.run(JettyExecutorThread.java:68)
2008-04-29 23:33:27.666::INFO:  Extract jar:file:/tmp/cargo/conf/cargocpc.war!/ to /tmp/Jetty_0_0_0_0_8888_cargocpc.war__cargocpc__rw8xgv/webapp
2008-04-29 23:33:29.181::INFO:  Started SelectChannelConnector @ 0.0.0.0:8888
[INFO] [beddedLocalContainer] Jetty 6.x Embedded started on port [8888]
[INFO] [surefire:test {execution: surefire-integration-test}]
[INFO] Surefire report directory: /home/continuum/data/working-directory/535/target/surefire-reports

-------------------------------------------------------
 T E S T S
-------------------------------------------------------
Running org.apache.sling.launchpad.webapp.integrationtest.StaticContentTest
log4j:WARN No appenders could be found for logger (org.apache.commons.httpclient.HttpClient).
log4j:WARN Please initialize the log4j system properly.
Checking if the required Sling services are started...
(base URLs=http://localhost:8888/org.apache.sling.launchpad.webapp-2.0.0-incubator-SNAPSHOT and http://localhost:8888/org.apache.sling.launchpad.webapp-2.0.0-incubator-SNAPSHOT)
Server does not seem to be ready, after 60000 msec, got the following 114 Exceptions:java.io.IOException: Expected status code 302 for POST, got 503, URL=http://localhost:8888/org.apache.sling.launchpad.webapp-2.0.0-incubator-SNAPSHOT/WaitForSlingStartup_1209537212901
java.io.IOException: Expected status code 302 for POST, got 503, URL=http://localhost:8888/org.apache.sling.launchpad.webapp-2.0.0-incubator-SNAPSHOT/WaitForSlingStartup_1209537213597
java.io.IOException: Expected status code 302 for POST, got 503, URL=http://localhost:8888/org.apache.sling.launchpad.webapp-2.0.0-incubator-SNAPSHOT/WaitForSlingStartup_1209537214134
java.io.IOException: Expected status code 302 for POST, got 503, URL=http://localhost:8888/org.apache.sling.launchpad.webapp-2.0.0-incubator-SNAPSHOT/WaitForSlingStartup_1209537214665
java.io.IOException: Expected status code 302 for POST, got 503, URL=http://localhost:8888/org.apache.sling.launchpad.webapp-2.0.0-incubator-SNAPSHOT/WaitForSlingStartup_1209537215214
java.io.IOException: Expected status code 302 for POST, got 503, URL=http://localhost:8888/org.apache.sling.launchpad.webapp-2.0.0-incubator-SNAPSHOT/WaitForSlingStartup_1209537215744
java.io.IOException: Expected status code 302 for POST, got 503, URL=http://localhost:8888/org.apache.sling.launchpad.webapp-2.0.0-incubator-SNAPSHOT/WaitForSlingStartup_1209537216294
java.io.IOException: Expected status code 302 for POST, got 503, URL=http://localhost:8888/org.apache.sling.launchpad.webapp-2.0.0-incubator-SNAPSHOT/WaitForSlingStartup_1209537216824
java.io.IOException: Expected status code 302 for POST, got 503, URL=http://localhost:8888/org.apache.sling.launchpad.webapp-2.0.0-incubator-SNAPSHOT/WaitForSlingStartup_1209537217364
java.io.IOException: Expected status code 302 for POST, got 503, URL=http://localhost:8888/org.apache.sling.launchpad.webapp-2.0.0-incubator-SNAPSHOT/WaitForSlingStartup_1209537217894
java.io.IOException: Expected status code 302 for POST, got 503, URL=http://localhost:8888/org.apache.sling.launchpad.webapp-2.0.0-incubator-SNAPSHOT/WaitForSlingStartup_1209537218414
java.io.IOException: Expected status code 302 for POST, got 503, URL=http://localhost:8888/org.apache.sling.launchpad.webapp-2.0.0-incubator-SNAPSHOT/WaitForSlingStartup_1209537218944
java.io.IOException: Expected status code 302 for POST, got 503, URL=http://localhost:8888/org.apache.sling.launchpad.webapp-2.0.0-incubator-SNAPSHOT/WaitForSlingStartup_1209537219475
java.io.IOException: Expected status code 302 for POST, got 503, URL=http://localhost:8888/org.apache.sling.launchpad.webapp-2.0.0-incubator-SNAPSHOT/WaitForSlingStartup_1209537220004
java.io.IOException: Expected status code 302 for POST, got 503, URL=http://localhost:8888/org.apache.sling.launchpad.webapp-2.0.0-incubator-SNAPSHOT/WaitForSlingStartup_1209537220544
java.io.IOException: Expected status code 302 for POST, got 503, URL=http://localhost:8888/org.apache.sling.launchpad.webapp-2.0.0-incubator-SNAPSHOT/WaitForSlingStartup_1209537221075
java.io.IOException: Expected status code 302 for POST, got 503, URL=http://localhost:8888/org.apache.sling.launchpad.webapp-2.0.0-incubator-SNAPSHOT/WaitForSlingStartup_1209537221615
java.io.IOException: Expected status code 302 for POST, got 503, URL=http://localhost:8888/org.apache.sling.launchpad.webapp-2.0.0-incubator-SNAPSHOT/WaitForSlingStartup_1209537222144
java.io.IOException: Expected status code 302 for POST, got 503, URL=http://localhost:8888/org.apache.sling.launchpad.webapp-2.0.0-incubator-SNAPSHOT/WaitForSlingStartup_1209537222675
java.io.IOException: Expected status code 302 for POST, got 503, URL=http://localhost:8888/org.apache.sling.launchpad.webapp-2.0.0-incubator-SNAPSHOT/WaitForSlingStartup_1209537223215
java.io.IOException: Expected status code 302 for POST, got 503, URL=http://localhost:8888/org.apache.sling.launchpad.webapp-2.0.0-incubator-SNAPSHOT/WaitForSlingStartup_1209537223745
java.io.IOException: Expected status code 302 for POST, got 503, URL=http://localhost:8888/org.apache.sling.launchpad.webapp-2.0.0-incubator-SNAPSHOT/WaitForSlingStartup_1209537224274
java.io.IOException: Expected status code 302 for POST, got 503, URL=http://localhost:8888/org.apache.sling.launchpad.webapp-2.0.0-incubator-SNAPSHOT/WaitForSlingStartup_1209537224796
java.io.IOException: Expected status code 302 for POST, got 503, URL=http://localhost:8888/org.apache.sling.launchpad.webapp-2.0.0-incubator-SNAPSHOT/WaitForSlingStartup_1209537225335
java.io.IOException: Expected status code 302 for POST, got 503, URL=http://localhost:8888/org.apache.sling.launchpad.webapp-2.0.0-incubator-SNAPSHOT/WaitForSlingStartup_1209537225865
java.io.IOException: Expected status code 302 for POST, got 503, URL=http://localhost:8888/org.apache.sling.launchpad.webapp-2.0.0-incubator-SNAPSHOT/WaitForSlingStartup_1209537226395
java.io.IOException: Expected status code 302 for POST, got 503, URL=http://localhost:8888/org.apache.sling.launchpad.webapp-2.0.0-incubator-SNAPSHOT/WaitForSlingStartup_1209537226927
java.io.IOException: Expected status code 302 for POST, got 503, URL=http://localhost:8888/org.apache.sling.launchpad.webapp-2.0.0-incubator-SNAPSHOT/WaitForSlingStartup_1209537227465
java.io.IOException: Expected status code 302 for POST, got 503, URL=http://localhost:8888/org.apache.sling.launchpad.webapp-2.0.0-incubator-SNAPSHOT/WaitForSlingStartup_1209537227995
java.io.IOException: Expected status code 302 for POST, got 503, URL=http://localhost:8888/org.apache.sling.launchpad.webapp-2.0.0-incubator-SNAPSHOT/WaitForSlingStartup_1209537228515
java.io.IOException: Expected status code 302 for POST, got 503, URL=http://localhost:8888/org.apache.sling.launchpad.webapp-2.0.0-incubator-SNAPSHOT/WaitForSlingStartup_1209537229045
java.io.IOException: Expected status code 302 for POST, got 503, URL=http://localhost:8888/org.apache.sling.launchpad.webapp-2.0.0-incubator-SNAPSHOT/WaitForSlingStartup_1209537229575
java.io.IOException: Expected status code 302 for POST, got 503, URL=http://localhost:8888/org.apache.sling.launchpad.webapp-2.0.0-incubator-SNAPSHOT/WaitForSlingStartup_1209537230105
java.io.IOException: Expected status code 302 for POST, got 503, URL=http://localhost:8888/org.apache.sling.launchpad.webapp-2.0.0-incubator-SNAPSHOT/WaitForSlingStartup_1209537230625
java.io.IOException: Expected status code 302 for POST, got 503, URL=http://localhost:8888/org.apache.sling.launchpad.webapp-2.0.0-incubator-SNAPSHOT/WaitForSlingStartup_1209537231165
java.io.IOException: Expected status code 302 for POST, got 503, URL=http://localhost:8888/org.apache.sling.launchpad.webapp-2.0.0-incubator-SNAPSHOT/WaitForSlingStartup_1209537231695
java.io.IOException: Expected status code 302 for POST, got 503, URL=http://localhost:8888/org.apache.sling.launchpad.webapp-2.0.0-incubator-SNAPSHOT/WaitForSlingStartup_1209537232215
java.io.IOException: Expected status code 302 for POST, got 503, URL=http://localhost:8888/org.apache.sling.launchpad.webapp-2.0.0-incubator-SNAPSHOT/WaitForSlingStartup_1209537232735
java.io.IOException: Expected status code 302 for POST, got 503, URL=http://localhost:8888/org.apache.sling.launchpad.webapp-2.0.0-incubator-SNAPSHOT/WaitForSlingStartup_1209537233275
java.io.IOException: Expected status code 302 for POST, got 503, URL=http://localhost:8888/org.apache.sling.launchpad.webapp-2.0.0-incubator-SNAPSHOT/WaitForSlingStartup_1209537233795
java.io.IOException: Expected status code 302 for POST, got 503, URL=http://localhost:8888/org.apache.sling.launchpad.webapp-2.0.0-incubator-SNAPSHOT/WaitForSlingStartup_1209537234315
java.io.IOException: Expected status code 302 for POST, got 503, URL=http://localhost:8888/org.apache.sling.launchpad.webapp-2.0.0-incubator-SNAPSHOT/WaitForSlingStartup_1209537234835
java.io.IOException: Expected status code 302 for POST, got 503, URL=http://localhost:8888/org.apache.sling.launchpad.webapp-2.0.0-incubator-SNAPSHOT/WaitForSlingStartup_1209537235355
java.io.IOException: Expected status code 302 for POST, got 503, URL=http://localhost:8888/org.apache.sling.launchpad.webapp-2.0.0-incubator-SNAPSHOT/WaitForSlingStartup_1209537235875
java.io.IOException: Expected status code 302 for POST, got 503, URL=http://localhost:8888/org.apache.sling.launchpad.webapp-2.0.0-incubator-SNAPSHOT/WaitForSlingStartup_1209537236405
java.io.IOException: Expected status code 302 for POST, got 503, URL=http://localhost:8888/org.apache.sling.launchpad.webapp-2.0.0-incubator-SNAPSHOT/WaitForSlingStartup_1209537236935
java.io.IOException: Expected status code 302 for POST, got 503, URL=http://localhost:8888/org.apache.sling.launchpad.webapp-2.0.0-incubator-SNAPSHOT/WaitForSlingStartup_1209537237465
java.io.IOException: Expected status code 302 for POST, got 503, URL=http://localhost:8888/org.apache.sling.launchpad.webapp-2.0.0-incubator-SNAPSHOT/WaitForSlingStartup_1209537237985
java.io.IOException: Expected status code 302 for POST, got 503, URL=http://localhost:8888/org.apache.sling.launchpad.webapp-2.0.0-incubator-SNAPSHOT/WaitForSlingStartup_1209537238515
java.io.IOException: Expected status code 302 for POST, got 503, URL=http://localhost:8888/org.apache.sling.launchpad.webapp-2.0.0-incubator-SNAPSHOT/WaitForSlingStartup_1209537239035
java.io.IOException: Expected status code 302 for POST, got 503, URL=http://localhost:8888/org.apache.sling.launchpad.webapp-2.0.0-incubator-SNAPSHOT/WaitForSlingStartup_1209537239555
java.io.IOException: Expected status code 302 for POST, got 503, URL=http://localhost:8888/org.apache.sling.launchpad.webapp-2.0.0-incubator-SNAPSHOT/WaitForSlingStartup_1209537240085
java.io.IOException: Expected status code 302 for POST, got 503, URL=http://localhost:8888/org.apache.sling.launchpad.webapp-2.0.0-incubator-SNAPSHOT/WaitForSlingStartup_1209537240605
java.io.IOException: Expected status code 302 for POST, got 503, URL=http://localhost:8888/org.apache.sling.launchpad.webapp-2.0.0-incubator-SNAPSHOT/WaitForSlingStartup_1209537241125
java.io.IOException: Expected status code 302 for POST, got 503, URL=http://localhost:8888/org.apache.sling.launchpad.webapp-2.0.0-incubator-SNAPSHOT/WaitForSlingStartup_1209537241645
java.io.IOException: Expected status code 302 for POST, got 503, URL=http://localhost:8888/org.apache.sling.launchpad.webapp-2.0.0-incubator-SNAPSHOT/WaitForSlingStartup_1209537242165
java.io.IOException: Expected status code 302 for POST, got 503, URL=http://localhost:8888/org.apache.sling.launchpad.webapp-2.0.0-incubator-SNAPSHOT/WaitForSlingStartup_1209537242685
java.io.IOException: Expected status code 302 for POST, got 503, URL=http://localhost:8888/org.apache.sling.launchpad.webapp-2.0.0-incubator-SNAPSHOT/WaitForSlingStartup_1209537243205
java.io.IOException: Expected status code 302 for POST, got 503, URL=http://localhost:8888/org.apache.sling.launchpad.webapp-2.0.0-incubator-SNAPSHOT/WaitForSlingStartup_1209537243725
java.io.IOException: Expected status code 302 for POST, got 503, URL=http://localhost:8888/org.apache.sling.launchpad.webapp-2.0.0-incubator-SNAPSHOT/WaitForSlingStartup_1209537244245
java.io.IOException: Expected status code 302 for POST, got 503, URL=http://localhost:8888/org.apache.sling.launchpad.webapp-2.0.0-incubator-SNAPSHOT/WaitForSlingStartup_1209537244775
java.io.IOException: Expected status code 302 for POST, got 503, URL=http://localhost:8888/org.apache.sling.launchpad.webapp-2.0.0-incubator-SNAPSHOT/WaitForSlingStartup_1209537245295
java.io.IOException: Expected status code 302 for POST, got 503, URL=http://localhost:8888/org.apache.sling.launchpad.webapp-2.0.0-incubator-SNAPSHOT/WaitForSlingStartup_1209537245815
java.io.IOException: Expected status code 302 for POST, got 503, URL=http://localhost:8888/org.apache.sling.launchpad.webapp-2.0.0-incubator-SNAPSHOT/WaitForSlingStartup_1209537246335
java.io.IOException: Expected status code 302 for POST, got 503, URL=http://localhost:8888/org.apache.sling.launchpad.webapp-2.0.0-incubator-SNAPSHOT/WaitForSlingStartup_1209537246855
java.io.IOException: Expected status code 302 for POST, got 503, URL=http://localhost:8888/org.apache.sling.launchpad.webapp-2.0.0-incubator-SNAPSHOT/WaitForSlingStartup_1209537247385
java.io.IOException: Expected status code 302 for POST, got 503, URL=http://localhost:8888/org.apache.sling.launchpad.webapp-2.0.0-incubator-SNAPSHOT/WaitForSlingStartup_1209537247905
java.io.IOException: Expected status code 302 for POST, got 503, URL=http://localhost:8888/org.apache.sling.launchpad.webapp-2.0.0-incubator-SNAPSHOT/WaitForSlingStartup_1209537248425
java.io.IOException: Expected status code 302 for POST, got 503, URL=http://localhost:8888/org.apache.sling.launchpad.webapp-2.0.0-incubator-SNAPSHOT/WaitForSlingStartup_1209537248945
java.io.IOException: Expected status code 302 for POST, got 503, URL=http://localhost:8888/org.apache.sling.launchpad.webapp-2.0.0-incubator-SNAPSHOT/WaitForSlingStartup_1209537249475
java.io.IOException: Expected status code 302 for POST, got 503, URL=http://localhost:8888/org.apache.sling.launchpad.webapp-2.0.0-incubator-SNAPSHOT/WaitForSlingStartup_1209537249995
java.io.IOException: Expected status code 302 for POST, got 503, URL=http://localhost:8888/org.apache.sling.launchpad.webapp-2.0.0-incubator-SNAPSHOT/WaitForSlingStartup_1209537250525
java.io.IOException: Expected status code 302 for POST, got 503, URL=http://localhost:8888/org.apache.sling.launchpad.webapp-2.0.0-incubator-SNAPSHOT/WaitForSlingStartup_1209537251055
java.io.IOException: Expected status code 302 for POST, got 503, URL=http://localhost:8888/org.apache.sling.launchpad.webapp-2.0.0-incubator-SNAPSHOT/WaitForSlingStartup_1209537251575
java.io.IOException: Expected status code 302 for POST, got 503, URL=http://localhost:8888/org.apache.sling.launchpad.webapp-2.0.0-incubator-SNAPSHOT/WaitForSlingStartup_1209537252105
java.io.IOException: Expected status code 302 for POST, got 503, URL=http://localhost:8888/org.apache.sling.launchpad.webapp-2.0.0-incubator-SNAPSHOT/WaitForSlingStartup_1209537252635
java.io.IOException: Expected status code 302 for POST, got 503, URL=http://localhost:8888/org.apache.sling.launchpad.webapp-2.0.0-incubator-SNAPSHOT/WaitForSlingStartup_1209537253165
java.io.IOException: Expected status code 302 for POST, got 503, URL=http://localhost:8888/org.apache.sling.launchpad.webapp-2.0.0-incubator-SNAPSHOT/WaitForSlingStartup_1209537253685
java.io.IOException: Expected status code 302 for POST, got 503, URL=http://localhost:8888/org.apache.sling.launchpad.webapp-2.0.0-incubator-SNAPSHOT/WaitForSlingStartup_1209537254205
java.io.IOException: Expected status code 302 for POST, got 503, URL=http://localhost:8888/org.apache.sling.launchpad.webapp-2.0.0-incubator-SNAPSHOT/WaitForSlingStartup_1209537254735
java.io.IOException: Expected status code 302 for POST, got 503, URL=http://localhost:8888/org.apache.sling.launchpad.webapp-2.0.0-incubator-SNAPSHOT/WaitForSlingStartup_1209537255255
java.io.IOException: Expected status code 302 for POST, got 503, URL=http://localhost:8888/org.apache.sling.launchpad.webapp-2.0.0-incubator-SNAPSHOT/WaitForSlingStartup_1209537255775
java.io.IOException: Expected status code 302 for POST, got 503, URL=http://localhost:8888/org.apache.sling.launchpad.webapp-2.0.0-incubator-SNAPSHOT/WaitForSlingStartup_1209537256305
java.io.IOException: Expected status code 302 for POST, got 503, URL=http://localhost:8888/org.apache.sling.launchpad.webapp-2.0.0-incubator-SNAPSHOT/WaitForSlingStartup_1209537256825
java.io.IOException: Expected status code 302 for POST, got 503, URL=http://localhost:8888/org.apache.sling.launchpad.webapp-2.0.0-incubator-SNAPSHOT/WaitForSlingStartup_1209537257345
java.io.IOException: Expected status code 302 for POST, got 503, URL=http://localhost:8888/org.apache.sling.launchpad.webapp-2.0.0-incubator-SNAPSHOT/WaitForSlingStartup_1209537257865
java.io.IOException: Expected status code 302 for POST, got 503, URL=http://localhost:8888/org.apache.sling.launchpad.webapp-2.0.0-incubator-SNAPSHOT/WaitForSlingStartup_1209537258395
java.io.IOException: Expected status code 302 for POST, got 503, URL=http://localhost:8888/org.apache.sling.launchpad.webapp-2.0.0-incubator-SNAPSHOT/WaitForSlingStartup_1209537258915
java.io.IOException: Expected status code 302 for POST, got 503, URL=http://localhost:8888/org.apache.sling.launchpad.webapp-2.0.0-incubator-SNAPSHOT/WaitForSlingStartup_1209537259435
java.io.IOException: Expected status code 302 for POST, got 503, URL=http://localhost:8888/org.apache.sling.launchpad.webapp-2.0.0-incubator-SNAPSHOT/WaitForSlingStartup_1209537259955
java.io.IOException: Expected status code 302 for POST, got 503, URL=http://localhost:8888/org.apache.sling.launchpad.webapp-2.0.0-incubator-SNAPSHOT/WaitForSlingStartup_1209537260485
java.io.IOException: Expected status code 302 for POST, got 503, URL=http://localhost:8888/org.apache.sling.launchpad.webapp-2.0.0-incubator-SNAPSHOT/WaitForSlingStartup_1209537261015
java.io.IOException: Expected status code 302 for POST, got 503, URL=http://localhost:8888/org.apache.sling.launchpad.webapp-2.0.0-incubator-SNAPSHOT/WaitForSlingStartup_1209537261535
java.io.IOException: Expected status code 302 for POST, got 503, URL=http://localhost:8888/org.apache.sling.launchpad.webapp-2.0.0-incubator-SNAPSHOT/WaitForSlingStartup_1209537262065
java.io.IOException: Expected status code 302 for POST, got 503, URL=http://localhost:8888/org.apache.sling.launchpad.webapp-2.0.0-incubator-SNAPSHOT/WaitForSlingStartup_1209537262595
java.io.IOException: Expected status code 302 for POST, got 503, URL=http://localhost:8888/org.apache.sling.launchpad.webapp-2.0.0-incubator-SNAPSHOT/WaitForSlingStartup_1209537263115
java.io.IOException: Expected status code 302 for POST, got 503, URL=http://localhost:8888/org.apache.sling.launchpad.webapp-2.0.0-incubator-SNAPSHOT/WaitForSlingStartup_1209537263645
java.io.IOException: Expected status code 302 for POST, got 503, URL=http://localhost:8888/org.apache.sling.launchpad.webapp-2.0.0-incubator-SNAPSHOT/WaitForSlingStartup_1209537264165
java.io.IOException: Expected status code 302 for POST, got 503, URL=http://localhost:8888/org.apache.sling.launchpad.webapp-2.0.0-incubator-SNAPSHOT/WaitForSlingStartup_1209537264695
java.io.IOException: Expected status code 302 for POST, got 503, URL=http://localhost:8888/org.apache.sling.launchpad.webapp-2.0.0-incubator-SNAPSHOT/WaitForSlingStartup_1209537265215
java.io.IOException: Expected status code 302 for POST, got 503, URL=http://localhost:8888/org.apache.sling.launchpad.webapp-2.0.0-incubator-SNAPSHOT/WaitForSlingStartup_1209537265735
java.io.IOException: Expected status code 302 for POST, got 503, URL=http://localhost:8888/org.apache.sling.launchpad.webapp-2.0.0-incubator-SNAPSHOT/WaitForSlingStartup_1209537266255
java.io.IOException: Expected status code 302 for POST, got 503, URL=http://localhost:8888/org.apache.sling.launchpad.webapp-2.0.0-incubator-SNAPSHOT/WaitForSlingStartup_1209537266785
java.io.IOException: Expected status code 302 for POST, got 503, URL=http://localhost:8888/org.apache.sling.launchpad.webapp-2.0.0-incubator-SNAPSHOT/WaitForSlingStartup_1209537267305
java.io.IOException: Expected status code 302 for POST, got 503, URL=http://localhost:8888/org.apache.sling.launchpad.webapp-2.0.0-incubator-SNAPSHOT/WaitForSlingStartup_1209537267835
java.io.IOException: Expected status code 302 for POST, got 503, URL=http://localhost:8888/org.apache.sling.launchpad.webapp-2.0.0-incubator-SNAPSHOT/WaitForSlingStartup_1209537268365
java.io.IOException: Expected status code 302 for POST, got 503, URL=http://localhost:8888/org.apache.sling.launchpad.webapp-2.0.0-incubator-SNAPSHOT/WaitForSlingStartup_1209537268885
java.io.IOException: Expected status code 302 for POST, got 503, URL=http://localhost:8888/org.apache.sling.launchpad.webapp-2.0.0-incubator-SNAPSHOT/WaitForSlingStartup_1209537269415
java.io.IOException: Expected status code 302 for POST, got 503, URL=http://localhost:8888/org.apache.sling.launchpad.webapp-2.0.0-incubator-SNAPSHOT/WaitForSlingStartup_1209537269945
java.io.IOException: Expected status code 302 for POST, got 503, URL=http://localhost:8888/org.apache.sling.launchpad.webapp-2.0.0-incubator-SNAPSHOT/WaitForSlingStartup_1209537270465
java.io.IOException: Expected status code 302 for POST, got 503, URL=http://localhost:8888/org.apache.sling.launchpad.webapp-2.0.0-incubator-SNAPSHOT/WaitForSlingStartup_1209537270985
java.io.IOException: Expected status code 302 for POST, got 503, URL=http://localhost:8888/org.apache.sling.launchpad.webapp-2.0.0-incubator-SNAPSHOT/WaitForSlingStartup_1209537271505
java.io.IOException: Expected status code 302 for POST, got 503, URL=http://localhost:8888/org.apache.sling.launchpad.webapp-2.0.0-incubator-SNAPSHOT/WaitForSlingStartup_1209537272035
java.io.IOException: Expected status code 302 for POST, got 503, URL=http://localhost:8888/org.apache.sling.launchpad.webapp-2.0.0-incubator-SNAPSHOT/WaitForSlingStartup_1209537272555

Tests run: 2, Failures: 2, Errors: 0, Skipped: 0, Time elapsed: 61.205 sec <<< FAILURE!
Running org.apache.sling.launchpad.webapp.integrationtest.servlets.post.PostServletOrderTest
Tests run: 9, Failures: 9, Errors: 0, Skipped: 0, Time elapsed: 0.028 sec <<< FAILURE!
Running org.apache.sling.launchpad.webapp.integrationtest.JavascriptWrappersTest
Tests run: 1, Failures: 1, Errors: 0, Skipped: 0, Time elapsed: 0.004 sec <<< FAILURE!
Running org.apache.sling.launchpad.webapp.integrationtest.GeneratedNodeNameTest
Tests run: 6, Failures: 6, Errors: 0, Skipped: 0, Time elapsed: 0.02 sec <<< FAILURE!
Running org.apache.sling.launchpad.webapp.integrationtest.servlets.post.PostServletMoveTest
Tests run: 7, Failures: 7, Errors: 0, Skipped: 0, Time elapsed: 0.022 sec <<< FAILURE!
Running org.apache.sling.launchpad.webapp.integrationtest.JsonRenderingTest
Tests run: 8, Failures: 8, Errors: 0, Skipped: 0, Time elapsed: 0.017 sec <<< FAILURE!
Running org.apache.sling.launchpad.webapp.integrationtest.servlets.post.PostServletCreateTest
Tests run: 9, Failures: 9, Errors: 0, Skipped: 0, Time elapsed: 0.02 sec <<< FAILURE!
Running org.apache.sling.launchpad.webapp.integrationtest.servlets.post.SlingDefaultValuesTest
Tests run: 4, Failures: 4, Errors: 0, Skipped: 0, Time elapsed: 0.01 sec <<< FAILURE!
Running org.apache.sling.launchpad.webapp.integrationtest.UploadFileTest
Tests run: 3, Failures: 3, Errors: 0, Skipped: 0, Time elapsed: 0.007 sec <<< FAILURE!
Running org.apache.sling.launchpad.webapp.integrationtest.PathBasedResourceTypeTest
Tests run: 2, Failures: 2, Errors: 0, Skipped: 0, Time elapsed: 0.006 sec <<< FAILURE!
Running org.apache.sling.launchpad.webapp.integrationtest.MkdirTest
Tests run: 2, Failures: 2, Errors: 0, Skipped: 0, Time elapsed: 0.007 sec <<< FAILURE!
Running org.apache.sling.launchpad.webapp.integrationtest.servlets.post.PostServletUpdateTest
Tests run: 4, Failures: 4, Errors: 0, Skipped: 0, Time elapsed: 0.01 sec <<< FAILURE!
Running org.apache.sling.launchpad.webapp.integrationtest.apt.SimpleAptRenderingTest
Tests run: 1, Failures: 1, Errors: 0, Skipped: 0, Time elapsed: 0.002 sec <<< FAILURE!
Running org.apache.sling.launchpad.webapp.integrationtest.servlets.post.PostServletDeleteTest
Tests run: 1, Failures: 1, Errors: 0, Skipped: 0, Time elapsed: 0.004 sec <<< FAILURE!
Running org.apache.sling.launchpad.webapp.integrationtest.ValueFromTest
Tests run: 3, Failures: 3, Errors: 0, Skipped: 0, Time elapsed: 0.008 sec <<< FAILURE!
Running org.apache.sling.launchpad.webapp.integrationtest.IncludeTest
Tests run: 5, Failures: 5, Errors: 0, Skipped: 0, Time elapsed: 0.011 sec <<< FAILURE!
Running org.apache.sling.launchpad.webapp.integrationtest.GetWithSuffixTest
Tests run: 4, Failures: 4, Errors: 0, Skipped: 0, Time elapsed: 0.01 sec <<< FAILURE!
Running org.apache.sling.launchpad.webapp.integrationtest.JspScriptingTest
Tests run: 4, Failures: 4, Errors: 0, Skipped: 0, Time elapsed: 0.008 sec <<< FAILURE!
Running org.apache.sling.launchpad.webapp.integrationtest.NodetypeRenderingTest
Tests run: 6, Failures: 6, Errors: 0, Skipped: 0, Time elapsed: 0.012 sec <<< FAILURE!
Running org.apache.sling.launchpad.webapp.integrationtest.InitialContentTest
Tests run: 1, Failures: 1, Errors: 0, Skipped: 0, Time elapsed: 0.005 sec <<< FAILURE!
Running org.apache.sling.launchpad.webapp.integrationtest.SlingResourceTypeRenderingTest
Tests run: 9, Failures: 9, Errors: 0, Skipped: 0, Time elapsed: 0.014 sec <<< FAILURE!
Running org.apache.sling.launchpad.webapp.integrationtest.servlets.post.SlingDateValuesTest
Tests run: 1, Failures: 1, Errors: 0, Skipped: 0, Time elapsed: 0.004 sec <<< FAILURE!
Running org.apache.sling.launchpad.webapp.integrationtest.PropertyRenderingTest
Tests run: 6, Failures: 6, Errors: 0, Skipped: 0, Time elapsed: 0.021 sec <<< FAILURE!
Running org.apache.sling.launchpad.webapp.integrationtest.servlets.post.SlingAutoPropertiesTest
Tests run: 3, Failures: 3, Errors: 0, Skipped: 0, Time elapsed: 0.02 sec <<< FAILURE!
Running org.apache.sling.launchpad.webapp.integrationtest.CreateNodeTest
Tests run: 6, Failures: 6, Errors: 0, Skipped: 0, Time elapsed: 0.03 sec <<< FAILURE!
Running org.apache.sling.launchpad.webapp.integrationtest.JsonQueryServletTest
Tests run: 7, Failures: 7, Errors: 0, Skipped: 0, Time elapsed: 0.018 sec <<< FAILURE!
Running org.apache.sling.launchpad.webapp.integrationtest.GetStarTest
Tests run: 3, Failures: 3, Errors: 0, Skipped: 0, Time elapsed: 0.007 sec <<< FAILURE!
Running org.apache.sling.launchpad.webapp.integrationtest.RedirectTest
Tests run: 4, Failures: 4, Errors: 0, Skipped: 0, Time elapsed: 0.008 sec <<< FAILURE!
Running org.apache.sling.launchpad.webapp.integrationtest.FileUploadTest
Tests run: 1, Failures: 1, Errors: 0, Skipped: 0, Time elapsed: 0.003 sec <<< FAILURE!
Running org.apache.sling.launchpad.webapp.integrationtest.servlets.post.SlingSessionInfoTest
Tests run: 2, Failures: 2, Errors: 0, Skipped: 0, Time elapsed: 0.003 sec <<< FAILURE!
Running org.apache.sling.launchpad.webapp.integrationtest.servlets.post.PostServletCopyTest
Tests run: 8, Failures: 8, Errors: 0, Skipped: 0, Time elapsed: 0.014 sec <<< FAILURE!
Running org.apache.sling.launchpad.webapp.integrationtest.ScriptBuiltinObjectsTest
Tests run: 1, Failures: 1, Errors: 0, Skipped: 0, Time elapsed: 0.005 sec <<< FAILURE!
Running org.apache.sling.launchpad.webapp.integrationtest.SyntheticResourceTest
Tests run: 1, Failures: 1, Errors: 0, Skipped: 0, Time elapsed: 0.004 sec <<< FAILURE!
Running org.apache.sling.launchpad.webapp.integrationtest.StreamServletTest
Tests run: 4, Failures: 4, Errors: 0, Skipped: 0, Time elapsed: 0.007 sec <<< FAILURE!
Running org.apache.sling.launchpad.webapp.integrationtest.PostRedirectTest
Tests run: 6, Failures: 6, Errors: 0, Skipped: 0, Time elapsed: 0.01 sec <<< FAILURE!
Running org.apache.sling.launchpad.webapp.integrationtest.HttpPingTest
Tests run: 2, Failures: 2, Errors: 0, Skipped: 0, Time elapsed: 0.004 sec <<< FAILURE!

Results :

Failed tests: 
  testWebInfForbidden(org.apache.sling.launchpad.webapp.integrationtest.StaticContentTest)
  testMetaInfForbidden(org.apache.sling.launchpad.webapp.integrationtest.StaticContentTest)
  testStandardOrder(org.apache.sling.launchpad.webapp.integrationtest.servlets.post.PostServletOrderTest)
  testOrderFirst(org.apache.sling.launchpad.webapp.integrationtest.servlets.post.PostServletOrderTest)
  testOrderLast(org.apache.sling.launchpad.webapp.integrationtest.servlets.post.PostServletOrderTest)
  testOrderBefore(org.apache.sling.launchpad.webapp.integrationtest.servlets.post.PostServletOrderTest)
  testOrderAfter(org.apache.sling.launchpad.webapp.integrationtest.servlets.post.PostServletOrderTest)
  testOrderIntToBack(org.apache.sling.launchpad.webapp.integrationtest.servlets.post.PostServletOrderTest)
  testOrderIntToFront(org.apache.sling.launchpad.webapp.integrationtest.servlets.post.PostServletOrderTest)
  testOrderIntZero(org.apache.sling.launchpad.webapp.integrationtest.servlets.post.PostServletOrderTest)
  testOrderIntOOB(org.apache.sling.launchpad.webapp.integrationtest.servlets.post.PostServletOrderTest)
  testRecursiveDump(org.apache.sling.launchpad.webapp.integrationtest.JavascriptWrappersTest)
  testTitle(org.apache.sling.launchpad.webapp.integrationtest.GeneratedNodeNameTest)
  testSlingPostNodeNameParam(org.apache.sling.launchpad.webapp.integrationtest.GeneratedNodeNameTest)
  testSlingPostNodeNameHintParam(org.apache.sling.launchpad.webapp.integrationtest.GeneratedNodeNameTest)
  testTitleWithSavePrefix(org.apache.sling.launchpad.webapp.integrationtest.GeneratedNodeNameTest)
  testCollision(org.apache.sling.launchpad.webapp.integrationtest.GeneratedNodeNameTest)
  testNoParams(org.apache.sling.launchpad.webapp.integrationtest.GeneratedNodeNameTest)
  testMoveNodeAbsolute(org.apache.sling.launchpad.webapp.integrationtest.servlets.post.PostServletMoveTest)
  testMoveNodeRelative(org.apache.sling.launchpad.webapp.integrationtest.servlets.post.PostServletMoveTest)
  testMoveNodeNew(org.apache.sling.launchpad.webapp.integrationtest.servlets.post.PostServletMoveTest)
  testMoveNodeExistingFail(org.apache.sling.launchpad.webapp.integrationtest.servlets.post.PostServletMoveTest)
  testMoveNodeExistingReplace(org.apache.sling.launchpad.webapp.integrationtest.servlets.post.PostServletMoveTest)
  testMoveNodeDeep(org.apache.sling.launchpad.webapp.integrationtest.servlets.post.PostServletMoveTest)
  testMoveNodeDeepFail(org.apache.sling.launchpad.webapp.integrationtest.servlets.post.PostServletMoveTest)
  testAssertJavascript(org.apache.sling.launchpad.webapp.integrationtest.JsonRenderingTest)
  testNonRecursive(org.apache.sling.launchpad.webapp.integrationtest.JsonRenderingTest)
  testRecursiveOneLevel(org.apache.sling.launchpad.webapp.integrationtest.JsonRenderingTest)
  testRecursiveZeroLevels(org.apache.sling.launchpad.webapp.integrationtest.JsonRenderingTest)
  testRecursiveInfinity(org.apache.sling.launchpad.webapp.integrationtest.JsonRenderingTest)
  testInvalidLevel(org.apache.sling.launchpad.webapp.integrationtest.JsonRenderingTest)
  testEscapedStrings(org.apache.sling.launchpad.webapp.integrationtest.JsonRenderingTest)
  testAccentedStrings(org.apache.sling.launchpad.webapp.integrationtest.JsonRenderingTest)
  testPostPathIsUnique(org.apache.sling.launchpad.webapp.integrationtest.servlets.post.PostServletCreateTest)
  testCreateNode(org.apache.sling.launchpad.webapp.integrationtest.servlets.post.PostServletCreateTest)
  testCreateNodeWithExtension(org.apache.sling.launchpad.webapp.integrationtest.servlets.post.PostServletCreateTest)
  testCreateNodeAtSpecificUrl(org.apache.sling.launchpad.webapp.integrationtest.servlets.post.PostServletCreateTest)
  testCreateNodeAtDeepUrl(org.apache.sling.launchpad.webapp.integrationtest.servlets.post.PostServletCreateTest)
  testCreateWithData(org.apache.sling.launchpad.webapp.integrationtest.servlets.post.PostServletCreateTest)
  testCreateSubnodeProperty(org.apache.sling.launchpad.webapp.integrationtest.servlets.post.PostServletCreateTest)
  testDefaultSavePrefix(org.apache.sling.launchpad.webapp.integrationtest.servlets.post.PostServletCreateTest)
  testCustomSavePrefix(org.apache.sling.launchpad.webapp.integrationtest.servlets.post.PostServletCreateTest)
  testDefaultBehaviour(org.apache.sling.launchpad.webapp.integrationtest.servlets.post.SlingDefaultValuesTest)
  testWithSpecificDefault(org.apache.sling.launchpad.webapp.integrationtest.servlets.post.SlingDefaultValuesTest)
  testWithIgnore(org.apache.sling.launchpad.webapp.integrationtest.servlets.post.SlingDefaultValuesTest)
  testWithNull(org.apache.sling.launchpad.webapp.integrationtest.servlets.post.SlingDefaultValuesTest)
  testDistinctResource(org.apache.sling.launchpad.webapp.integrationtest.UploadFileTest)
  testDistinctResourceWithType(org.apache.sling.launchpad.webapp.integrationtest.UploadFileTest)
  testDistinctFile(org.apache.sling.launchpad.webapp.integrationtest.UploadFileTest)
  testDefaultResourceType(org.apache.sling.launchpad.webapp.integrationtest.PathBasedResourceTypeTest)
  testExplicitResourceType(org.apache.sling.launchpad.webapp.integrationtest.PathBasedResourceTypeTest)
  testMkdir(org.apache.sling.launchpad.webapp.integrationtest.MkdirTest)
  testMkdirDeep(org.apache.sling.launchpad.webapp.integrationtest.MkdirTest)
  testPostPathIsUnique(org.apache.sling.launchpad.webapp.integrationtest.servlets.post.PostServletUpdateTest)
  testUpdateWithChanges(org.apache.sling.launchpad.webapp.integrationtest.servlets.post.PostServletUpdateTest)
  testUpdateNoChanges(org.apache.sling.launchpad.webapp.integrationtest.servlets.post.PostServletUpdateTest)
  testUpdateSomeChanges(org.apache.sling.launchpad.webapp.integrationtest.servlets.post.PostServletUpdateTest)
  testAptDocument(org.apache.sling.launchpad.webapp.integrationtest.apt.SimpleAptRenderingTest)
  testDelete(org.apache.sling.launchpad.webapp.integrationtest.servlets.post.PostServletDeleteTest)
  testWithoutValueFrom(org.apache.sling.launchpad.webapp.integrationtest.ValueFromTest)
  testWithValueFrom(org.apache.sling.launchpad.webapp.integrationtest.ValueFromTest)
  testWithValueFromAndMissingField(org.apache.sling.launchpad.webapp.integrationtest.ValueFromTest)
  testWithoutInclude(org.apache.sling.launchpad.webapp.integrationtest.IncludeTest)
  testWithInclude(org.apache.sling.launchpad.webapp.integrationtest.IncludeTest)
  testWithIncludeAndExtension(org.apache.sling.launchpad.webapp.integrationtest.IncludeTest)
  testInfiniteLoopDetection(org.apache.sling.launchpad.webapp.integrationtest.IncludeTest)
  testForcedResourceType(org.apache.sling.launchpad.webapp.integrationtest.IncludeTest)
  testWithExactUrl(org.apache.sling.launchpad.webapp.integrationtest.GetWithSuffixTest)
  testGETScript(org.apache.sling.launchpad.webapp.integrationtest.GetWithSuffixTest)
  testWithExtraPathA(org.apache.sling.launchpad.webapp.integrationtest.GetWithSuffixTest)
  testWithExtraPathB(org.apache.sling.launchpad.webapp.integrationtest.GetWithSuffixTest)
  testRtNoScript(org.apache.sling.launchpad.webapp.integrationtest.JspScriptingTest)
  testUnstructuredNoScript(org.apache.sling.launchpad.webapp.integrationtest.JspScriptingTest)
  testRtJsp(org.apache.sling.launchpad.webapp.integrationtest.JspScriptingTest)
  testUnstructuredJsp(org.apache.sling.launchpad.webapp.integrationtest.JspScriptingTest)
  testWithoutScriptTxt(org.apache.sling.launchpad.webapp.integrationtest.NodetypeRenderingTest)
  testWithoutScriptHtml(org.apache.sling.launchpad.webapp.integrationtest.NodetypeRenderingTest)
  testMiniScriptHtml(org.apache.sling.launchpad.webapp.integrationtest.NodetypeRenderingTest)
  testEspHtml(org.apache.sling.launchpad.webapp.integrationtest.NodetypeRenderingTest)
  testEspXml(org.apache.sling.launchpad.webapp.integrationtest.NodetypeRenderingTest)
  testEspPlain(org.apache.sling.launchpad.webapp.integrationtest.NodetypeRenderingTest)
  testIndex(org.apache.sling.launchpad.webapp.integrationtest.InitialContentTest)
  testWithoutScriptTxt(org.apache.sling.launchpad.webapp.integrationtest.SlingResourceTypeRenderingTest)
  testWithoutScriptHtml(org.apache.sling.launchpad.webapp.integrationtest.SlingResourceTypeRenderingTest)
  testEspHtml(org.apache.sling.launchpad.webapp.integrationtest.SlingResourceTypeRenderingTest)
  testEspXml(org.apache.sling.launchpad.webapp.integrationtest.SlingResourceTypeRenderingTest)
  testEspPlain(org.apache.sling.launchpad.webapp.integrationtest.SlingResourceTypeRenderingTest)
  testEspJavaCode(org.apache.sling.launchpad.webapp.integrationtest.SlingResourceTypeRenderingTest)
  testEspHtmlInAppsFolder(org.apache.sling.launchpad.webapp.integrationtest.SlingResourceTypeRenderingTest)
  testEspHtmlWithSelectors(org.apache.sling.launchpad.webapp.integrationtest.SlingResourceTypeRenderingTest)
  testEspJs(org.apache.sling.launchpad.webapp.integrationtest.SlingResourceTypeRenderingTest)
  testDateValues(org.apache.sling.launchpad.webapp.integrationtest.servlets.post.SlingDateValuesTest)
  testNodeAccess(org.apache.sling.launchpad.webapp.integrationtest.PropertyRenderingTest)
  testTextJson(org.apache.sling.launchpad.webapp.integrationtest.PropertyRenderingTest)
  testTextHtml(org.apache.sling.launchpad.webapp.integrationtest.PropertyRenderingTest)
  testTextTxt(org.apache.sling.launchpad.webapp.integrationtest.PropertyRenderingTest)
  testTextNoExt(org.apache.sling.launchpad.webapp.integrationtest.PropertyRenderingTest)
  testResourceTypeNoExt(org.apache.sling.launchpad.webapp.integrationtest.PropertyRenderingTest)
  testPostPathIsUnique(org.apache.sling.launchpad.webapp.integrationtest.servlets.post.SlingAutoPropertiesTest)
  testCreatedAndModified(org.apache.sling.launchpad.webapp.integrationtest.servlets.post.SlingAutoPropertiesTest)
  testWithSpecificValues(org.apache.sling.launchpad.webapp.integrationtest.servlets.post.SlingAutoPropertiesTest)
  testCreateNode(org.apache.sling.launchpad.webapp.integrationtest.CreateNodeTest)
  testCreateNodeMultipart(org.apache.sling.launchpad.webapp.integrationtest.CreateNodeTest)
  testCreateNodeWithNodeType(org.apache.sling.launchpad.webapp.integrationtest.CreateNodeTest)
  testCreateNewNodeWithNodeType(org.apache.sling.launchpad.webapp.integrationtest.CreateNodeTest)
  testDeepCreateNodeWithNodeType(org.apache.sling.launchpad.webapp.integrationtest.CreateNodeTest)
  testCreateEmptyNode(org.apache.sling.launchpad.webapp.integrationtest.CreateNodeTest)
  testFolderQuery(org.apache.sling.launchpad.webapp.integrationtest.JsonQueryServletTest)
  testSubFolderQuery(org.apache.sling.launchpad.webapp.integrationtest.JsonQueryServletTest)
  testDefaultQueryType(org.apache.sling.launchpad.webapp.integrationtest.JsonQueryServletTest)
  testSql(org.apache.sling.launchpad.webapp.integrationtest.JsonQueryServletTest)
  testOffset(org.apache.sling.launchpad.webapp.integrationtest.JsonQueryServletTest)
  testRows(org.apache.sling.launchpad.webapp.integrationtest.JsonQueryServletTest)
  testPropertyParam(org.apache.sling.launchpad.webapp.integrationtest.JsonQueryServletTest)
  testGetStarHtml(org.apache.sling.launchpad.webapp.integrationtest.GetStarTest)
  testGetStarJson(org.apache.sling.launchpad.webapp.integrationtest.GetStarTest)
  testGetStarWithScript(org.apache.sling.launchpad.webapp.integrationtest.GetStarTest)
  testRedirect302(org.apache.sling.launchpad.webapp.integrationtest.RedirectTest)
  testRedirect404(org.apache.sling.launchpad.webapp.integrationtest.RedirectTest)
  testRedirectJson(org.apache.sling.launchpad.webapp.integrationtest.RedirectTest)
  testRedirectJson2(org.apache.sling.launchpad.webapp.integrationtest.RedirectTest)
  testUploadAndDelete(org.apache.sling.launchpad.webapp.integrationtest.FileUploadTest)
  testSessionInfo(org.apache.sling.launchpad.webapp.integrationtest.servlets.post.SlingSessionInfoTest)
  testNonexistentSlingUrl(org.apache.sling.launchpad.webapp.integrationtest.servlets.post.SlingSessionInfoTest)
  testCopyNodeAbsolute(org.apache.sling.launchpad.webapp.integrationtest.servlets.post.PostServletCopyTest)
  testCopyNodeRelative(org.apache.sling.launchpad.webapp.integrationtest.servlets.post.PostServletCopyTest)
  testCopyNodeNew(org.apache.sling.launchpad.webapp.integrationtest.servlets.post.PostServletCopyTest)
  testCopyNodeNew2(org.apache.sling.launchpad.webapp.integrationtest.servlets.post.PostServletCopyTest)
  testCopyNodeExistingFail(org.apache.sling.launchpad.webapp.integrationtest.servlets.post.PostServletCopyTest)
  testCopyNodeExistingReplace(org.apache.sling.launchpad.webapp.integrationtest.servlets.post.PostServletCopyTest)
  testCopyNodeDeep(org.apache.sling.launchpad.webapp.integrationtest.servlets.post.PostServletCopyTest)
  testCopyNodeDeepFail(org.apache.sling.launchpad.webapp.integrationtest.servlets.post.PostServletCopyTest)
  testEspBuiltinObjects(org.apache.sling.launchpad.webapp.integrationtest.ScriptBuiltinObjectsTest)
  testNoSyntheticResourceTest(org.apache.sling.launchpad.webapp.integrationtest.SyntheticResourceTest)
  testPlainTextFile(org.apache.sling.launchpad.webapp.integrationtest.StreamServletTest)
  testHtmlFile(org.apache.sling.launchpad.webapp.integrationtest.StreamServletTest)
  testJavascriptFile(org.apache.sling.launchpad.webapp.integrationtest.StreamServletTest)
  testJsonFile(org.apache.sling.launchpad.webapp.integrationtest.StreamServletTest)
  testForcedRedirect(org.apache.sling.launchpad.webapp.integrationtest.PostRedirectTest)
  testDefaultRedirect(org.apache.sling.launchpad.webapp.integrationtest.PostRedirectTest)
  testMagicStarRedirect(org.apache.sling.launchpad.webapp.integrationtest.PostRedirectTest)
  testMagicStarRedirectPrefix(org.apache.sling.launchpad.webapp.integrationtest.PostRedirectTest)
  testMagicStarRedirectSuffix(org.apache.sling.launchpad.webapp.integrationtest.PostRedirectTest)
  testMagicStarRedirectPrefixSuffix(org.apache.sling.launchpad.webapp.integrationtest.PostRedirectTest)
  testWebServerRoot(org.apache.sling.launchpad.webapp.integrationtest.HttpPingTest)
  test404(org.apache.sling.launchpad.webapp.integrationtest.HttpPingTest)

Tests run: 146, Failures: 146, Errors: 0, Skipped: 0

[INFO] ------------------------------------------------------------------------
[ERROR] BUILD FAILURE
[INFO] ------------------------------------------------------------------------
[INFO] There are test failures.
[INFO] ------------------------------------------------------------------------
[INFO] For more information, run Maven with the -e switch
[INFO] ------------------------------------------------------------------------
[INFO] Total time: 1 minute 57 seconds
[INFO] Finished at: Tue Apr 29 23:34:34 PDT 2008
[INFO] Final Memory: 13M/30M
[INFO] ------------------------------------------------------------------------
2008-04-29 23:34:34.300::INFO:  Shutdown hook executing
2008-04-29 23:34:34.895::INFO:  Shutdown hook complete

****************************************************************************



Mime
View raw message