shiro-dev mailing list archives

Site index · List index
Message view « Date » · « Thread »
Top « Date » · « Thread »
From Jared Bunting <jared.bunt...@peachjean.com>
Subject Re: Guice sample test failure
Date Sun, 17 Jun 2012 21:25:41 GMT
I'm not sure.  How are you building it?  I just ran a full build on a 
fresh checkout, and it ran through fine.

On Sun 17 Jun 2012 07:41:46 AM CDT, jleleu wrote:
> Hi,
>
> When building the source trunk, I encounter a test failure on guice sample :
>
> -------------------------------------------------------------------------------
> Test set: org.apache.shiro.samples.guice.ContainerIntegrationTest
> -------------------------------------------------------------------------------
> Tests run: 2, Failures: 1, Errors: 0, Skipped: 0, Time elapsed: 6.217 sec
> <<< FAILURE!
> logInAndRememberMe(org.apache.shiro.samples.guice.ContainerIntegrationTest)
> Time elapsed: 2.19 sec  <<< FAILURE!
> java.lang.AssertionError: The page does not contain a form named
> 'loginform'.
> 	at
> com.gargoylesoftware.htmlunit.WebAssert.assertFormPresent(WebAssert.java:309)
> 	at
> org.apache.shiro.samples.guice.ContainerIntegrationTest.logInAndRememberMe(ContainerIntegrationTest.java:76)
> 	at sun.reflect.NativeMethodAccessorImpl.invoke0(Native Method)
>
> Am I missing something ?
>
> Thanks.
> Best regards,
> Jérôme
>
>
> --
> View this message in context: http://shiro-developer.582600.n2.nabble.com/Guice-sample-test-failure-tp7577489.html
> Sent from the Shiro Developer mailing list archive at Nabble.com.



Mime
View raw message