servicemix-commits mailing list archives

Site index · List index
Message view « Date » · « Thread »
Top « Date » · « Thread »
From Apache Jenkins Server <jenk...@builds.apache.org>
Subject Build failed in Jenkins: ServiceMix-Bundles #322
Date Tue, 24 Jan 2012 16:44:49 GMT
See <https://builds.apache.org/job/ServiceMix-Bundles/322/changes>

Changes:

[jbonofre] [SMX4-919] Resuming inclusion of sources artifact in bundles

------------------------------------------
[...truncated 2229 lines...]
[JENKINS] Archiving <https://builds.apache.org/job/ServiceMix-Bundles/ws/smx4-bundles/bcpg-jdk16-1.46/dependency-reduced-pom.xml>
to /home/hudson/hudson/jobs/ServiceMix-Bundles/modules/org.apache.servicemix.bundles$org.apache.servicemix.bundles.bcpg-jdk16/builds/2012-01-24_16-32-17/archive/org.apache.servicemix.bundles/org.apache.servicemix.bundles.bcpg-jdk16/1.46_2-SNAPSHOT/org.apache.servicemix.bundles.bcpg-jdk16-1.46_2-SNAPSHOT.pom
[JENKINS] Archiving <https://builds.apache.org/job/ServiceMix-Bundles/ws/smx4-bundles/bcpg-jdk16-1.46/target/org.apache.servicemix.bundles.bcpg-jdk16-1.46_2-SNAPSHOT.jar>
to /home/hudson/hudson/jobs/ServiceMix-Bundles/modules/org.apache.servicemix.bundles$org.apache.servicemix.bundles.bcpg-jdk16/builds/2012-01-24_16-32-17/archive/org.apache.servicemix.bundles/org.apache.servicemix.bundles.bcpg-jdk16/1.46_2-SNAPSHOT/org.apache.servicemix.bundles.bcpg-jdk16-1.46_2-SNAPSHOT.jar
[JENKINS] Archiving <https://builds.apache.org/job/ServiceMix-Bundles/ws/smx4-bundles/bcpg-jdk16-1.46/target/org.apache.servicemix.bundles.bcpg-jdk16-1.46_2-SNAPSHOT-sources.jar>
to /home/hudson/hudson/jobs/ServiceMix-Bundles/modules/org.apache.servicemix.bundles$org.apache.servicemix.bundles.bcpg-jdk16/builds/2012-01-24_16-32-17/archive/org.apache.servicemix.bundles/org.apache.servicemix.bundles.bcpg-jdk16/1.46_2-SNAPSHOT/org.apache.servicemix.bundles.bcpg-jdk16-1.46_2-SNAPSHOT-sources.jar
[INFO] Downloading: http://repo1.maven.org/maven2/org/apache/maven/plugins/maven-jarsigner-plugin/1.2/maven-jarsigner-plugin-1.2.pom
                                                                        
[INFO] ------------------------------------------------------------------------
[INFO] Building Apache ServiceMix :: Bundles :: bcprov-jdk15 1.46_3-SNAPSHOT
[INFO] ------------------------------------------------------------------------
Downloaded: http://repo1.maven.org/maven2/org/apache/maven/plugins/maven-jarsigner-plugin/1.2/maven-jarsigner-plugin-1.2.pom
(6 KB at 14.5 KB/sec)
Downloading: http://repo1.maven.org/maven2/org/apache/maven/plugins/maven-jarsigner-plugin/1.2/maven-jarsigner-plugin-1.2.jar
Downloaded: http://repo1.maven.org/maven2/org/apache/maven/plugins/maven-jarsigner-plugin/1.2/maven-jarsigner-plugin-1.2.jar
(28 KB at 59.2 KB/sec)
Downloading: http://repo1.maven.org/maven2/org/apache/maven/plugins/maven-antrun-plugin/1.7/maven-antrun-plugin-1.7.pom
Downloaded: http://repo1.maven.org/maven2/org/apache/maven/plugins/maven-antrun-plugin/1.7/maven-antrun-plugin-1.7.pom
(5 KB at 8.3 KB/sec)
Downloading: http://repo1.maven.org/maven2/org/apache/maven/plugins/maven-plugins/22/maven-plugins-22.pom
Downloaded: http://repo1.maven.org/maven2/org/apache/maven/plugins/maven-plugins/22/maven-plugins-22.pom
(13 KB at 25.4 KB/sec)
Downloading: http://repo1.maven.org/maven2/org/apache/maven/maven-parent/21/maven-parent-21.pom
Downloaded: http://repo1.maven.org/maven2/org/apache/maven/maven-parent/21/maven-parent-21.pom
(26 KB at 52.0 KB/sec)
Downloading: http://repo1.maven.org/maven2/org/apache/maven/plugins/maven-antrun-plugin/1.7/maven-antrun-plugin-1.7.jar
Downloaded: http://repo1.maven.org/maven2/org/apache/maven/plugins/maven-antrun-plugin/1.7/maven-antrun-plugin-1.7.jar
(31 KB at 61.1 KB/sec)
Downloading: http://repo1.maven.org/maven2/org/bouncycastle/bcprov-jdk15/1.46/bcprov-jdk15-1.46-sources.jar
Downloaded: http://repo1.maven.org/maven2/org/bouncycastle/bcprov-jdk15/1.46/bcprov-jdk15-1.46-sources.jar
(1354 KB at 1428.0 KB/sec)
[INFO] 
[INFO] --- maven-clean-plugin:2.3:clean (default-clean) @ org.apache.servicemix.bundles.bcprov-jdk15
---
[INFO] Downloading: http://repo1.maven.org/maven2/org/apache/maven/maven-plugin-api/2.0.11/maven-plugin-api-2.0.11.pom

[INFO] --- maven-antrun-plugin:1.7:run (default) @ org.apache.servicemix.bundles.bcprov-jdk15
---
Downloaded: http://repo1.maven.org/maven2/org/apache/maven/maven-plugin-api/2.0.11/maven-plugin-api-2.0.11.pom
(2 KB at 4.0 KB/sec)
Downloading: http://repo1.maven.org/maven2/org/apache/maven/maven/2.0.11/maven-2.0.11.pom
Downloaded: http://repo1.maven.org/maven2/org/apache/maven/maven/2.0.11/maven-2.0.11.pom (22
KB at 42.8 KB/sec)
Downloading: http://repo1.maven.org/maven2/org/apache/maven/maven-parent/12/maven-parent-12.pom
Downloaded: http://repo1.maven.org/maven2/org/apache/maven/maven-parent/12/maven-parent-12.pom
(22 KB at 42.6 KB/sec)
Downloading: http://repo1.maven.org/maven2/org/apache/maven/maven-project/2.0.11/maven-project-2.0.11.pom
Downloaded: http://repo1.maven.org/maven2/org/apache/maven/maven-project/2.0.11/maven-project-2.0.11.pom
(3 KB at 5.5 KB/sec)
Downloading: http://repo1.maven.org/maven2/org/apache/maven/maven-settings/2.0.11/maven-settings-2.0.11.pom
Downloaded: http://repo1.maven.org/maven2/org/apache/maven/maven-settings/2.0.11/maven-settings-2.0.11.pom
(3 KB at 4.3 KB/sec)
Downloading: http://repo1.maven.org/maven2/org/apache/maven/maven-model/2.0.11/maven-model-2.0.11.pom
Downloaded: http://repo1.maven.org/maven2/org/apache/maven/maven-model/2.0.11/maven-model-2.0.11.pom
(4 KB at 6.4 KB/sec)
Downloading: http://repo1.maven.org/maven2/org/codehaus/plexus/plexus-interpolation/1.1/plexus-interpolation-1.1.pom
Downloaded: http://repo1.maven.org/maven2/org/codehaus/plexus/plexus-interpolation/1.1/plexus-interpolation-1.1.pom
(2 KB at 2.7 KB/sec)
Downloading: http://repo1.maven.org/maven2/org/apache/maven/maven-profile/2.0.11/maven-profile-2.0.11.pom
Downloaded: http://repo1.maven.org/maven2/org/apache/maven/maven-profile/2.0.11/maven-profile-2.0.11.pom
(2 KB at 4.2 KB/sec)
Downloading: http://repo1.maven.org/maven2/org/apache/maven/maven-artifact-manager/2.0.11/maven-artifact-manager-2.0.11.pom
Downloaded: http://repo1.maven.org/maven2/org/apache/maven/maven-artifact-manager/2.0.11/maven-artifact-manager-2.0.11.pom
(3 KB at 5.2 KB/sec)
Downloading: http://repo1.maven.org/maven2/org/apache/maven/maven-repository-metadata/2.0.11/maven-repository-metadata-2.0.11.pom
Downloaded: http://repo1.maven.org/maven2/org/apache/maven/maven-repository-metadata/2.0.11/maven-repository-metadata-2.0.11.pom
(3 KB at 4.4 KB/sec)
Downloading: http://repo1.maven.org/maven2/org/apache/maven/maven-artifact/2.0.11/maven-artifact-2.0.11.pom
Downloaded: http://repo1.maven.org/maven2/org/apache/maven/maven-artifact/2.0.11/maven-artifact-2.0.11.pom
(2 KB at 3.1 KB/sec)
Downloading: http://repo1.maven.org/maven2/org/apache/maven/maven-plugin-registry/2.0.11/maven-plugin-registry-2.0.11.pom
Downloaded: http://repo1.maven.org/maven2/org/apache/maven/maven-plugin-registry/2.0.11/maven-plugin-registry-2.0.11.pom
(2 KB at 3.8 KB/sec)
Downloading: http://repo1.maven.org/maven2/org/codehaus/plexus/plexus-interpolation/1.1/plexus-interpolation-1.1.jar
Downloaded: http://repo1.maven.org/maven2/org/codehaus/plexus/plexus-interpolation/1.1/plexus-interpolation-1.1.jar
(35 KB at 70.0 KB/sec)
[INFO] Executing tasks

main:
     [echo] This bundle requires jar signing. In order to properly jar sign this bundle, you
     [echo]                                     will need the following:
     [echo]                                     1. Create a keystore using the keytool that
ships with your jdk.
     [echo]                                     keytool -genkeypair -alias [alias] -keyalg
RSA -keystore [path].
     [echo]                                     2. Add the required keystore properties [keystore,alias,keypass,storepass]
inside
     [echo]                                     your maven profile [settings.xml]
[INFO] Executed tasks
[INFO] [INFO] Configured Artifact: org.apache.servicemix.legal:legal:1.0:xml
[INFO] Copying legal-1.0.xml to <https://builds.apache.org/job/ServiceMix-Bundles/ws/smx4-bundles/bcprov-jdk15-1.46/target/legal/legal.xml>

[INFO] --- maven-dependency-plugin:2.3:copy (copy-legal) @ org.apache.servicemix.bundles.bcprov-jdk15
---
[INFO] 
[INFO] --- maven-remote-resources-plugin:1.2.1:process (default) @ org.apache.servicemix.bundles.bcprov-jdk15
---
[INFO] [INFO] Using 'UTF-8' encoding to copy filtered resources.
[INFO] Copying 1 resource
[INFO] Copying 3 resources

[INFO] --- maven-resources-plugin:2.4:resources (default-resources) @ org.apache.servicemix.bundles.bcprov-jdk15
---
[INFO] [INFO] No sources to compile

[INFO] --- maven-compiler-plugin:2.3.2:compile (default-compile) @ org.apache.servicemix.bundles.bcprov-jdk15
---
[INFO] [INFO] Using 'UTF-8' encoding to copy filtered resources.
[INFO] skip non existing resourceDirectory <https://builds.apache.org/job/ServiceMix-Bundles/ws/smx4-bundles/bcprov-jdk15-1.46/src/test/resources>
[INFO] Copying 3 resources

[INFO] --- maven-resources-plugin:2.4:testResources (default-testResources) @ org.apache.servicemix.bundles.bcprov-jdk15
---
[INFO] No sources to compile
[INFO] 
[INFO] --- maven-compiler-plugin:2.3.2:testCompile (default-testCompile) @ org.apache.servicemix.bundles.bcprov-jdk15
---
[INFO] [INFO] Tests are skipped.

[INFO] --- maven-surefire-plugin:2.9:test (default-test) @ org.apache.servicemix.bundles.bcprov-jdk15
---
[INFO] 
[INFO] --- maven-bundle-plugin:2.3.6:bundle (default-bundle) @ org.apache.servicemix.bundles.bcprov-jdk15
---
[WARNING] Bundle org.apache.servicemix.bundles:org.apache.servicemix.bundles.bcprov-jdk15:bundle:1.46_3-SNAPSHOT
: Did not find matching referal for !org.bouncycastle.*
[INFO] [INFO] Excluding org.bouncycastle:bcprov-jdk15:jar:1.46 from the shaded jar.
[INFO] Including org.bouncycastle:bcprov-jdk15:jar:sources:1.46 in the shaded jar.

[INFO] --- maven-shade-plugin:1.4:shade (sources) @ org.apache.servicemix.bundles.bcprov-jdk15
---
[INFO] Attaching shaded artifact.
[INFO] [INFO] Including org.bouncycastle:bcprov-jdk15:jar:1.46 in the shaded jar.
[INFO] Including org.bouncycastle:bcprov-jdk15:jar:sources:1.46 in the shaded jar.

[INFO] --- maven-shade-plugin:1.4:shade (default) @ org.apache.servicemix.bundles.bcprov-jdk15
---
[INFO] Replacing original artifact with shaded artifact.
[INFO] Replacing <https://builds.apache.org/job/ServiceMix-Bundles/ws/smx4-bundles/bcprov-jdk15-1.46/target/org.apache.servicemix.bundles.bcprov-jdk15-1.46_3-SNAPSHOT.jar>
with <https://builds.apache.org/job/ServiceMix-Bundles/ws/smx4-bundles/bcprov-jdk15-1.46/target/org.apache.servicemix.bundles.bcprov-jdk15-1.46_3-SNAPSHOT-shaded.jar>
[INFO] 
[INFO] --- maven-jarsigner-plugin:1.2:sign (package) @ org.apache.servicemix.bundles.bcprov-jdk15
---
[JENKINS] Archiving <https://builds.apache.org/job/ServiceMix-Bundles/ws/smx4-bundles/bcprov-jdk15-1.46/dependency-reduced-pom.xml>
to /home/hudson/hudson/jobs/ServiceMix-Bundles/modules/org.apache.servicemix.bundles$org.apache.servicemix.bundles.bcprov-jdk15/builds/2012-01-24_16-32-17/archive/org.apache.servicemix.bundles/org.apache.servicemix.bundles.bcprov-jdk15/1.46_3-SNAPSHOT/org.apache.servicemix.bundles.bcprov-jdk15-1.46_3-SNAPSHOT.pom
[JENKINS] Archiving <https://builds.apache.org/job/ServiceMix-Bundles/ws/smx4-bundles/bcprov-jdk15-1.46/target/org.apache.servicemix.bundles.bcprov-jdk15-1.46_3-SNAPSHOT.jar>
to /home/hudson/hudson/jobs/ServiceMix-Bundles/modules/org.apache.servicemix.bundles$org.apache.servicemix.bundles.bcprov-jdk15/builds/2012-01-24_16-32-17/archive/org.apache.servicemix.bundles/org.apache.servicemix.bundles.bcprov-jdk15/1.46_3-SNAPSHOT/org.apache.servicemix.bundles.bcprov-jdk15-1.46_3-SNAPSHOT.jar
[JENKINS] Archiving <https://builds.apache.org/job/ServiceMix-Bundles/ws/smx4-bundles/bcprov-jdk15-1.46/target/org.apache.servicemix.bundles.bcprov-jdk15-1.46_3-SNAPSHOT-sources.jar>
to /home/hudson/hudson/jobs/ServiceMix-Bundles/modules/org.apache.servicemix.bundles$org.apache.servicemix.bundles.bcprov-jdk15/builds/2012-01-24_16-32-17/archive/org.apache.servicemix.bundles/org.apache.servicemix.bundles.bcprov-jdk15/1.46_3-SNAPSHOT/org.apache.servicemix.bundles.bcprov-jdk15-1.46_3-SNAPSHOT-sources.jar
[INFO] ------------------------------------------------------------------------
[INFO] Reactor Summary:
[INFO] 
[INFO] Apache ServiceMix :: Bundles ...................... SUCCESS [49.212s]
[INFO] Apache ServiceMix :: Bundles :: abdera ............ SUCCESS [30.430s]
[INFO] Apache ServiceMix :: Bundles :: ant ............... SUCCESS [6.134s]
[INFO] Apache ServiceMix :: Bundles :: ant ............... SUCCESS [5.134s]
[INFO] Apache ServiceMix :: Bundles :: antlr ............. SUCCESS [5.177s]
[INFO] Apache ServiceMix :: Bundles :: antlr ............. SUCCESS [23.393s]
[INFO] Apache ServiceMix :: Bundles :: antlr-runtime ..... SUCCESS [3.406s]
[INFO] Apache ServiceMix :: Bundles :: antlr-runtime ..... SUCCESS [5.351s]
[INFO] Apache ServiceMix :: Bundles :: antlr-runtime ..... SUCCESS [2.908s]
[INFO] Apache ServiceMix :: Bundles :: aopalliance ....... SUCCESS [3.159s]
[INFO] Apache ServiceMix :: Bundles :: asm ............... SUCCESS [3.531s]
[INFO] Apache ServiceMix :: Bundles :: asm ............... SUCCESS [3.134s]
[INFO] Apache ServiceMix :: Bundles :: aspectj ........... SUCCESS [5.604s]
[INFO] Apache ServiceMix :: Bundles :: Atlassian XMLRPC .. SUCCESS [10.637s]
[INFO] Apache ServiceMix :: Bundles :: avro .............. SUCCESS [4.181s]
[INFO] Apache ServiceMix :: Bundles :: avro-ipc .......... SUCCESS [4.296s]
[INFO] Apache ServiceMix :: Bundles :: aws-java-sdk ...... SUCCESS [15.355s]
[INFO] Apache ServiceMix :: Bundles :: aws-java-sdk ...... SUCCESS [25.035s]
[INFO] Apache ServiceMix :: Bundles :: aws-java-sdk ...... SUCCESS [14.184s]
[INFO] Apache ServiceMix :: Bundles :: axiom-api ......... SUCCESS [16.433s]
[INFO] Apache ServiceMix :: Bundles :: axiom-impl ........ SUCCESS [4.489s]
[INFO] Apache ServiceMix :: Bundles :: bcpg-jdk15 ........ SUCCESS [14.199s]
[INFO] Apache ServiceMix :: Bundles :: bcpg-jdk16 ........ SUCCESS [7.503s]
[INFO] Apache ServiceMix :: Bundles :: bcprov-jdk15 ...... FAILURE [15.227s]
[INFO] Apache ServiceMix :: Bundles :: bcprov-jdk16 ...... SKIPPED
[INFO] Apache ServiceMix :: Bundles :: beanlib ........... SKIPPED
[INFO] Apache ServiceMix :: Bundles :: casbah_2.8.1 ...... SKIPPED
[INFO] Apache ServiceMix :: Bundles :: castor ............ SKIPPED
[INFO] Apache ServiceMix :: Bundles :: castor ............ SKIPPED
[INFO] Apache ServiceMix :: Bundles :: cglib ............. SKIPPED
[INFO] Apache ServiceMix :: Bundles :: cometd-java-server  SKIPPED
[INFO] Apache ServiceMix :: Bundles :: commons-beanutils . SKIPPED
[INFO] Apache ServiceMix :: Bundles :: commons-codec ..... SKIPPED
[INFO] Apache ServiceMix :: Bundles :: commons-collections  SKIPPED
[INFO] Apache ServiceMix :: Bundles :: commons-configuration  SKIPPED
[INFO] Apache ServiceMix :: Bundles :: commons-dbcp ...... SKIPPED
[INFO] Apache ServiceMix :: Bundles :: commons-digester .. SKIPPED
[INFO] Apache ServiceMix :: Bundles :: commons-httpclient  SKIPPED
[INFO] Apache ServiceMix :: Bundles :: commons-io ........ SKIPPED
[INFO] Apache ServiceMix :: Bundles :: commons-lang ...... SKIPPED
[INFO] Apache ServiceMix :: Bundles :: commons-net ....... SKIPPED
[INFO] Apache ServiceMix :: Bundles :: commons-pool ...... SKIPPED
[INFO] Apache ServiceMix :: Bundles :: commons-validator . SKIPPED
[INFO] Apache ServiceMix :: Bundles :: dbunit ............ SKIPPED
[INFO] Apache ServiceMix :: Bundles :: derbynet .......... SKIPPED
[INFO] Apache ServiceMix :: Bundles :: dom4j ............. SKIPPED
[INFO] Apache ServiceMix :: Bundles :: dozer ............. SKIPPED
[INFO] Apache ServiceMix :: Bundles :: drools ............ SKIPPED
[INFO] Apache ServiceMix :: Bundles :: ehcache ........... SKIPPED
[INFO] Apache ServiceMix :: Bundles :: ehcache ........... SKIPPED
[INFO] Apache ServiceMix :: Bundles :: FastInfoset ....... SKIPPED
[INFO] Apache ServiceMix :: Bundles :: fop ............... SKIPPED
[INFO] Apache ServiceMix :: Bundles :: freemarker ........ SKIPPED
[INFO] Apache ServiceMix :: Bundles :: Google App Engine (GAE)  SKIPPED
[INFO] Apache ServiceMix :: Bundles :: guava ............. SKIPPED
[INFO] Apache ServiceMix :: Bundles :: guava ............. SKIPPED
[INFO] Apache ServiceMix :: Bundles :: gwt-dev ........... SKIPPED
[INFO] Apache ServiceMix :: Bundles :: gwt-user .......... SKIPPED
[INFO] Apache ServiceMix :: Bundles :: smack ............. SKIPPED
[INFO] Apache ServiceMix :: Bundles :: paranamer ......... SKIPPED
[INFO] Apache ServiceMix :: Bundles :: jopt-simple ....... SKIPPED
[INFO] Apache ServiceMix :: Bundles :: not-yet-commons-ssl  SKIPPED
[INFO] Apache ServiceMix :: Bundles :: twitter4j ......... SKIPPED
[INFO] Apache ServiceMix :: Bundles :: libthrift ......... SKIPPED
[INFO] Apache ServiceMix :: Bundles :: libthrift ......... SKIPPED
[INFO] Apache ServiceMix :: Bundles :: snappy-java ....... SKIPPED
[INFO] Apache ServiceMix :: Bundles :: saxon9he .......... SKIPPED
[INFO] Apache ServiceMix :: Bundles :: saxon9he .......... SKIPPED
[INFO] Apache ServiceMix :: Bundles :: junit ............. SKIPPED
[INFO] Apache ServiceMix :: Bundles :: scala-compiler .... SKIPPED
[INFO] Apache ServiceMix :: Bundles :: hadoop-core ....... SKIPPED
[INFO] Apache ServiceMix :: Bundles :: jain-sip-ri ....... SKIPPED
[INFO] Apache ServiceMix :: Bundles :: japex ............. SKIPPED
[INFO] Apache ServiceMix :: Bundles :: jasper ............ SKIPPED
[INFO] Apache ServiceMix :: Bundles :: jasypt ............ SKIPPED
[INFO] Apache ServiceMix :: Bundles :: jaxen ............. SKIPPED
[INFO] Apache ServiceMix :: Bundles :: jaxp-ri ........... SKIPPED
[INFO] Apache ServiceMix :: Bundles :: jdom .............. SKIPPED
[INFO] Apache ServiceMix :: Bundles :: cometd-server ..... SKIPPED
[INFO] Apache ServiceMix :: Bundles :: jsch .............. SKIPPED
[INFO] Apache ServiceMix :: Bundles :: lucene-core ....... SKIPPED
[INFO] Apache ServiceMix :: Bundles :: ognl .............. SKIPPED
[INFO] Apache ServiceMix :: Bundles :: oscache ........... SKIPPED
[INFO] Apache ServiceMix :: Bundles :: perf4j ............ SKIPPED
[INFO] Apache ServiceMix :: Bundles :: protobuf-java ..... SKIPPED
[INFO] Apache ServiceMix :: Bundles :: quartz ............ SKIPPED
[INFO] Apache ServiceMix :: Bundles :: saaj-impl ......... SKIPPED
[INFO] Apache ServiceMix :: Bundles :: snmp4j ............ SKIPPED
[INFO] Apache ServiceMix :: Bundles :: stringtemplate .... SKIPPED
[INFO] Apache ServiceMix :: Bundles :: tagsoup ........... SKIPPED
[INFO] Apache ServiceMix :: Bundles :: xercesImpl ........ SKIPPED
[INFO] Apache ServiceMix :: Bundles :: xfire ............. SKIPPED
[INFO] Apache ServiceMix :: Bundles :: velocity-tools .... SKIPPED
[INFO] Apache ServiceMix :: Bundles ...................... SKIPPED
[INFO] ------------------------------------------------------------------------
[INFO] BUILD FAILURE
[INFO] ------------------------------------------------------------------------
[INFO] Total time: 12:17.867s
[INFO] Finished at: Tue Jan 24 16:44:46 UTC 2012
[INFO] Final Memory: 29M/137M
[INFO] ------------------------------------------------------------------------
mavenExecutionResult exceptions not empty
message : Failed to execute goal org.apache.maven.plugins:maven-jarsigner-plugin:1.2:sign
(package) on project org.apache.servicemix.bundles.bcprov-jdk15: The parameters 'alias' for
goal org.apache.maven.plugins:maven-jarsigner-plugin:1.2:sign are missing or invalid
cause : The parameters 'alias' for goal org.apache.maven.plugins:maven-jarsigner-plugin:1.2:sign
are missing or invalid
Stack trace : 
org.apache.maven.lifecycle.LifecycleExecutionException: Failed to execute goal org.apache.maven.plugins:maven-jarsigner-plugin:1.2:sign
(package) on project org.apache.servicemix.bundles.bcprov-jdk15: The parameters 'alias' for
goal org.apache.maven.plugins:maven-jarsigner-plugin:1.2:sign are missing or invalid
	at org.apache.maven.lifecycle.internal.MojoExecutor.execute(MojoExecutor.java:221)
	at org.apache.maven.lifecycle.internal.MojoExecutor.execute(MojoExecutor.java:153)
	at org.apache.maven.lifecycle.internal.MojoExecutor.execute(MojoExecutor.java:145)
	at org.apache.maven.lifecycle.internal.LifecycleModuleBuilder.buildProject(LifecycleModuleBuilder.java:84)
	at org.apache.maven.lifecycle.internal.LifecycleModuleBuilder.buildProject(LifecycleModuleBuilder.java:59)
	at org.apache.maven.lifecycle.internal.LifecycleStarter.singleThreadedBuild(LifecycleStarter.java:183)
	at org.apache.maven.lifecycle.internal.LifecycleStarter.execute(LifecycleStarter.java:161)
	at org.apache.maven.DefaultMaven.doExecute(DefaultMaven.java:319)
	at org.apache.maven.DefaultMaven.execute(DefaultMaven.java:156)
	at org.jvnet.hudson.maven3.launcher.Maven3Launcher.main(Maven3Launcher.java:79)
	at sun.reflect.NativeMethodAccessorImpl.invoke0(Native Method)
	at sun.reflect.NativeMethodAccessorImpl.invoke(NativeMethodAccessorImpl.java:39)
	at sun.reflect.DelegatingMethodAccessorImpl.invoke(DelegatingMethodAccessorImpl.java:25)
	at java.lang.reflect.Method.invoke(Method.java:597)
	at org.codehaus.plexus.classworlds.launcher.Launcher.launchStandard(Launcher.java:329)
	at org.codehaus.plexus.classworlds.launcher.Launcher.launch(Launcher.java:239)
	at org.jvnet.hudson.maven3.agent.Maven3Main.launch(Maven3Main.java:158)
	at hudson.maven.Maven3Builder.call(Maven3Builder.java:104)
	at hudson.maven.Maven3Builder.call(Maven3Builder.java:70)
	at hudson.remoting.UserRequest.perform(UserRequest.java:118)
	at hudson.remoting.UserRequest.perform(UserRequest.java:48)
	at hudson.remoting.Request$2.run(Request.java:287)
	at java.util.concurrent.Executors$RunnableAdapter.call(Executors.java:441)
	at java.util.concurrent.FutureTask$Sync.innerRun(FutureTask.java:303)
	at java.util.concurrent.FutureTask.run(FutureTask.java:138)
	at java.util.concurrent.ThreadPoolExecutor$Worker.runTask(ThreadPoolExecutor.java:886)
	at java.util.concurrent.ThreadPoolExecutor$Worker.run(ThreadPoolExecutor.java:908)
	at java.lang.Thread.run(Thread.java:662)
Caused by: org.apache.maven.plugin.PluginParameterException: The parameters 'alias' for goal
org.apache.maven.plugins:maven-jarsigner-plugin:1.2:sign are missing or invalid
	at org.apache.maven.plugin.internal.DefaultMavenPluginManager.populatePluginFields(DefaultMavenPluginManager.java:576)
	at org.apache.maven.plugin.internal.DefaultMavenPluginManager.getConfiguredMojo(DefaultMavenPluginManager.java:529)
	at org.apache.maven.plugin.DefaultBuildPluginManager.executeMojo(DefaultBuildPluginManager.java:92)
	at org.apache.maven.lifecycle.internal.MojoExecutor.execute(MojoExecutor.java:209)
	... 27 more
channel stopped


Mime
View raw message