servicemix-commits mailing list archives

Site index · List index
Message view « Date » · « Thread »
Top « Date » · « Thread »
From Apache Jenkins Server <jenk...@builds.apache.org>
Subject Build failed in Jenkins: ServiceMix-Bundles #323
Date Wed, 25 Jan 2012 03:00:48 GMT
See <https://builds.apache.org/job/ServiceMix-Bundles/323/changes>

Changes:

[jbonofre] [SMX4-919] Resuming inclusion of sources artifact in bundles

------------------------------------------
[...truncated 1663 lines...]

[INFO] --- maven-resources-plugin:2.4:testResources (default-testResources) @ org.apache.servicemix.bundles.bcpg-jdk16
---
[INFO] [INFO] No sources to compile

[INFO] --- maven-compiler-plugin:2.3.2:testCompile (default-testCompile) @ org.apache.servicemix.bundles.bcpg-jdk16
---
[INFO] [INFO] Tests are skipped.

[INFO] --- maven-surefire-plugin:2.9:test (default-test) @ org.apache.servicemix.bundles.bcpg-jdk16
---
[INFO] 
[INFO] --- maven-bundle-plugin:2.3.6:bundle (default-bundle) @ org.apache.servicemix.bundles.bcpg-jdk16
---
[WARNING] Bundle org.apache.servicemix.bundles:org.apache.servicemix.bundles.bcpg-jdk16:bundle:1.46_2-SNAPSHOT
: Did not find matching referal for !org.bouncycastle.*
[INFO] Excluding org.bouncycastle:bcpg-jdk16:jar:1.46 from the shaded jar.
[INFO] [INFO] Excluding org.bouncycastle:bcprov-jdk16:jar:1.46 from the shaded jar.
[INFO] Including org.bouncycastle:bcpg-jdk16:jar:sources:1.46 in the shaded jar.

[INFO] Attaching shaded artifact.
[INFO] --- maven-shade-plugin:1.4:shade (sources) @ org.apache.servicemix.bundles.bcpg-jdk16
---
[INFO] [INFO] Including org.bouncycastle:bcpg-jdk16:jar:1.46 in the shaded jar.
[INFO] Excluding org.bouncycastle:bcprov-jdk16:jar:1.46 from the shaded jar.
[INFO] Including org.bouncycastle:bcpg-jdk16:jar:sources:1.46 in the shaded jar.

[INFO] --- maven-shade-plugin:1.4:shade (default) @ org.apache.servicemix.bundles.bcpg-jdk16
---
[INFO] Replacing original artifact with shaded artifact.
[INFO] Replacing <https://builds.apache.org/job/ServiceMix-Bundles/ws/smx4-bundles/bcpg-jdk16-1.46/target/org.apache.servicemix.bundles.bcpg-jdk16-1.46_2-SNAPSHOT.jar>
with <https://builds.apache.org/job/ServiceMix-Bundles/ws/smx4-bundles/bcpg-jdk16-1.46/target/org.apache.servicemix.bundles.bcpg-jdk16-1.46_2-SNAPSHOT-shaded.jar>
[INFO] Installing <https://builds.apache.org/job/ServiceMix-Bundles/ws/smx4-bundles/bcpg-jdk16-1.46/target/org.apache.servicemix.bundles.bcpg-jdk16-1.46_2-SNAPSHOT.jar>
to <https://builds.apache.org/job/ServiceMix-Bundles/ws/.repository/org/apache/servicemix/bundles/org.apache.servicemix.bundles.bcpg-jdk16/1.46_2-SNAPSHOT/org.apache.servicemix.bundles.bcpg-jdk16-1.46_2-SNAPSHOT.jar>
[INFO] [INFO] Installing <https://builds.apache.org/job/ServiceMix-Bundles/ws/smx4-bundles/bcpg-jdk16-1.46/dependency-reduced-pom.xml>
to <https://builds.apache.org/job/ServiceMix-Bundles/ws/.repository/org/apache/servicemix/bundles/org.apache.servicemix.bundles.bcpg-jdk16/1.46_2-SNAPSHOT/org.apache.servicemix.bundles.bcpg-jdk16-1.46_2-SNAPSHOT.pom>
[INFO] Installing <https://builds.apache.org/job/ServiceMix-Bundles/ws/smx4-bundles/bcpg-jdk16-1.46/target/org.apache.servicemix.bundles.bcpg-jdk16-1.46_2-SNAPSHOT-sources.jar>
to <https://builds.apache.org/job/ServiceMix-Bundles/ws/.repository/org/apache/servicemix/bundles/org.apache.servicemix.bundles.bcpg-jdk16/1.46_2-SNAPSHOT/org.apache.servicemix.bundles.bcpg-jdk16-1.46_2-SNAPSHOT-sources.jar>

[INFO] --- maven-install-plugin:2.3:install (default-install) @ org.apache.servicemix.bundles.bcpg-jdk16
---
[INFO] 
[INFO] --- maven-bundle-plugin:2.3.6:install (default-install) @ org.apache.servicemix.bundles.bcpg-jdk16
---
[INFO] Installing org/apache/servicemix/bundles/org.apache.servicemix.bundles.bcpg-jdk16/1.46_2-SNAPSHOT/org.apache.servicemix.bundles.bcpg-jdk16-1.46_2-SNAPSHOT.jar
[INFO] Installing org/apache/servicemix/bundles/org.apache.servicemix.bundles.bcpg-jdk16/1.46_2-SNAPSHOT/org.apache.servicemix.bundles.bcpg-jdk16-1.46_2-SNAPSHOT-sources.jar
[INFO] Writing OBR metadata
[JENKINS] Archiving <https://builds.apache.org/job/ServiceMix-Bundles/ws/smx4-bundles/bcpg-jdk16-1.46/dependency-reduced-pom.xml>
to /home/hudson/hudson/jobs/ServiceMix-Bundles/modules/org.apache.servicemix.bundles$org.apache.servicemix.bundles.bcpg-jdk16/builds/2012-01-25_02-45-41/archive/org.apache.servicemix.bundles/org.apache.servicemix.bundles.bcpg-jdk16/1.46_2-SNAPSHOT/org.apache.servicemix.bundles.bcpg-jdk16-1.46_2-SNAPSHOT.pom
[JENKINS] Archiving <https://builds.apache.org/job/ServiceMix-Bundles/ws/smx4-bundles/bcpg-jdk16-1.46/target/org.apache.servicemix.bundles.bcpg-jdk16-1.46_2-SNAPSHOT.jar>
to /home/hudson/hudson/jobs/ServiceMix-Bundles/modules/org.apache.servicemix.bundles$org.apache.servicemix.bundles.bcpg-jdk16/builds/2012-01-25_02-45-41/archive/org.apache.servicemix.bundles/org.apache.servicemix.bundles.bcpg-jdk16/1.46_2-SNAPSHOT/org.apache.servicemix.bundles.bcpg-jdk16-1.46_2-SNAPSHOT.jar
[JENKINS] Archiving <https://builds.apache.org/job/ServiceMix-Bundles/ws/smx4-bundles/bcpg-jdk16-1.46/target/org.apache.servicemix.bundles.bcpg-jdk16-1.46_2-SNAPSHOT-sources.jar>
to /home/hudson/hudson/jobs/ServiceMix-Bundles/modules/org.apache.servicemix.bundles$org.apache.servicemix.bundles.bcpg-jdk16/builds/2012-01-25_02-45-41/archive/org.apache.servicemix.bundles/org.apache.servicemix.bundles.bcpg-jdk16/1.46_2-SNAPSHOT/org.apache.servicemix.bundles.bcpg-jdk16-1.46_2-SNAPSHOT-sources.jar
[INFO]                                                                         
[INFO] ------------------------------------------------------------------------
[INFO] Building Apache ServiceMix :: Bundles :: bcprov-jdk15 1.46_3-SNAPSHOT
[INFO] ------------------------------------------------------------------------
[INFO] Deleting file set: <https://builds.apache.org/job/ServiceMix-Bundles/ws/smx4-bundles/bcprov-jdk15-1.46/target>
(included: [**], excluded: [])
[INFO] 
[INFO] --- maven-clean-plugin:2.3:clean (default-clean) @ org.apache.servicemix.bundles.bcprov-jdk15
---
[INFO] 
[INFO] --- maven-antrun-plugin:1.7:run (default) @ org.apache.servicemix.bundles.bcprov-jdk15
---
[INFO] Executing tasks

main:
     [echo] This bundle requires jar signing. In order to properly jar sign this bundle, you
     [echo]                                     will need the following:
     [echo]                                     1. Create a keystore using the keytool that
ships with your jdk.
     [echo]                                     keytool -genkeypair -alias [alias] -keyalg
RSA -keystore [path].
     [echo]                                     2. Add the required keystore properties [keystore,alias,keypass,storepass]
inside
     [echo]                                     your maven profile [settings.xml]
[INFO] Executed tasks
[INFO] [INFO] Configured Artifact: org.apache.servicemix.legal:legal:1.0:xml
[INFO] Copying legal-1.0.xml to <https://builds.apache.org/job/ServiceMix-Bundles/ws/smx4-bundles/bcprov-jdk15-1.46/target/legal/legal.xml>

[INFO] --- maven-dependency-plugin:2.3:copy (copy-legal) @ org.apache.servicemix.bundles.bcprov-jdk15
---
[INFO] 
[INFO] --- maven-remote-resources-plugin:1.2.1:process (default) @ org.apache.servicemix.bundles.bcprov-jdk15
---
[INFO] [INFO] Using 'UTF-8' encoding to copy filtered resources.
[INFO] Copying 1 resource
[INFO] Copying 3 resources

[INFO] --- maven-resources-plugin:2.4:resources (default-resources) @ org.apache.servicemix.bundles.bcprov-jdk15
---
[INFO] [INFO] No sources to compile

[INFO] --- maven-compiler-plugin:2.3.2:compile (default-compile) @ org.apache.servicemix.bundles.bcprov-jdk15
---
[INFO] [INFO] Using 'UTF-8' encoding to copy filtered resources.
[INFO] skip non existing resourceDirectory <https://builds.apache.org/job/ServiceMix-Bundles/ws/smx4-bundles/bcprov-jdk15-1.46/src/test/resources>
[INFO] Copying 3 resources

[INFO] --- maven-resources-plugin:2.4:testResources (default-testResources) @ org.apache.servicemix.bundles.bcprov-jdk15
---
[INFO] [INFO] No sources to compile

[INFO] --- maven-compiler-plugin:2.3.2:testCompile (default-testCompile) @ org.apache.servicemix.bundles.bcprov-jdk15
---
[INFO] [INFO] Tests are skipped.

[INFO] --- maven-surefire-plugin:2.9:test (default-test) @ org.apache.servicemix.bundles.bcprov-jdk15
---
[INFO] 
[INFO] --- maven-bundle-plugin:2.3.6:bundle (default-bundle) @ org.apache.servicemix.bundles.bcprov-jdk15
---
[WARNING] Bundle org.apache.servicemix.bundles:org.apache.servicemix.bundles.bcprov-jdk15:bundle:1.46_3-SNAPSHOT
: Did not find matching referal for !org.bouncycastle.*
[INFO] Excluding org.bouncycastle:bcprov-jdk15:jar:1.46 from the shaded jar.
[INFO] [INFO] Including org.bouncycastle:bcprov-jdk15:jar:sources:1.46 in the shaded jar.

[INFO] --- maven-shade-plugin:1.4:shade (sources) @ org.apache.servicemix.bundles.bcprov-jdk15
---
[INFO] Attaching shaded artifact.
[INFO] Including org.bouncycastle:bcprov-jdk15:jar:1.46 in the shaded jar.
[INFO] [INFO] Including org.bouncycastle:bcprov-jdk15:jar:sources:1.46 in the shaded jar.

[INFO] --- maven-shade-plugin:1.4:shade (default) @ org.apache.servicemix.bundles.bcprov-jdk15
---
[INFO] Replacing original artifact with shaded artifact.
[INFO] Replacing <https://builds.apache.org/job/ServiceMix-Bundles/ws/smx4-bundles/bcprov-jdk15-1.46/target/org.apache.servicemix.bundles.bcprov-jdk15-1.46_3-SNAPSHOT.jar>
with <https://builds.apache.org/job/ServiceMix-Bundles/ws/smx4-bundles/bcprov-jdk15-1.46/target/org.apache.servicemix.bundles.bcprov-jdk15-1.46_3-SNAPSHOT-shaded.jar>
[INFO] 
[INFO] --- maven-jarsigner-plugin:1.2:sign (package) @ org.apache.servicemix.bundles.bcprov-jdk15
---
[JENKINS] Archiving <https://builds.apache.org/job/ServiceMix-Bundles/ws/smx4-bundles/bcprov-jdk15-1.46/dependency-reduced-pom.xml>
to /home/hudson/hudson/jobs/ServiceMix-Bundles/modules/org.apache.servicemix.bundles$org.apache.servicemix.bundles.bcprov-jdk15/builds/2012-01-25_02-45-41/archive/org.apache.servicemix.bundles/org.apache.servicemix.bundles.bcprov-jdk15/1.46_3-SNAPSHOT/org.apache.servicemix.bundles.bcprov-jdk15-1.46_3-SNAPSHOT.pom
[JENKINS] Archiving <https://builds.apache.org/job/ServiceMix-Bundles/ws/smx4-bundles/bcprov-jdk15-1.46/target/org.apache.servicemix.bundles.bcprov-jdk15-1.46_3-SNAPSHOT.jar>
to /home/hudson/hudson/jobs/ServiceMix-Bundles/modules/org.apache.servicemix.bundles$org.apache.servicemix.bundles.bcprov-jdk15/builds/2012-01-25_02-45-41/archive/org.apache.servicemix.bundles/org.apache.servicemix.bundles.bcprov-jdk15/1.46_3-SNAPSHOT/org.apache.servicemix.bundles.bcprov-jdk15-1.46_3-SNAPSHOT.jar
[JENKINS] Archiving <https://builds.apache.org/job/ServiceMix-Bundles/ws/smx4-bundles/bcprov-jdk15-1.46/target/org.apache.servicemix.bundles.bcprov-jdk15-1.46_3-SNAPSHOT-sources.jar>
to /home/hudson/hudson/jobs/ServiceMix-Bundles/modules/org.apache.servicemix.bundles$org.apache.servicemix.bundles.bcprov-jdk15/builds/2012-01-25_02-45-41/archive/org.apache.servicemix.bundles/org.apache.servicemix.bundles.bcprov-jdk15/1.46_3-SNAPSHOT/org.apache.servicemix.bundles.bcprov-jdk15-1.46_3-SNAPSHOT-sources.jar
[INFO] ------------------------------------------------------------------------
[INFO] Reactor Summary:
[INFO] 
[INFO] Apache ServiceMix :: Bundles ...................... SUCCESS [1:09.527s]
[INFO] Apache ServiceMix :: Bundles :: abdera ............ SUCCESS [7.678s]
[INFO] Apache ServiceMix :: Bundles :: ant ............... SUCCESS [11.124s]
[INFO] Apache ServiceMix :: Bundles :: ant ............... SUCCESS [11.543s]
[INFO] Apache ServiceMix :: Bundles :: antlr ............. SUCCESS [9.980s]
[INFO] Apache ServiceMix :: Bundles :: antlr ............. SUCCESS [10.425s]
[INFO] Apache ServiceMix :: Bundles :: antlr-runtime ..... SUCCESS [2.300s]
[INFO] Apache ServiceMix :: Bundles :: antlr-runtime ..... SUCCESS [2.314s]
[INFO] Apache ServiceMix :: Bundles :: antlr-runtime ..... SUCCESS [8.611s]
[INFO] Apache ServiceMix :: Bundles :: aopalliance ....... SUCCESS [8.277s]
[INFO] Apache ServiceMix :: Bundles :: asm ............... SUCCESS [8.521s]
[INFO] Apache ServiceMix :: Bundles :: asm ............... SUCCESS [10.670s]
[INFO] Apache ServiceMix :: Bundles :: aspectj ........... SUCCESS [10.682s]
[INFO] Apache ServiceMix :: Bundles :: Atlassian XMLRPC .. SUCCESS [9.456s]
[INFO] Apache ServiceMix :: Bundles :: avro .............. SUCCESS [9.376s]
[INFO] Apache ServiceMix :: Bundles :: avro-ipc .......... SUCCESS [16.044s]
[INFO] Apache ServiceMix :: Bundles :: aws-java-sdk ...... SUCCESS [17.463s]
[INFO] Apache ServiceMix :: Bundles :: aws-java-sdk ...... SUCCESS [16.377s]
[INFO] Apache ServiceMix :: Bundles :: aws-java-sdk ...... SUCCESS [18.274s]
[INFO] Apache ServiceMix :: Bundles :: axiom-api ......... SUCCESS [3.103s]
[INFO] Apache ServiceMix :: Bundles :: axiom-impl ........ SUCCESS [2.255s]
[INFO] Apache ServiceMix :: Bundles :: bcpg-jdk15 ........ SUCCESS [15.359s]
[INFO] Apache ServiceMix :: Bundles :: bcpg-jdk16 ........ SUCCESS [5.855s]
[INFO] Apache ServiceMix :: Bundles :: bcprov-jdk15 ...... FAILURE [5.950s]
[INFO] Apache ServiceMix :: Bundles :: bcprov-jdk16 ...... SKIPPED
[INFO] Apache ServiceMix :: Bundles :: beanlib ........... SKIPPED
[INFO] Apache ServiceMix :: Bundles :: casbah_2.8.1 ...... SKIPPED
[INFO] Apache ServiceMix :: Bundles :: castor ............ SKIPPED
[INFO] Apache ServiceMix :: Bundles :: castor ............ SKIPPED
[INFO] Apache ServiceMix :: Bundles :: cglib ............. SKIPPED
[INFO] Apache ServiceMix :: Bundles :: cometd-java-server  SKIPPED
[INFO] Apache ServiceMix :: Bundles :: commons-beanutils . SKIPPED
[INFO] Apache ServiceMix :: Bundles :: commons-codec ..... SKIPPED
[INFO] Apache ServiceMix :: Bundles :: commons-collections  SKIPPED
[INFO] Apache ServiceMix :: Bundles :: commons-configuration  SKIPPED
[INFO] Apache ServiceMix :: Bundles :: commons-dbcp ...... SKIPPED
[INFO] Apache ServiceMix :: Bundles :: commons-digester .. SKIPPED
[INFO] Apache ServiceMix :: Bundles :: commons-httpclient  SKIPPED
[INFO] Apache ServiceMix :: Bundles :: commons-io ........ SKIPPED
[INFO] Apache ServiceMix :: Bundles :: commons-lang ...... SKIPPED
[INFO] Apache ServiceMix :: Bundles :: commons-net ....... SKIPPED
[INFO] Apache ServiceMix :: Bundles :: commons-pool ...... SKIPPED
[INFO] Apache ServiceMix :: Bundles :: commons-validator . SKIPPED
[INFO] Apache ServiceMix :: Bundles :: dbunit ............ SKIPPED
[INFO] Apache ServiceMix :: Bundles :: derbynet .......... SKIPPED
[INFO] Apache ServiceMix :: Bundles :: dom4j ............. SKIPPED
[INFO] Apache ServiceMix :: Bundles :: dozer ............. SKIPPED
[INFO] Apache ServiceMix :: Bundles :: drools ............ SKIPPED
[INFO] Apache ServiceMix :: Bundles :: ehcache ........... SKIPPED
[INFO] Apache ServiceMix :: Bundles :: ehcache ........... SKIPPED
[INFO] Apache ServiceMix :: Bundles :: FastInfoset ....... SKIPPED
[INFO] Apache ServiceMix :: Bundles :: fop ............... SKIPPED
[INFO] Apache ServiceMix :: Bundles :: freemarker ........ SKIPPED
[INFO] Apache ServiceMix :: Bundles :: Google App Engine (GAE)  SKIPPED
[INFO] Apache ServiceMix :: Bundles :: guava ............. SKIPPED
[INFO] Apache ServiceMix :: Bundles :: guava ............. SKIPPED
[INFO] Apache ServiceMix :: Bundles :: gwt-dev ........... SKIPPED
[INFO] Apache ServiceMix :: Bundles :: gwt-user .......... SKIPPED
[INFO] Apache ServiceMix :: Bundles :: hibernate-validator  SKIPPED
[INFO] Apache ServiceMix :: Bundles :: howl .............. SKIPPED
[INFO] Apache ServiceMix :: Bundles :: irclib ............ SKIPPED
[INFO] Apache ServiceMix :: Bundles :: jain-sip-ri ....... SKIPPED
[INFO] Apache ServiceMix :: Bundles :: japex ............. SKIPPED
[INFO] Apache ServiceMix :: Bundles :: jasper ............ SKIPPED
[INFO] Apache ServiceMix :: Bundles :: jasypt ............ SKIPPED
[INFO] Apache ServiceMix :: Bundles :: apns .............. SKIPPED
[INFO] Apache ServiceMix :: Bundles :: java-xmlbuilder ... SKIPPED
[INFO] Apache ServiceMix :: Bundles :: smack ............. SKIPPED
[INFO] Apache ServiceMix :: Bundles :: paranamer ......... SKIPPED
[INFO] Apache ServiceMix :: Bundles :: jopt-simple ....... SKIPPED
[INFO] Apache ServiceMix :: Bundles :: not-yet-commons-ssl  SKIPPED
[INFO] Apache ServiceMix :: Bundles :: twitter4j ......... SKIPPED
[INFO] Apache ServiceMix :: Bundles :: libthrift ......... SKIPPED
[INFO] Apache ServiceMix :: Bundles :: libthrift ......... SKIPPED
[INFO] Apache ServiceMix :: Bundles :: snappy-java ....... SKIPPED
[INFO] Apache ServiceMix :: Bundles :: saxon9he .......... SKIPPED
[INFO] Apache ServiceMix :: Bundles :: saxon9he .......... SKIPPED
[INFO] Apache ServiceMix :: Bundles :: junit ............. SKIPPED
[INFO] Apache ServiceMix :: Bundles :: scala-compiler .... SKIPPED
[INFO] Apache ServiceMix :: Bundles :: hadoop-core ....... SKIPPED
[INFO] Apache ServiceMix :: Bundles :: jaxen ............. SKIPPED
[INFO] Apache ServiceMix :: Bundles :: jaxp-ri ........... SKIPPED
[INFO] Apache ServiceMix :: Bundles :: jdom .............. SKIPPED
[INFO] Apache ServiceMix :: Bundles :: cometd-server ..... SKIPPED
[INFO] Apache ServiceMix :: Bundles :: jsch .............. SKIPPED
[INFO] Apache ServiceMix :: Bundles :: lucene-core ....... SKIPPED
[INFO] Apache ServiceMix :: Bundles :: ognl .............. SKIPPED
[INFO] Apache ServiceMix :: Bundles :: oscache ........... SKIPPED
[INFO] Apache ServiceMix :: Bundles :: perf4j ............ SKIPPED
[INFO] Apache ServiceMix :: Bundles :: protobuf-java ..... SKIPPED
[INFO] Apache ServiceMix :: Bundles :: quartz ............ SKIPPED
[INFO] Apache ServiceMix :: Bundles :: saaj-impl ......... SKIPPED
[INFO] Apache ServiceMix :: Bundles :: snmp4j ............ SKIPPED
[INFO] Apache ServiceMix :: Bundles :: stringtemplate .... SKIPPED
[INFO] Apache ServiceMix :: Bundles :: tagsoup ........... SKIPPED
[INFO] Apache ServiceMix :: Bundles :: xercesImpl ........ SKIPPED
[INFO] Apache ServiceMix :: Bundles :: xfire ............. SKIPPED
[INFO] Apache ServiceMix :: Bundles :: velocity-tools .... SKIPPED
[INFO] Apache ServiceMix :: Bundles ...................... SKIPPED
[INFO] ------------------------------------------------------------------------
[INFO] BUILD FAILURE
[INFO] ------------------------------------------------------------------------
[INFO] Total time: 14:26.728s
[INFO] Finished at: Wed Jan 25 03:00:40 UTC 2012
[INFO] Final Memory: 28M/103M
[INFO] ------------------------------------------------------------------------
mavenExecutionResult exceptions not empty
message : Failed to execute goal org.apache.maven.plugins:maven-jarsigner-plugin:1.2:sign
(package) on project org.apache.servicemix.bundles.bcprov-jdk15: The parameters 'alias' for
goal org.apache.maven.plugins:maven-jarsigner-plugin:1.2:sign are missing or invalid
cause : The parameters 'alias' for goal org.apache.maven.plugins:maven-jarsigner-plugin:1.2:sign
are missing or invalid
Stack trace : 
org.apache.maven.lifecycle.LifecycleExecutionException: Failed to execute goal org.apache.maven.plugins:maven-jarsigner-plugin:1.2:sign
(package) on project org.apache.servicemix.bundles.bcprov-jdk15: The parameters 'alias' for
goal org.apache.maven.plugins:maven-jarsigner-plugin:1.2:sign are missing or invalid
	at org.apache.maven.lifecycle.internal.MojoExecutor.execute(MojoExecutor.java:221)
	at org.apache.maven.lifecycle.internal.MojoExecutor.execute(MojoExecutor.java:153)
	at org.apache.maven.lifecycle.internal.MojoExecutor.execute(MojoExecutor.java:145)
	at org.apache.maven.lifecycle.internal.LifecycleModuleBuilder.buildProject(LifecycleModuleBuilder.java:84)
	at org.apache.maven.lifecycle.internal.LifecycleModuleBuilder.buildProject(LifecycleModuleBuilder.java:59)
	at org.apache.maven.lifecycle.internal.LifecycleStarter.singleThreadedBuild(LifecycleStarter.java:183)
	at org.apache.maven.lifecycle.internal.LifecycleStarter.execute(LifecycleStarter.java:161)
	at org.apache.maven.DefaultMaven.doExecute(DefaultMaven.java:319)
	at org.apache.maven.DefaultMaven.execute(DefaultMaven.java:156)
	at org.jvnet.hudson.maven3.launcher.Maven3Launcher.main(Maven3Launcher.java:79)
	at sun.reflect.NativeMethodAccessorImpl.invoke0(Native Method)
	at sun.reflect.NativeMethodAccessorImpl.invoke(NativeMethodAccessorImpl.java:39)
	at sun.reflect.DelegatingMethodAccessorImpl.invoke(DelegatingMethodAccessorImpl.java:25)
	at java.lang.reflect.Method.invoke(Method.java:597)
	at org.codehaus.plexus.classworlds.launcher.Launcher.launchStandard(Launcher.java:329)
	at org.codehaus.plexus.classworlds.launcher.Launcher.launch(Launcher.java:239)
	at org.jvnet.hudson.maven3.agent.Maven3Main.launch(Maven3Main.java:158)
	at hudson.maven.Maven3Builder.call(Maven3Builder.java:104)
	at hudson.maven.Maven3Builder.call(Maven3Builder.java:70)
	at hudson.remoting.UserRequest.perform(UserRequest.java:118)
	at hudson.remoting.UserRequest.perform(UserRequest.java:48)
	at hudson.remoting.Request$2.run(Request.java:287)
	at java.util.concurrent.Executors$RunnableAdapter.call(Executors.java:441)
	at java.util.concurrent.FutureTask$Sync.innerRun(FutureTask.java:303)
	at java.util.concurrent.FutureTask.run(FutureTask.java:138)
	at java.util.concurrent.ThreadPoolExecutor$Worker.runTask(ThreadPoolExecutor.java:886)
	at java.util.concurrent.ThreadPoolExecutor$Worker.run(ThreadPoolExecutor.java:908)
	at java.lang.Thread.run(Thread.java:662)
Caused by: org.apache.maven.plugin.PluginParameterException: The parameters 'alias' for goal
org.apache.maven.plugins:maven-jarsigner-plugin:1.2:sign are missing or invalid
	at org.apache.maven.plugin.internal.DefaultMavenPluginManager.populatePluginFields(DefaultMavenPluginManager.java:576)
	at org.apache.maven.plugin.internal.DefaultMavenPluginManager.getConfiguredMojo(DefaultMavenPluginManager.java:529)
	at org.apache.maven.plugin.DefaultBuildPluginManager.executeMojo(DefaultBuildPluginManager.java:92)
	at org.apache.maven.lifecycle.internal.MojoExecutor.execute(MojoExecutor.java:209)
	... 27 more
channel stopped


Mime
View raw message