santuario-dev mailing list archives

Site index · List index
Message view « Date » · « Thread »
Top « Date » · « Thread »
From "Raul Benito" <r...@apache.org>
Subject Re: danshved@gmail.com
Date Wed, 16 Jul 2008 05:32:16 GMT
Umm strange, it seems that the problem is jsr105 code, and I think it
is some xpath related. Do you xalan in your jvm classpath?
It is used to give some problems with here() transformations.
Tell me if it helps.
But I think that Sean has test this a lot.

If not I will investigate more.


On Tue, Jul 15, 2008 at 9:49 PM, Daniil Shved <danshved@gmail.com> wrote:
>
> Of course. Here is the stdout of "ant test":
>
> Buildfile: build.xml
>  [taskdef] Could not load definitions from resource clovertasks. It could
> not be found.
>
> do.build.src:
>
> init:
>     [echo]
>     [echo]
> -------------------------------------------------------------------
>     [echo] --------- Apache-XML-Security-J v1.4.2 [2000-2008] -----------
>     [echo]
> -------------------------------------------------------------------
>     [echo] Building with Apache Ant version 1.7.0 compiled on August 16
> 2007
>     [echo] Java 1.6.0_07 located at /home/dan/jdk1.6.0_07/jre
>     [echo]
> -------------------------------------------------------------------
>     [echo]
>
> env.mk.dirs:
>
> do.check.bindist:
>
> build.src:
>
> build.test:
>
> test:
>   [delete] Deleting directory
> /home/dan/xml-security-1_4_2/build/docs/xml/junit
>   [delete] Deleting directory
> /home/dan/xml-security-1_4_2/build/docs/html/junit
>    [mkdir] Created dir: /home/dan/xml-security-1_4_2/build/docs/xml/junit
>    [mkdir] Created dir: /home/dan/xml-security-1_4_2/build/docs/html/junit
>    [junit] Running javax.xml.crypto.test.KeySelectorExceptionTest
>    [junit] Testsuite: javax.xml.crypto.test.KeySelectorExceptionTest
>    [junit] Tests run: 1, Failures: 0, Errors: 0, Time elapsed: 0,052 sec
>    [junit] Tests run: 1, Failures: 0, Errors: 0, Time elapsed: 0,052 sec
>    [junit]
>    [junit] Testcase: testConstructor took 0,006 sec
>    [junit] Running javax.xml.crypto.test.KeySelectorTest
>    [junit] Testsuite: javax.xml.crypto.test.KeySelectorTest
>    [junit] Tests run: 1, Failures: 0, Errors: 0, Time elapsed: 0,053 sec
>    [junit] Tests run: 1, Failures: 0, Errors: 0, Time elapsed: 0,053 sec
>    [junit]
>    [junit] Testcase: testselect took 0,012 sec
>    [junit] Running javax.xml.crypto.test.OctetStreamDataTest
>    [junit] Testsuite: javax.xml.crypto.test.OctetStreamDataTest
>    [junit] Tests run: 1, Failures: 0, Errors: 0, Time elapsed: 0,042 sec
>    [junit] Tests run: 1, Failures: 0, Errors: 0, Time elapsed: 0,042 sec
>    [junit]
>    [junit] Testcase: testConstructor took 0,002 sec
>    [junit] Running javax.xml.crypto.test.dsig.Baltimore18Test
>    [junit] Testsuite: javax.xml.crypto.test.dsig.Baltimore18Test
>    [junit] Tests run: 7, Failures: 0, Errors: 0, Time elapsed: 0,259 sec
>    [junit] Tests run: 7, Failures: 0, Errors: 0, Time elapsed: 0,259 sec
>    [junit]
>    [junit] Testcase: test_signature_keyname took 0,088 sec
>    [junit] Testcase: test_signature_retrievalmethod_rawx509crt took 0,016
> sec
>    [junit] Testcase: test_signature_x509_crt_crl took 0,019 sec
>    [junit] Testcase: test_signature_x509_crt took 0,021 sec
>    [junit] Testcase: test_signature_x509_is took 0,023 sec
>    [junit] Testcase: test_signature_x509_ski took 0,022 sec
>    [junit] Testcase: test_signature_x509_sn took 0,027 sec
>    [junit] Running javax.xml.crypto.test.dsig.Baltimore23Test
>    [junit] Testsuite: javax.xml.crypto.test.dsig.Baltimore23Test
>    [junit] Tests run: 16, Failures: 0, Errors: 0, Time elapsed: 2,11 sec
>    [junit] Tests run: 16, Failures: 0, Errors: 0, Time elapsed: 2,11 sec
>    [junit]
>    [junit] Testcase: test_signature_enveloped_dsa took 0,112 sec
>    [junit] Testcase: test_signature_enveloping_b64_dsa took 0,056 sec
>    [junit] Testcase: test_signature_enveloping_dsa took 0,055 sec
>    [junit] Testcase: test_signature_external_b64_dsa took 0,078 sec
>    [junit] Testcase: test_signature_external_dsa took 0,071 sec
>    [junit] Testcase: test_signature_enveloping_rsa took 0,013 sec
>    [junit] Testcase: test_signature_enveloping_hmac_sha1 took 0,501 sec
>    [junit] Testcase: test_signature_enveloping_hmac_sha1_40 took 0,009 sec
>    [junit] Testcase: test_signature_keyname took 0,103 sec
>    [junit] Testcase: test_signature_retrievalmethod_rawx509crt took 0,094
> sec
>    [junit] Testcase: test_signature_x509_crt_crl took 0,095 sec
>    [junit] Testcase: test_signature_x509_crt took 0,089 sec
>    [junit] Testcase: test_signature_x509_is took 0,102 sec
>    [junit] Testcase: test_signature_x509_ski took 0,092 sec
>    [junit] Testcase: test_signature_x509_sn took 0,074 sec
>    [junit] Testcase: test_signature took 0,521 sec
>    [junit] Running javax.xml.crypto.test.dsig.BaltimoreExcC14n1Test
>    [junit] Testsuite: javax.xml.crypto.test.dsig.BaltimoreExcC14n1Test
>    [junit] Tests run: 1, Failures: 0, Errors: 0, Time elapsed: 0,156 sec
>    [junit] Tests run: 1, Failures: 0, Errors: 0, Time elapsed: 0,156 sec
>    [junit]
>    [junit] Testcase: test_exc_signature took 0,117 sec
>    [junit] Running javax.xml.crypto.test.dsig.BaltimoreIaik2Test
>    [junit] Testsuite: javax.xml.crypto.test.dsig.BaltimoreIaik2Test
>    [junit] Tests run: 1, Failures: 0, Errors: 0, Time elapsed: 0,229 sec
>    [junit] Tests run: 1, Failures: 0, Errors: 0, Time elapsed: 0,229 sec
>    [junit]
>    [junit] Testcase: test_signature took 0,19 sec
>    [junit] Running
> javax.xml.crypto.test.dsig.BaltimoreXPathFilter2ThreeTest
>    [junit] Testsuite:
> javax.xml.crypto.test.dsig.BaltimoreXPathFilter2ThreeTest
>    [junit] Tests run: 2, Failures: 1, Errors: 0, Time elapsed: 0,956 sec
>    [junit] Tests run: 2, Failures: 1, Errors: 0, Time elapsed: 0,956 sec
>    [junit]
>    [junit] Testcase: test_sign_spec took 0,215 sec
>    [junit] Testcase: test_sign_xfdl took 0,7 sec
>    [junit]     FAILED
>    [junit] Signature failed core validation#1
>    [junit] junit.framework.AssertionFailedError: Signature failed core
> validation#1
>    [junit]     at
> javax.xml.crypto.test.dsig.BaltimoreXPathFilter2ThreeTest.test_sign_xfdl(Unknown
> Source)
>    [junit]
>    [junit] Running javax.xml.crypto.test.dsig.C14N11Test
>    [junit] Testsuite: javax.xml.crypto.test.dsig.C14N11Test
>    [junit] Tests run: 20, Failures: 0, Errors: 20, Time elapsed: 0,241 sec
>    [junit] Tests run: 20, Failures: 0, Errors: 20, Time elapsed: 0,241 sec
>    [junit] ------------- Standard Output ---------------
>    [junit] Validating xmlid-1-IAIK.xml
>    [junit] Validating xmlid-2-IAIK.xml
>    [junit] Validating xmlspace-1-IAIK.xml
>    [junit] Validating xmlspace-2-IAIK.xml
>    [junit] Validating xmlspace-3-IAIK.xml
>    [junit] Validating xmlspace-4-IAIK.xml
>    [junit] Validating xmllang-1-IAIK.xml
>    [junit] Validating xmllang-2-IAIK.xml
>    [junit] Validating xmllang-3-IAIK.xml
>    [junit] Validating xmllang-4-IAIK.xml
>    [junit] Validating xmlbase-prop-1-IAIK.xml
>    [junit] Validating xmlbase-prop-2-IAIK.xml
>    [junit] Validating xmlbase-prop-3-IAIK.xml
>    [junit] Validating xmlbase-prop-4-IAIK.xml
>    [junit] Validating xmlbase-prop-5-IAIK.xml
>    [junit] Validating xmlbase-prop-6-IAIK.xml
>    [junit] Validating xmlbase-prop-7-IAIK.xml
>    [junit] Validating xmlbase-c14n11spec-102-IAIK.xml
>    [junit] Validating xmlbase-c14n11spec2-102-IAIK.xml
>    [junit] Validating xmlbase-c14n11spec3-103-IAIK.xml
>    [junit] ------------- ---------------- ---------------
>    [junit]
>    [junit] Testcase: test_xmlid_1 took 0,056 sec
>    [junit]     Caused an ERROR
>    [junit] java.security.NoSuchAlgorithmException:
> http://www.w3.org/2006/12/xml-c14n11 algorithm and DOM mechanism not
> available
>    [junit] javax.xml.crypto.MarshalException:
> java.security.NoSuchAlgorithmException: http://www.w3.org/2006/12/xml-c14n11
> algorithm and DOM mechanism not available
>    [junit]     at
> org.jcp.xml.dsig.internal.dom.DOMTransform.<init>(DOMTransform.java:57)
>    [junit]     at
> org.jcp.xml.dsig.internal.dom.DOMCanonicalizationMethod.<init>(DOMCanonicalizationMethod.java:44)
>    [junit]     at
> org.jcp.xml.dsig.internal.dom.DOMSignedInfo.<init>(DOMSignedInfo.java:118)
>    [junit]     at
> org.jcp.xml.dsig.internal.dom.DOMXMLSignature.<init>(DOMXMLSignature.java:119)
>    [junit]     at
> org.jcp.xml.dsig.internal.dom.DOMXMLSignatureFactory.unmarshal(DOMXMLSignatureFactory.java:152)
>    [junit]     at
> org.jcp.xml.dsig.internal.dom.DOMXMLSignatureFactory.unmarshalXMLSignature(DOMXMLSignatureFactory.java:116)
>    [junit]     at
> javax.xml.crypto.test.dsig.SignatureValidator.validate(Unknown Source)
>    [junit]     at
> javax.xml.crypto.test.dsig.SignatureValidator.validate(Unknown Source)
>    [junit]     at
> javax.xml.crypto.test.dsig.SignatureValidator.validate(Unknown Source)
>    [junit]     at javax.xml.crypto.test.dsig.C14N11Test.test_c14n11(Unknown
> Source)
>    [junit]     at javax.xml.crypto.test.dsig.C14N11Test.test_xmlid_1(Unknown
> Source)
>    [junit] Caused by: java.security.NoSuchAlgorithmException:
> http://www.w3.org/2006/12/xml-c14n11 algorithm and DOM mechanism not
> available
>    [junit]     at
> javax.xml.crypto.dsig.TransformService.getInstance(TransformService.java:153)
>    [junit]     at
> org.jcp.xml.dsig.internal.dom.DOMTransform.<init>(DOMTransform.java:55)
>    [junit]
>    [junit] Testcase: test_xmlid_2 took 0,006 sec
>    [junit]     Caused an ERROR
>    [junit] java.security.NoSuchAlgorithmException:
> http://www.w3.org/2006/12/xml-c14n11 algorithm and DOM mechanism not
> available
>    [junit] javax.xml.crypto.MarshalException:
> java.security.NoSuchAlgorithmException: http://www.w3.org/2006/12/xml-c14n11
> algorithm and DOM mechanism not available
>    [junit]     at
> org.jcp.xml.dsig.internal.dom.DOMTransform.<init>(DOMTransform.java:57)
>    [junit]     at
> org.jcp.xml.dsig.internal.dom.DOMCanonicalizationMethod.<init>(DOMCanonicalizationMethod.java:44)
>    [junit]     at
> org.jcp.xml.dsig.internal.dom.DOMSignedInfo.<init>(DOMSignedInfo.java:118)
>    [junit]     at
> org.jcp.xml.dsig.internal.dom.DOMXMLSignature.<init>(DOMXMLSignature.java:119)
>    [junit]     at
> org.jcp.xml.dsig.internal.dom.DOMXMLSignatureFactory.unmarshal(DOMXMLSignatureFactory.java:152)
>    [junit]     at
> org.jcp.xml.dsig.internal.dom.DOMXMLSignatureFactory.unmarshalXMLSignature(DOMXMLSignatureFactory.java:116)
>    [junit]     at
> javax.xml.crypto.test.dsig.SignatureValidator.validate(Unknown Source)
>    [junit]     at
> javax.xml.crypto.test.dsig.SignatureValidator.validate(Unknown Source)
>    [junit]     at
> javax.xml.crypto.test.dsig.SignatureValidator.validate(Unknown Source)
>    [junit]     at javax.xml.crypto.test.dsig.C14N11Test.test_c14n11(Unknown
> Source)
>    [junit]     at javax.xml.crypto.test.dsig.C14N11Test.test_xmlid_2(Unknown
> Source)
>    [junit] Caused by: java.security.NoSuchAlgorithmException:
> http://www.w3.org/2006/12/xml-c14n11 algorithm and DOM mechanism not
> available
>    [junit]     at
> javax.xml.crypto.dsig.TransformService.getInstance(TransformService.java:153)
>    [junit]     at
> org.jcp.xml.dsig.internal.dom.DOMTransform.<init>(DOMTransform.java:55)
>    [junit]
>    [junit] Testcase: test_xmlspace_1 took 0,006 sec
>    [junit]     Caused an ERROR
>    [junit] java.security.NoSuchAlgorithmException:
> http://www.w3.org/2006/12/xml-c14n11 algorithm and DOM mechanism not
> available
>    [junit] javax.xml.crypto.MarshalException:
> java.security.NoSuchAlgorithmException: http://www.w3.org/2006/12/xml-c14n11
> algorithm and DOM mechanism not available
>    [junit]     at
> org.jcp.xml.dsig.internal.dom.DOMTransform.<init>(DOMTransform.java:57)
>    [junit]     at
> org.jcp.xml.dsig.internal.dom.DOMCanonicalizationMethod.<init>(DOMCanonicalizationMethod.java:44)
>    [junit]     at
> org.jcp.xml.dsig.internal.dom.DOMSignedInfo.<init>(DOMSignedInfo.java:118)
>    [junit]     at
> org.jcp.xml.dsig.internal.dom.DOMXMLSignature.<init>(DOMXMLSignature.java:119)
>    [junit]     at
> org.jcp.xml.dsig.internal.dom.DOMXMLSignatureFactory.unmarshal(DOMXMLSignatureFactory.java:152)
>    [junit]     at
> org.jcp.xml.dsig.internal.dom.DOMXMLSignatureFactory.unmarshalXMLSignature(DOMXMLSignatureFactory.java:116)
>    [junit]     at
> javax.xml.crypto.test.dsig.SignatureValidator.validate(Unknown Source)
>    [junit]     at
> javax.xml.crypto.test.dsig.SignatureValidator.validate(Unknown Source)
>    [junit]     at
> javax.xml.crypto.test.dsig.SignatureValidator.validate(Unknown Source)
>    [junit]     at javax.xml.crypto.test.dsig.C14N11Test.test_c14n11(Unknown
> Source)
>    [junit]     at
> javax.xml.crypto.test.dsig.C14N11Test.test_xmlspace_1(Unknown Source)
>    [junit] Caused by: java.security.NoSuchAlgorithmException:
> http://www.w3.org/2006/12/xml-c14n11 algorithm and DOM mechanism not
> available
>    [junit]     at
> javax.xml.crypto.dsig.TransformService.getInstance(TransformService.java:153)
>    [junit]     at
> org.jcp.xml.dsig.internal.dom.DOMTransform.<init>(DOMTransform.java:55)
>    [junit]
>    [junit] Testcase: test_xmlspace_2 took 0,006 sec
>    [junit]     Caused an ERROR
>    [junit] java.security.NoSuchAlgorithmException:
> http://www.w3.org/2006/12/xml-c14n11 algorithm and DOM mechanism not
> available
>    [junit] javax.xml.crypto.MarshalException:
> java.security.NoSuchAlgorithmException: http://www.w3.org/2006/12/xml-c14n11
> algorithm and DOM mechanism not available
>    [junit]     at
> org.jcp.xml.dsig.internal.dom.DOMTransform.<init>(DOMTransform.java:57)
>    [junit]     at
> org.jcp.xml.dsig.internal.dom.DOMCanonicalizationMethod.<init>(DOMCanonicalizationMethod.java:44)
>    [junit]     at
> org.jcp.xml.dsig.internal.dom.DOMSignedInfo.<init>(DOMSignedInfo.java:118)
>    [junit]     at
> org.jcp.xml.dsig.internal.dom.DOMXMLSignature.<init>(DOMXMLSignature.java:119)
>    [junit]     at
> org.jcp.xml.dsig.internal.dom.DOMXMLSignatureFactory.unmarshal(DOMXMLSignatureFactory.java:152)
>    [junit]     at
> org.jcp.xml.dsig.internal.dom.DOMXMLSignatureFactory.unmarshalXMLSignature(DOMXMLSignatureFactory.java:116)
>    [junit]     at
> javax.xml.crypto.test.dsig.SignatureValidator.validate(Unknown Source)
>    [junit]     at
> javax.xml.crypto.test.dsig.SignatureValidator.validate(Unknown Source)
>    [junit]     at
> javax.xml.crypto.test.dsig.SignatureValidator.validate(Unknown Source)
>    [junit]     at javax.xml.crypto.test.dsig.C14N11Test.test_c14n11(Unknown
> Source)
>    [junit]     at
> javax.xml.crypto.test.dsig.C14N11Test.test_xmlspace_2(Unknown Source)
>    [junit] Caused by: java.security.NoSuchAlgorithmException:
> http://www.w3.org/2006/12/xml-c14n11 algorithm and DOM mechanism not
> available
>    [junit]     at
> javax.xml.crypto.dsig.TransformService.getInstance(TransformService.java:153)
>    [junit]     at
> org.jcp.xml.dsig.internal.dom.DOMTransform.<init>(DOMTransform.java:55)
>    [junit]
>    [junit] Testcase: test_xmlspace_3 took 0,006 sec
>    [junit]     Caused an ERROR
>    [junit] java.security.NoSuchAlgorithmException:
> http://www.w3.org/2006/12/xml-c14n11 algorithm and DOM mechanism not
> available
>    [junit] javax.xml.crypto.MarshalException:
> java.security.NoSuchAlgorithmException: http://www.w3.org/2006/12/xml-c14n11
> algorithm and DOM mechanism not available
>    [junit]     at
> org.jcp.xml.dsig.internal.dom.DOMTransform.<init>(DOMTransform.java:57)
>    [junit]     at
> org.jcp.xml.dsig.internal.dom.DOMCanonicalizationMethod.<init>(DOMCanonicalizationMethod.java:44)
>    [junit]     at
> org.jcp.xml.dsig.internal.dom.DOMSignedInfo.<init>(DOMSignedInfo.java:118)
>    [junit]     at
> org.jcp.xml.dsig.internal.dom.DOMXMLSignature.<init>(DOMXMLSignature.java:119)
>    [junit]     at
> org.jcp.xml.dsig.internal.dom.DOMXMLSignatureFactory.unmarshal(DOMXMLSignatureFactory.java:152)
>    [junit]     at
> org.jcp.xml.dsig.internal.dom.DOMXMLSignatureFactory.unmarshalXMLSignature(DOMXMLSignatureFactory.java:116)
>    [junit]     at
> javax.xml.crypto.test.dsig.SignatureValidator.validate(Unknown Source)
>    [junit]     at
> javax.xml.crypto.test.dsig.SignatureValidator.validate(Unknown Source)
>    [junit]     at
> javax.xml.crypto.test.dsig.SignatureValidator.validate(Unknown Source)
>    [junit]     at javax.xml.crypto.test.dsig.C14N11Test.test_c14n11(Unknown
> Source)
>    [junit]     at
> javax.xml.crypto.test.dsig.C14N11Test.test_xmlspace_3(Unknown Source)
>    [junit] Caused by: java.security.NoSuchAlgorithmException:
> http://www.w3.org/2006/12/xml-c14n11 algorithm and DOM mechanism not
> available
>    [junit]     at
> javax.xml.crypto.dsig.TransformService.getInstance(TransformService.java:153)
>    [junit]     at
> org.jcp.xml.dsig.internal.dom.DOMTransform.<init>(DOMTransform.java:55)
>    [junit]
>    [junit] Testcase: test_xmlspace_4 took 0,006 sec
>    [junit]     Caused an ERROR
>    [junit] java.security.NoSuchAlgorithmException:
> http://www.w3.org/2006/12/xml-c14n11 algorithm and DOM mechanism not
> available
>    [junit] javax.xml.crypto.MarshalException:
> java.security.NoSuchAlgorithmException: http://www.w3.org/2006/12/xml-c14n11
> algorithm and DOM mechanism not available
>    [junit]     at
> org.jcp.xml.dsig.internal.dom.DOMTransform.<init>(DOMTransform.java:57)
>    [junit]     at
> org.jcp.xml.dsig.internal.dom.DOMCanonicalizationMethod.<init>(DOMCanonicalizationMethod.java:44)
>    [junit]     at
> org.jcp.xml.dsig.internal.dom.DOMSignedInfo.<init>(DOMSignedInfo.java:118)
>    [junit]     at
> org.jcp.xml.dsig.internal.dom.DOMXMLSignature.<init>(DOMXMLSignature.java:119)
>    [junit]     at
> org.jcp.xml.dsig.internal.dom.DOMXMLSignatureFactory.unmarshal(DOMXMLSignatureFactory.java:152)
>    [junit]     at
> org.jcp.xml.dsig.internal.dom.DOMXMLSignatureFactory.unmarshalXMLSignature(DOMXMLSignatureFactory.java:116)
>    [junit]     at
> javax.xml.crypto.test.dsig.SignatureValidator.validate(Unknown Source)
>    [junit]     at
> javax.xml.crypto.test.dsig.SignatureValidator.validate(Unknown Source)
>    [junit]     at
> javax.xml.crypto.test.dsig.SignatureValidator.validate(Unknown Source)
>    [junit]     at javax.xml.crypto.test.dsig.C14N11Test.test_c14n11(Unknown
> Source)
>    [junit]     at
> javax.xml.crypto.test.dsig.C14N11Test.test_xmlspace_4(Unknown Source)
>    [junit] Caused by: java.security.NoSuchAlgorithmException:
> http://www.w3.org/2006/12/xml-c14n11 algorithm and DOM mechanism not
> available
>    [junit]     at
> javax.xml.crypto.dsig.TransformService.getInstance(TransformService.java:153)
>    [junit]     at
> org.jcp.xml.dsig.internal.dom.DOMTransform.<init>(DOMTransform.java:55)
>    [junit]
>    [junit] Testcase: test_xmllang_1 took 0,006 sec
>    [junit]     Caused an ERROR
>    [junit] java.security.NoSuchAlgorithmException:
> http://www.w3.org/2006/12/xml-c14n11 algorithm and DOM mechanism not
> available
>    [junit] javax.xml.crypto.MarshalException:
> java.security.NoSuchAlgorithmException: http://www.w3.org/2006/12/xml-c14n11
> algorithm and DOM mechanism not available
>    [junit]     at
> org.jcp.xml.dsig.internal.dom.DOMTransform.<init>(DOMTransform.java:57)
>    [junit]     at
> org.jcp.xml.dsig.internal.dom.DOMCanonicalizationMethod.<init>(DOMCanonicalizationMethod.java:44)
>    [junit]     at
> org.jcp.xml.dsig.internal.dom.DOMSignedInfo.<init>(DOMSignedInfo.java:118)
>    [junit]     at
> org.jcp.xml.dsig.internal.dom.DOMXMLSignature.<init>(DOMXMLSignature.java:119)
>    [junit]     at
> org.jcp.xml.dsig.internal.dom.DOMXMLSignatureFactory.unmarshal(DOMXMLSignatureFactory.java:152)
>    [junit]     at
> org.jcp.xml.dsig.internal.dom.DOMXMLSignatureFactory.unmarshalXMLSignature(DOMXMLSignatureFactory.java:116)
>    [junit]     at
> javax.xml.crypto.test.dsig.SignatureValidator.validate(Unknown Source)
>    [junit]     at
> javax.xml.crypto.test.dsig.SignatureValidator.validate(Unknown Source)
>    [junit]     at
> javax.xml.crypto.test.dsig.SignatureValidator.validate(Unknown Source)
>    [junit]     at javax.xml.crypto.test.dsig.C14N11Test.test_c14n11(Unknown
> Source)
>    [junit]     at javax.xml.crypto.test.dsig.C14N11Test.test_xmllang_1(Unknown
> Source)
>    [junit] Caused by: java.security.NoSuchAlgorithmException:
> http://www.w3.org/2006/12/xml-c14n11 algorithm and DOM mechanism not
> available
>    [junit]     at
> javax.xml.crypto.dsig.TransformService.getInstance(TransformService.java:153)
>    [junit]     at
> org.jcp.xml.dsig.internal.dom.DOMTransform.<init>(DOMTransform.java:55)
>    [junit]
>    [junit] Testcase: test_xmllang_2 took 0,006 sec
>    [junit]     Caused an ERROR
>    [junit] java.security.NoSuchAlgorithmException:
> http://www.w3.org/2006/12/xml-c14n11 algorithm and DOM mechanism not
> available
>    [junit] javax.xml.crypto.MarshalException:
> java.security.NoSuchAlgorithmException: http://www.w3.org/2006/12/xml-c14n11
> algorithm and DOM mechanism not available
>    [junit]     at
> org.jcp.xml.dsig.internal.dom.DOMTransform.<init>(DOMTransform.java:57)
>    [junit]     at
> org.jcp.xml.dsig.internal.dom.DOMCanonicalizationMethod.<init>(DOMCanonicalizationMethod.java:44)
>    [junit]     at
> org.jcp.xml.dsig.internal.dom.DOMSignedInfo.<init>(DOMSignedInfo.java:118)
>    [junit]     at
> org.jcp.xml.dsig.internal.dom.DOMXMLSignature.<init>(DOMXMLSignature.java:119)
>    [junit]     at
> org.jcp.xml.dsig.internal.dom.DOMXMLSignatureFactory.unmarshal(DOMXMLSignatureFactory.java:152)
>    [junit]     at
> org.jcp.xml.dsig.internal.dom.DOMXMLSignatureFactory.unmarshalXMLSignature(DOMXMLSignatureFactory.java:116)
>    [junit]     at
> javax.xml.crypto.test.dsig.SignatureValidator.validate(Unknown Source)
>    [junit]     at
> javax.xml.crypto.test.dsig.SignatureValidator.validate(Unknown Source)
>    [junit]     at
> javax.xml.crypto.test.dsig.SignatureValidator.validate(Unknown Source)
>    [junit]     at javax.xml.crypto.test.dsig.C14N11Test.test_c14n11(Unknown
> Source)
>    [junit]     at javax.xml.crypto.test.dsig.C14N11Test.test_xmllang_2(Unknown
> Source)
>    [junit] Caused by: java.security.NoSuchAlgorithmException:
> http://www.w3.org/2006/12/xml-c14n11 algorithm and DOM mechanism not
> available
>    [junit]     at
> javax.xml.crypto.dsig.TransformService.getInstance(TransformService.java:153)
>    [junit]     at
> org.jcp.xml.dsig.internal.dom.DOMTransform.<init>(DOMTransform.java:55)
>    [junit]
>    [junit] Testcase: test_xmllang_3 took 0,007 sec
>    [junit]     Caused an ERROR
>    [junit] java.security.NoSuchAlgorithmException:
> http://www.w3.org/2006/12/xml-c14n11 algorithm and DOM mechanism not
> available
>    [junit] javax.xml.crypto.MarshalException:
> java.security.NoSuchAlgorithmException: http://www.w3.org/2006/12/xml-c14n11
> algorithm and DOM mechanism not available
>    [junit]     at
> org.jcp.xml.dsig.internal.dom.DOMTransform.<init>(DOMTransform.java:57)
>    [junit]     at
> org.jcp.xml.dsig.internal.dom.DOMCanonicalizationMethod.<init>(DOMCanonicalizationMethod.java:44)
>    [junit]     at
> org.jcp.xml.dsig.internal.dom.DOMSignedInfo.<init>(DOMSignedInfo.java:118)
>    [junit]     at
> org.jcp.xml.dsig.internal.dom.DOMXMLSignature.<init>(DOMXMLSignature.java:119)
>    [junit]     at
> org.jcp.xml.dsig.internal.dom.DOMXMLSignatureFactory.unmarshal(DOMXMLSignatureFactory.java:152)
>    [junit]     at
> org.jcp.xml.dsig.internal.dom.DOMXMLSignatureFactory.unmarshalXMLSignature(DOMXMLSignatureFactory.java:116)
>    [junit]     at
> javax.xml.crypto.test.dsig.SignatureValidator.validate(Unknown Source)
>    [junit]     at
> javax.xml.crypto.test.dsig.SignatureValidator.validate(Unknown Source)
>    [junit]     at
> javax.xml.crypto.test.dsig.SignatureValidator.validate(Unknown Source)
>    [junit]     at javax.xml.crypto.test.dsig.C14N11Test.test_c14n11(Unknown
> Source)
>    [junit]     at javax.xml.crypto.test.dsig.C14N11Test.test_xmllang_3(Unknown
> Source)
>    [junit] Caused by: java.security.NoSuchAlgorithmException:
> http://www.w3.org/2006/12/xml-c14n11 algorithm and DOM mechanism not
> available
>    [junit]     at
> javax.xml.crypto.dsig.TransformService.getInstance(TransformService.java:153)
>    [junit]     at
> org.jcp.xml.dsig.internal.dom.DOMTransform.<init>(DOMTransform.java:55)
>    [junit]
>    [junit] Testcase: test_xmllang_4 took 0,006 sec
>    [junit]     Caused an ERROR
>    [junit] java.security.NoSuchAlgorithmException:
> http://www.w3.org/2006/12/xml-c14n11 algorithm and DOM mechanism not
> available
>    [junit] javax.xml.crypto.MarshalException:
> java.security.NoSuchAlgorithmException: http://www.w3.org/2006/12/xml-c14n11
> algorithm and DOM mechanism not available
>    [junit]     at
> org.jcp.xml.dsig.internal.dom.DOMTransform.<init>(DOMTransform.java:57)
>    [junit]     at
> org.jcp.xml.dsig.internal.dom.DOMCanonicalizationMethod.<init>(DOMCanonicalizationMethod.java:44)
>    [junit]     at
> org.jcp.xml.dsig.internal.dom.DOMSignedInfo.<init>(DOMSignedInfo.java:118)
>    [junit]     at
> org.jcp.xml.dsig.internal.dom.DOMXMLSignature.<init>(DOMXMLSignature.java:119)
>    [junit]     at
> org.jcp.xml.dsig.internal.dom.DOMXMLSignatureFactory.unmarshal(DOMXMLSignatureFactory.java:152)
>    [junit]     at
> org.jcp.xml.dsig.internal.dom.DOMXMLSignatureFactory.unmarshalXMLSignature(DOMXMLSignatureFactory.java:116)
>    [junit]     at
> javax.xml.crypto.test.dsig.SignatureValidator.validate(Unknown Source)
>    [junit]     at
> javax.xml.crypto.test.dsig.SignatureValidator.validate(Unknown Source)
>    [junit]     at
> javax.xml.crypto.test.dsig.SignatureValidator.validate(Unknown Source)
>    [junit]     at javax.xml.crypto.test.dsig.C14N11Test.test_c14n11(Unknown
> Source)
>    [junit]     at javax.xml.crypto.test.dsig.C14N11Test.test_xmllang_4(Unknown
> Source)
>    [junit] Caused by: java.security.NoSuchAlgorithmException:
> http://www.w3.org/2006/12/xml-c14n11 algorithm and DOM mechanism not
> available
>    [junit]     at
> javax.xml.crypto.dsig.TransformService.getInstance(TransformService.java:153)
>    [junit]     at
> org.jcp.xml.dsig.internal.dom.DOMTransform.<init>(DOMTransform.java:55)
>    [junit]
>    [junit] Testcase: test_xmlbase_prop_1 took 0,006 sec
>    [junit]     Caused an ERROR
>    [junit] java.security.NoSuchAlgorithmException:
> http://www.w3.org/2006/12/xml-c14n11 algorithm and DOM mechanism not
> available
>    [junit] javax.xml.crypto.MarshalException:
> java.security.NoSuchAlgorithmException: http://www.w3.org/2006/12/xml-c14n11
> algorithm and DOM mechanism not available
>    [junit]     at
> org.jcp.xml.dsig.internal.dom.DOMTransform.<init>(DOMTransform.java:57)
>    [junit]     at
> org.jcp.xml.dsig.internal.dom.DOMCanonicalizationMethod.<init>(DOMCanonicalizationMethod.java:44)
>    [junit]     at
> org.jcp.xml.dsig.internal.dom.DOMSignedInfo.<init>(DOMSignedInfo.java:118)
>    [junit]     at
> org.jcp.xml.dsig.internal.dom.DOMXMLSignature.<init>(DOMXMLSignature.java:119)
>    [junit]     at
> org.jcp.xml.dsig.internal.dom.DOMXMLSignatureFactory.unmarshal(DOMXMLSignatureFactory.java:152)
>    [junit]     at
> org.jcp.xml.dsig.internal.dom.DOMXMLSignatureFactory.unmarshalXMLSignature(DOMXMLSignatureFactory.java:116)
>    [junit]     at
> javax.xml.crypto.test.dsig.SignatureValidator.validate(Unknown Source)
>    [junit]     at
> javax.xml.crypto.test.dsig.SignatureValidator.validate(Unknown Source)
>    [junit]     at
> javax.xml.crypto.test.dsig.SignatureValidator.validate(Unknown Source)
>    [junit]     at javax.xml.crypto.test.dsig.C14N11Test.test_c14n11(Unknown
> Source)
>    [junit]     at
> javax.xml.crypto.test.dsig.C14N11Test.test_xmlbase_prop_1(Unknown Source)
>    [junit] Caused by: java.security.NoSuchAlgorithmException:
> http://www.w3.org/2006/12/xml-c14n11 algorithm and DOM mechanism not
> available
>    [junit]     at
> javax.xml.crypto.dsig.TransformService.getInstance(TransformService.java:153)
>    [junit]     at
> org.jcp.xml.dsig.internal.dom.DOMTransform.<init>(DOMTransform.java:55)
>    [junit]
>    [junit] Testcase: test_xmlbase_prop_2 took 0,006 sec
>    [junit]     Caused an ERROR
>    [junit] java.security.NoSuchAlgorithmException:
> http://www.w3.org/2006/12/xml-c14n11 algorithm and DOM mechanism not
> available
>    [junit] javax.xml.crypto.MarshalException:
> java.security.NoSuchAlgorithmException: http://www.w3.org/2006/12/xml-c14n11
> algorithm and DOM mechanism not available
>    [junit]     at
> org.jcp.xml.dsig.internal.dom.DOMTransform.<init>(DOMTransform.java:57)
>    [junit]     at
> org.jcp.xml.dsig.internal.dom.DOMCanonicalizationMethod.<init>(DOMCanonicalizationMethod.java:44)
>    [junit]     at
> org.jcp.xml.dsig.internal.dom.DOMSignedInfo.<init>(DOMSignedInfo.java:118)
>    [junit]     at
> org.jcp.xml.dsig.internal.dom.DOMXMLSignature.<init>(DOMXMLSignature.java:119)
>    [junit]     at
> org.jcp.xml.dsig.internal.dom.DOMXMLSignatureFactory.unmarshal(DOMXMLSignatureFactory.java:152)
>    [junit]     at
> org.jcp.xml.dsig.internal.dom.DOMXMLSignatureFactory.unmarshalXMLSignature(DOMXMLSignatureFactory.java:116)
>    [junit]     at
> javax.xml.crypto.test.dsig.SignatureValidator.validate(Unknown Source)
>    [junit]     at
> javax.xml.crypto.test.dsig.SignatureValidator.validate(Unknown Source)
>    [junit]     at
> javax.xml.crypto.test.dsig.SignatureValidator.validate(Unknown Source)
>    [junit]     at javax.xml.crypto.test.dsig.C14N11Test.test_c14n11(Unknown
> Source)
>    [junit]     at
> javax.xml.crypto.test.dsig.C14N11Test.test_xmlbase_prop_2(Unknown Source)
>    [junit] Caused by: java.security.NoSuchAlgorithmException:
> http://www.w3.org/2006/12/xml-c14n11 algorithm and DOM mechanism not
> available
>    [junit]     at
> javax.xml.crypto.dsig.TransformService.getInstance(TransformService.java:153)
>    [junit]     at
> org.jcp.xml.dsig.internal.dom.DOMTransform.<init>(DOMTransform.java:55)
>    [junit]
>    [junit] Testcase: test_xmlbase_prop_3 took 0,008 sec
>    [junit]     Caused an ERROR
>    [junit] java.security.NoSuchAlgorithmException:
> http://www.w3.org/2006/12/xml-c14n11 algorithm and DOM mechanism not
> available
>    [junit] javax.xml.crypto.MarshalException:
> java.security.NoSuchAlgorithmException: http://www.w3.org/2006/12/xml-c14n11
> algorithm and DOM mechanism not available
>    [junit]     at
> org.jcp.xml.dsig.internal.dom.DOMTransform.<init>(DOMTransform.java:57)
>    [junit]     at
> org.jcp.xml.dsig.internal.dom.DOMCanonicalizationMethod.<init>(DOMCanonicalizationMethod.java:44)
>    [junit]     at
> org.jcp.xml.dsig.internal.dom.DOMSignedInfo.<init>(DOMSignedInfo.java:118)
>    [junit]     at
> org.jcp.xml.dsig.internal.dom.DOMXMLSignature.<init>(DOMXMLSignature.java:119)
>    [junit]     at
> org.jcp.xml.dsig.internal.dom.DOMXMLSignatureFactory.unmarshal(DOMXMLSignatureFactory.java:152)
>    [junit]     at
> org.jcp.xml.dsig.internal.dom.DOMXMLSignatureFactory.unmarshalXMLSignature(DOMXMLSignatureFactory.java:116)
>    [junit]     at
> javax.xml.crypto.test.dsig.SignatureValidator.validate(Unknown Source)
>    [junit]     at
> javax.xml.crypto.test.dsig.SignatureValidator.validate(Unknown Source)
>    [junit]     at
> javax.xml.crypto.test.dsig.SignatureValidator.validate(Unknown Source)
>    [junit]     at javax.xml.crypto.test.dsig.C14N11Test.test_c14n11(Unknown
> Source)
>    [junit]     at
> javax.xml.crypto.test.dsig.C14N11Test.test_xmlbase_prop_3(Unknown Source)
>    [junit] Caused by: java.security.NoSuchAlgorithmException:
> http://www.w3.org/2006/12/xml-c14n11 algorithm and DOM mechanism not
> available
>    [junit]     at
> javax.xml.crypto.dsig.TransformService.getInstance(TransformService.java:153)
>    [junit]     at
> org.jcp.xml.dsig.internal.dom.DOMTransform.<init>(DOMTransform.java:55)
>    [junit]
>    [junit] Testcase: test_xmlbase_prop_4 took 0,006 sec
>    [junit]     Caused an ERROR
>    [junit] java.security.NoSuchAlgorithmException:
> http://www.w3.org/2006/12/xml-c14n11 algorithm and DOM mechanism not
> available
>    [junit] javax.xml.crypto.MarshalException:
> java.security.NoSuchAlgorithmException: http://www.w3.org/2006/12/xml-c14n11
> algorithm and DOM mechanism not available
>    [junit]     at
> org.jcp.xml.dsig.internal.dom.DOMTransform.<init>(DOMTransform.java:57)
>    [junit]     at
> org.jcp.xml.dsig.internal.dom.DOMCanonicalizationMethod.<init>(DOMCanonicalizationMethod.java:44)
>    [junit]     at
> org.jcp.xml.dsig.internal.dom.DOMSignedInfo.<init>(DOMSignedInfo.java:118)
>    [junit]     at
> org.jcp.xml.dsig.internal.dom.DOMXMLSignature.<init>(DOMXMLSignature.java:119)
>    [junit]     at
> org.jcp.xml.dsig.internal.dom.DOMXMLSignatureFactory.unmarshal(DOMXMLSignatureFactory.java:152)
>    [junit]     at
> org.jcp.xml.dsig.internal.dom.DOMXMLSignatureFactory.unmarshalXMLSignature(DOMXMLSignatureFactory.java:116)
>    [junit]     at
> javax.xml.crypto.test.dsig.SignatureValidator.validate(Unknown Source)
>    [junit]     at
> javax.xml.crypto.test.dsig.SignatureValidator.validate(Unknown Source)
>    [junit]     at
> javax.xml.crypto.test.dsig.SignatureValidator.validate(Unknown Source)
>    [junit]     at javax.xml.crypto.test.dsig.C14N11Test.test_c14n11(Unknown
> Source)
>    [junit]     at
> javax.xml.crypto.test.dsig.C14N11Test.test_xmlbase_prop_4(Unknown Source)
>    [junit] Caused by: java.security.NoSuchAlgorithmException:
> http://www.w3.org/2006/12/xml-c14n11 algorithm and DOM mechanism not
> available
>    [junit]     at
> javax.xml.crypto.dsig.TransformService.getInstance(TransformService.java:153)
>    [junit]     at
> org.jcp.xml.dsig.internal.dom.DOMTransform.<init>(DOMTransform.java:55)
>    [junit]
>    [junit] Testcase: test_xmlbase_prop_5 took 0,006 sec
>    [junit]     Caused an ERROR
>    [junit] java.security.NoSuchAlgorithmException:
> http://www.w3.org/2006/12/xml-c14n11 algorithm and DOM mechanism not
> available
>    [junit] javax.xml.crypto.MarshalException:
> java.security.NoSuchAlgorithmException: http://www.w3.org/2006/12/xml-c14n11
> algorithm and DOM mechanism not available
>    [junit]     at
> org.jcp.xml.dsig.internal.dom.DOMTransform.<init>(DOMTransform.java:57)
>    [junit]     at
> org.jcp.xml.dsig.internal.dom.DOMCanonicalizationMethod.<init>(DOMCanonicalizationMethod.java:44)
>    [junit]     at
> org.jcp.xml.dsig.internal.dom.DOMSignedInfo.<init>(DOMSignedInfo.java:118)
>    [junit]     at
> org.jcp.xml.dsig.internal.dom.DOMXMLSignature.<init>(DOMXMLSignature.java:119)
>    [junit]     at
> org.jcp.xml.dsig.internal.dom.DOMXMLSignatureFactory.unmarshal(DOMXMLSignatureFactory.java:152)
>    [junit]     at
> org.jcp.xml.dsig.internal.dom.DOMXMLSignatureFactory.unmarshalXMLSignature(DOMXMLSignatureFactory.java:116)
>    [junit]     at
> javax.xml.crypto.test.dsig.SignatureValidator.validate(Unknown Source)
>    [junit]     at
> javax.xml.crypto.test.dsig.SignatureValidator.validate(Unknown Source)
>    [junit]     at
> javax.xml.crypto.test.dsig.SignatureValidator.validate(Unknown Source)
>    [junit]     at javax.xml.crypto.test.dsig.C14N11Test.test_c14n11(Unknown
> Source)
>    [junit]     at
> javax.xml.crypto.test.dsig.C14N11Test.test_xmlbase_prop_5(Unknown Source)
>    [junit] Caused by: java.security.NoSuchAlgorithmException:
> http://www.w3.org/2006/12/xml-c14n11 algorithm and DOM mechanism not
> available
>    [junit]     at
> javax.xml.crypto.dsig.TransformService.getInstance(TransformService.java:153)
>    [junit]     at
> org.jcp.xml.dsig.internal.dom.DOMTransform.<init>(DOMTransform.java:55)
>    [junit]
>    [junit] Testcase: test_xmlbase_prop_6 took 0,007 sec
>    [junit]     Caused an ERROR
>    [junit] java.security.NoSuchAlgorithmException:
> http://www.w3.org/2006/12/xml-c14n11 algorithm and DOM mechanism not
> available
>    [junit] javax.xml.crypto.MarshalException:
> java.security.NoSuchAlgorithmException: http://www.w3.org/2006/12/xml-c14n11
> algorithm and DOM mechanism not available
>    [junit]     at
> org.jcp.xml.dsig.internal.dom.DOMTransform.<init>(DOMTransform.java:57)
>    [junit]     at
> org.jcp.xml.dsig.internal.dom.DOMCanonicalizationMethod.<init>(DOMCanonicalizationMethod.java:44)
>    [junit]     at
> org.jcp.xml.dsig.internal.dom.DOMSignedInfo.<init>(DOMSignedInfo.java:118)
>    [junit]     at
> org.jcp.xml.dsig.internal.dom.DOMXMLSignature.<init>(DOMXMLSignature.java:119)
>    [junit]     at
> org.jcp.xml.dsig.internal.dom.DOMXMLSignatureFactory.unmarshal(DOMXMLSignatureFactory.java:152)
>    [junit]     at
> org.jcp.xml.dsig.internal.dom.DOMXMLSignatureFactory.unmarshalXMLSignature(DOMXMLSignatureFactory.java:116)
>    [junit]     at
> javax.xml.crypto.test.dsig.SignatureValidator.validate(Unknown Source)
>    [junit]     at
> javax.xml.crypto.test.dsig.SignatureValidator.validate(Unknown Source)
>    [junit]     at
> javax.xml.crypto.test.dsig.SignatureValidator.validate(Unknown Source)
>    [junit]     at javax.xml.crypto.test.dsig.C14N11Test.test_c14n11(Unknown
> Source)
>    [junit]     at
> javax.xml.crypto.test.dsig.C14N11Test.test_xmlbase_prop_6(Unknown Source)
>    [junit] Caused by: java.security.NoSuchAlgorithmException:
> http://www.w3.org/2006/12/xml-c14n11 algorithm and DOM mechanism not
> available
>    [junit]     at
> javax.xml.crypto.dsig.TransformService.getInstance(TransformService.java:153)
>    [junit]     at
> org.jcp.xml.dsig.internal.dom.DOMTransform.<init>(DOMTransform.java:55)
>    [junit]
>    [junit] Testcase: test_xmlbase_prop_7 took 0,006 sec
>    [junit]     Caused an ERROR
>    [junit] java.security.NoSuchAlgorithmException:
> http://www.w3.org/2006/12/xml-c14n11 algorithm and DOM mechanism not
> available
>    [junit] javax.xml.crypto.MarshalException:
> java.security.NoSuchAlgorithmException: http://www.w3.org/2006/12/xml-c14n11
> algorithm and DOM mechanism not available
>    [junit]     at
> org.jcp.xml.dsig.internal.dom.DOMTransform.<init>(DOMTransform.java:57)
>    [junit]     at
> org.jcp.xml.dsig.internal.dom.DOMCanonicalizationMethod.<init>(DOMCanonicalizationMethod.java:44)
>    [junit]     at
> org.jcp.xml.dsig.internal.dom.DOMSignedInfo.<init>(DOMSignedInfo.java:118)
>    [junit]     at
> org.jcp.xml.dsig.internal.dom.DOMXMLSignature.<init>(DOMXMLSignature.java:119)
>    [junit]     at
> org.jcp.xml.dsig.internal.dom.DOMXMLSignatureFactory.unmarshal(DOMXMLSignatureFactory.java:152)
>    [junit]     at
> org.jcp.xml.dsig.internal.dom.DOMXMLSignatureFactory.unmarshalXMLSignature(DOMXMLSignatureFactory.java:116)
>    [junit]     at
> javax.xml.crypto.test.dsig.SignatureValidator.validate(Unknown Source)
>    [junit]     at
> javax.xml.crypto.test.dsig.SignatureValidator.validate(Unknown Source)
>    [junit]     at
> javax.xml.crypto.test.dsig.SignatureValidator.validate(Unknown Source)
>    [junit]     at javax.xml.crypto.test.dsig.C14N11Test.test_c14n11(Unknown
> Source)
>    [junit]     at
> javax.xml.crypto.test.dsig.C14N11Test.test_xmlbase_prop_7(Unknown Source)
>    [junit] Caused by: java.security.NoSuchAlgorithmException:
> http://www.w3.org/2006/12/xml-c14n11 algorithm and DOM mechanism not
> available
>    [junit]     at
> javax.xml.crypto.dsig.TransformService.getInstance(TransformService.java:153)
>    [junit]     at
> org.jcp.xml.dsig.internal.dom.DOMTransform.<init>(DOMTransform.java:55)
>    [junit]
>    [junit] Testcase: test_xmlbase_c14n11spec_102 took 0,006 sec
>    [junit]     Caused an ERROR
>    [junit] java.security.NoSuchAlgorithmException:
> http://www.w3.org/2006/12/xml-c14n11 algorithm and DOM mechanism not
> available
>    [junit] javax.xml.crypto.MarshalException:
> java.security.NoSuchAlgorithmException: http://www.w3.org/2006/12/xml-c14n11
> algorithm and DOM mechanism not available
>    [junit]     at
> org.jcp.xml.dsig.internal.dom.DOMTransform.<init>(DOMTransform.java:57)
>    [junit]     at
> org.jcp.xml.dsig.internal.dom.DOMCanonicalizationMethod.<init>(DOMCanonicalizationMethod.java:44)
>    [junit]     at
> org.jcp.xml.dsig.internal.dom.DOMSignedInfo.<init>(DOMSignedInfo.java:118)
>    [junit]     at
> org.jcp.xml.dsig.internal.dom.DOMXMLSignature.<init>(DOMXMLSignature.java:119)
>    [junit]     at
> org.jcp.xml.dsig.internal.dom.DOMXMLSignatureFactory.unmarshal(DOMXMLSignatureFactory.java:152)
>    [junit]     at
> org.jcp.xml.dsig.internal.dom.DOMXMLSignatureFactory.unmarshalXMLSignature(DOMXMLSignatureFactory.java:116)
>    [junit]     at
> javax.xml.crypto.test.dsig.SignatureValidator.validate(Unknown Source)
>    [junit]     at
> javax.xml.crypto.test.dsig.SignatureValidator.validate(Unknown Source)
>    [junit]     at
> javax.xml.crypto.test.dsig.SignatureValidator.validate(Unknown Source)
>    [junit]     at javax.xml.crypto.test.dsig.C14N11Test.test_c14n11(Unknown
> Source)
>    [junit]     at
> javax.xml.crypto.test.dsig.C14N11Test.test_xmlbase_c14n11spec_102(Unknown
> Source)
>    [junit] Caused by: java.security.NoSuchAlgorithmException:
> http://www.w3.org/2006/12/xml-c14n11 algorithm and DOM mechanism not
> available
>    [junit]     at
> javax.xml.crypto.dsig.TransformService.getInstance(TransformService.java:153)
>    [junit]     at
> org.jcp.xml.dsig.internal.dom.DOMTransform.<init>(DOMTransform.java:55)
>    [junit]
>    [junit] Testcase: test_xmlbase_c14n11spec2_102 took 0,006 sec
>    [junit]     Caused an ERROR
>    [junit] java.security.NoSuchAlgorithmException:
> http://www.w3.org/2006/12/xml-c14n11 algorithm and DOM mechanism not
> available
>    [junit] javax.xml.crypto.MarshalException:
> java.security.NoSuchAlgorithmException: http://www.w3.org/2006/12/xml-c14n11
> algorithm and DOM mechanism not available
>    [junit]     at
> org.jcp.xml.dsig.internal.dom.DOMTransform.<init>(DOMTransform.java:57)
>    [junit]     at
> org.jcp.xml.dsig.internal.dom.DOMCanonicalizationMethod.<init>(DOMCanonicalizationMethod.java:44)
>    [junit]     at
> org.jcp.xml.dsig.internal.dom.DOMSignedInfo.<init>(DOMSignedInfo.java:118)
>    [junit]     at
> org.jcp.xml.dsig.internal.dom.DOMXMLSignature.<init>(DOMXMLSignature.java:119)
>    [junit]     at
> org.jcp.xml.dsig.internal.dom.DOMXMLSignatureFactory.unmarshal(DOMXMLSignatureFactory.java:152)
>    [junit]     at
> org.jcp.xml.dsig.internal.dom.DOMXMLSignatureFactory.unmarshalXMLSignature(DOMXMLSignatureFactory.java:116)
>    [junit]     at
> javax.xml.crypto.test.dsig.SignatureValidator.validate(Unknown Source)
>    [junit]     at
> javax.xml.crypto.test.dsig.SignatureValidator.validate(Unknown Source)
>    [junit]     at
> javax.xml.crypto.test.dsig.SignatureValidator.validate(Unknown Source)
>    [junit]     at javax.xml.crypto.test.dsig.C14N11Test.test_c14n11(Unknown
> Source)
>    [junit]     at
> javax.xml.crypto.test.dsig.C14N11Test.test_xmlbase_c14n11spec2_102(Unknown
> Source)
>    [junit] Caused by: java.security.NoSuchAlgorithmException:
> http://www.w3.org/2006/12/xml-c14n11 algorithm and DOM mechanism not
> available
>    [junit]     at
> javax.xml.crypto.dsig.TransformService.getInstance(TransformService.java:153)
>    [junit]     at
> org.jcp.xml.dsig.internal.dom.DOMTransform.<init>(DOMTransform.java:55)
>    [junit]
>    [junit] Testcase: test_xmlbase_c14n11spec3_103 took 0,006 sec
>    [junit]     Caused an ERROR
>    [junit] java.security.NoSuchAlgorithmException:
> http://www.w3.org/2006/12/xml-c14n11 algorithm and DOM mechanism not
> available
>    [junit] javax.xml.crypto.MarshalException:
> java.security.NoSuchAlgorithmException: http://www.w3.org/2006/12/xml-c14n11
> algorithm and DOM mechanism not available
>    [junit]     at
> org.jcp.xml.dsig.internal.dom.DOMTransform.<init>(DOMTransform.java:57)
>    [junit]     at
> org.jcp.xml.dsig.internal.dom.DOMCanonicalizationMethod.<init>(DOMCanonicalizationMethod.java:44)
>    [junit]     at
> org.jcp.xml.dsig.internal.dom.DOMSignedInfo.<init>(DOMSignedInfo.java:118)
>    [junit]     at
> org.jcp.xml.dsig.internal.dom.DOMXMLSignature.<init>(DOMXMLSignature.java:119)
>    [junit]     at
> org.jcp.xml.dsig.internal.dom.DOMXMLSignatureFactory.unmarshal(DOMXMLSignatureFactory.java:152)
>    [junit]     at
> org.jcp.xml.dsig.internal.dom.DOMXMLSignatureFactory.unmarshalXMLSignature(DOMXMLSignatureFactory.java:116)
>    [junit]     at
> javax.xml.crypto.test.dsig.SignatureValidator.validate(Unknown Source)
>    [junit]     at
> javax.xml.crypto.test.dsig.SignatureValidator.validate(Unknown Source)
>    [junit]     at
> javax.xml.crypto.test.dsig.SignatureValidator.validate(Unknown Source)
>    [junit]     at javax.xml.crypto.test.dsig.C14N11Test.test_c14n11(Unknown
> Source)
>    [junit]     at
> javax.xml.crypto.test.dsig.C14N11Test.test_xmlbase_c14n11spec3_103(Unknown
> Source)
>    [junit] Caused by: java.security.NoSuchAlgorithmException:
> http://www.w3.org/2006/12/xml-c14n11 algorithm and DOM mechanism not
> available
>    [junit]     at
> javax.xml.crypto.dsig.TransformService.getInstance(TransformService.java:153)
>    [junit]     at
> org.jcp.xml.dsig.internal.dom.DOMTransform.<init>(DOMTransform.java:55)
>    [junit]
>    [junit] Running javax.xml.crypto.test.dsig.CanonicalizationMethodTest
>    [junit] Testsuite: javax.xml.crypto.test.dsig.CanonicalizationMethodTest
>    [junit] Tests run: 2, Failures: 0, Errors: 0, Time elapsed: 0,055 sec
>    [junit] Tests run: 2, Failures: 0, Errors: 0, Time elapsed: 0,055 sec
>    [junit]
>    [junit] Testcase: testisFeatureSupported took 0,014 sec
>    [junit] Testcase: testConstructor took 0,003 sec
>    [junit] Running javax.xml.crypto.test.dsig.ClassLoaderTest
>    [junit] Testsuite: javax.xml.crypto.test.dsig.ClassLoaderTest
>    [junit] Tests run: 3, Failures: 0, Errors: 0, Time elapsed: 0,149 sec
>    [junit] Tests run: 3, Failures: 0, Errors: 0, Time elapsed: 0,149 sec
>    [junit] ------------- Standard Output ---------------
>    [junit] Elapsed:92
>    [junit] dsig succeeded
>    [junit] Elapsed:3
>    [junit] dsig succeeded
>    [junit] Elapsed:4
>    [junit] dsig succeeded
>    [junit] ------------- ---------------- ---------------
>    [junit]
>    [junit] Testcase: test_multiple_loaders took 0,101 sec
>    [junit] Testcase: test_provider_multiple_loaders took 0,006 sec
>    [junit] Testcase: test_provider_multiple_loaders_two took 0,002 sec
>    [junit] Running javax.xml.crypto.test.dsig.ComRSASecurityTest
>    [junit] Testsuite: javax.xml.crypto.test.dsig.ComRSASecurityTest
>    [junit] Tests run: 2, Failures: 0, Errors: 0, Time elapsed: 0,109 sec
>    [junit] Tests run: 2, Failures: 0, Errors: 0, Time elapsed: 0,109 sec
>    [junit]
>    [junit] Testcase: test_certj201_enveloping took 0,062 sec
>    [junit] Testcase: test_certj201_enveloped took 0,007 sec
>    [junit] Running javax.xml.crypto.test.dsig.CreateBaltimore23Test
>    [junit] Testsuite: javax.xml.crypto.test.dsig.CreateBaltimore23Test
>    [junit] Tests run: 16, Failures: 0, Errors: 0, Time elapsed: 2,289 sec
>    [junit] Tests run: 16, Failures: 0, Errors: 0, Time elapsed: 2,289 sec
>    [junit]
>    [junit] Testcase: test_create_signature_enveloped_dsa took 0,167 sec
>    [junit] Testcase: test_create_signature_enveloping_b64_dsa took 0,124
> sec
>    [junit] Testcase: test_create_signature_enveloping_dsa took 0,122 sec
>    [junit] Testcase: test_create_signature_enveloping_hmac_sha1_40 took
> 0,506 sec
>    [junit] Testcase: test_create_signature_enveloping_hmac_sha1 took 0,01
> sec
>    [junit] Testcase: test_create_signature_enveloping_rsa took 0,047 sec
>    [junit] Testcase: test_create_signature_external_b64_dsa took 0,131 sec
>    [junit] Testcase: test_create_signature_external_dsa took 0,106 sec
>    [junit] Testcase: test_create_signature_keyname took 0,095 sec
>    [junit] Testcase: test_create_signature_retrievalmethod_rawx509crt took
> 0,097 sec
>    [junit] Testcase: test_create_signature_x509_crt_crl took 0,108 sec
>    [junit] Testcase: test_create_signature_x509_crt took 0,094 sec
>    [junit] Testcase: test_create_signature_x509_is took 0,106 sec
>    [junit] Testcase: test_create_signature_x509_ski took 0,101 sec
>    [junit] Testcase: test_create_signature_x509_sn took 0,099 sec
>    [junit] Testcase: test_create_signature took 0,331 sec
>    [junit] Running javax.xml.crypto.test.dsig.CreateInteropExcC14NTest
>    [junit] Testsuite: javax.xml.crypto.test.dsig.CreateInteropExcC14NTest
>    [junit] Tests run: 1, Failures: 0, Errors: 0, Time elapsed: 0,197 sec
>    [junit] Tests run: 1, Failures: 0, Errors: 0, Time elapsed: 0,197 sec
>    [junit]
>    [junit] Testcase: test_create_Y1 took 0,154 sec
>    [junit] Running javax.xml.crypto.test.dsig.CreateInteropXFilter2Test
>    [junit] Testsuite: javax.xml.crypto.test.dsig.CreateInteropXFilter2Test
>    [junit] Tests run: 1, Failures: 0, Errors: 0, Time elapsed: 0,21 sec
>    [junit] Tests run: 1, Failures: 0, Errors: 0, Time elapsed: 0,21 sec
>    [junit]
>    [junit] Testcase: test_create_sign_spec took 0,171 sec
>    [junit] Running javax.xml.crypto.test.dsig.CreatePhaosXMLDSig3Test
>    [junit] Testsuite: javax.xml.crypto.test.dsig.CreatePhaosXMLDSig3Test
>    [junit] Tests run: 3, Failures: 0, Errors: 0, Time elapsed: 0,988 sec
>    [junit] Tests run: 3, Failures: 0, Errors: 0, Time elapsed: 0,988 sec
>    [junit]
>    [junit] Testcase: test_create_hmac_sha1_exclusive_c14n_comments_detached
> took 0,654 sec
>    [junit] Testcase:
> test_create_hmac_sha1_40_exclusive_c14n_comments_detached took 0,289 sec
>    [junit] Testcase: test_create_hmac_sha1_exclusive_c14n_enveloped took
> 0,007 sec
>    [junit] Running javax.xml.crypto.test.dsig.DetachedTest
>    [junit] Testsuite: javax.xml.crypto.test.dsig.DetachedTest
>    [junit] Tests run: 1, Failures: 0, Errors: 0, Time elapsed: 0,372 sec
>    [junit] Tests run: 1, Failures: 0, Errors: 0, Time elapsed: 0,372 sec
>    [junit]
>    [junit] Testcase: test took 0,333 sec
>    [junit] Running javax.xml.crypto.test.dsig.DigestMethodTest
>    [junit] Testsuite: javax.xml.crypto.test.dsig.DigestMethodTest
>    [junit] Tests run: 2, Failures: 0, Errors: 0, Time elapsed: 0,055 sec
>    [junit] Tests run: 2, Failures: 0, Errors: 0, Time elapsed: 0,055 sec
>    [junit]
>    [junit] Testcase: testisFeatureSupported took 0,006 sec
>    [junit] Testcase: testConstructor took 0,002 sec
>    [junit] Running javax.xml.crypto.test.dsig.IaikCoreFeaturesTest
>    [junit] Testsuite: javax.xml.crypto.test.dsig.IaikCoreFeaturesTest
>    [junit] Tests run: 3, Failures: 1, Errors: 0, Time elapsed: 0,307 sec
>    [junit] Tests run: 3, Failures: 1, Errors: 0, Time elapsed: 0,307 sec
>    [junit]
>    [junit] Testcase: test_anonymousReferenceSignature took 0,092 sec
>    [junit] Testcase: test_manifestSignature took 0,015 sec
>    [junit] Testcase: test_signatureTypesSignature took 0,158 sec
>    [junit]     FAILED
>    [junit] Signature failed core validation
>    [junit] junit.framework.AssertionFailedError: Signature failed core
> validation
>    [junit]     at
> javax.xml.crypto.test.dsig.IaikCoreFeaturesTest.test_signatureTypesSignature(Unknown
> Source)
>    [junit]
>    [junit] Running javax.xml.crypto.test.dsig.IaikSignatureAlgosTest
>    [junit] Testsuite: javax.xml.crypto.test.dsig.IaikSignatureAlgosTest
>    [junit] Tests run: 4, Failures: 0, Errors: 0, Time elapsed: 0,718 sec
>    [junit] Tests run: 4, Failures: 0, Errors: 0, Time elapsed: 0,718 sec
>    [junit]
>    [junit] Testcase: test_dsaSignature took 0,165 sec
>    [junit] Testcase: test_rsaSignature took 0,01 sec
>    [junit] Testcase: test_hmacShortSignature took 0,478 sec
>    [junit] Testcase: test_hmacSignature took 0,006 sec
>    [junit] Running javax.xml.crypto.test.dsig.IaikTransformsTest
>    [junit] Testsuite: javax.xml.crypto.test.dsig.IaikTransformsTest
>    [junit] Tests run: 4, Failures: 0, Errors: 0, Time elapsed: 0,168 sec
>    [junit] Tests run: 4, Failures: 0, Errors: 0, Time elapsed: 0,168 sec
>    [junit]
>    [junit] Testcase: test_base64DecodeSignature took 0,075 sec
>    [junit] Testcase: test_envelopedSignatureSignature took 0,007 sec
>    [junit] Testcase: test_c14nSignature took 0,012 sec
>    [junit] Testcase: test_xPathSignature took 0,031 sec
>    [junit] Running javax.xml.crypto.test.dsig.ManifestTest
>    [junit] Testsuite: javax.xml.crypto.test.dsig.ManifestTest
>    [junit] Tests run: 3, Failures: 0, Errors: 0, Time elapsed: 0,031 sec
>    [junit] Tests run: 3, Failures: 0, Errors: 0, Time elapsed: 0,031 sec
>    [junit]
>    [junit] Testcase: testConstructor took 0,004 sec
>    [junit] Testcase: testisFeatureSupported took 0,002 sec
>    [junit] Testcase: testgetReferences took 0,002 sec
>    [junit] Running javax.xml.crypto.test.dsig.PhaosXMLDSig3Test
>    [junit] Testsuite: javax.xml.crypto.test.dsig.PhaosXMLDSig3Test
>    [junit] Tests run: 25, Failures: 0, Errors: 0, Time elapsed: 1,276 sec
>    [junit] Tests run: 25, Failures: 0, Errors: 0, Time elapsed: 1,276 sec
>    [junit]
>    [junit] Testcase: test_signature_dsa_detached took 0,159 sec
>    [junit] Testcase: test_signature_dsa_enveloped took 0,07 sec
>    [junit] Testcase: test_signature_dsa_enveloping took 0,07 sec
>    [junit] Testcase: test_signature_dsa_manifest took 0,07 sec
>    [junit] Testcase: test_signature_hmac_sha1_40_c14n_comments_detached
> took 0,307 sec
>    [junit] Testcase:
> test_signature_hmac_sha1_40_exclusive_c14n_comments_detached took 0,024 sec
>    [junit] Testcase:
> test_signature_hmac_sha1_exclusive_c14n_comments_detached took 0,272 sec
>    [junit] Testcase: test_signature_hmac_sha1_exclusive_c14n_enveloped took
> 0,006 sec
>    [junit] Testcase: test_signature_rsa_detached_b64_transform took 0,009
> sec
>    [junit] Testcase: test_signature_rsa_detached_xpath_transform took 0,01
> sec
>    [junit] Testcase: test_signature_rsa_detached_xslt_transform_bad_rm took
> 0,01 sec
>    [junit] Testcase: test_signature_rsa_detached_xslt_transform_rm took
> 0,012 sec
>    [junit] Testcase: test_signature_rsa_detached_xslt_transform took 0,012
> sec
>    [junit] Testcase: test_signature_rsa_detached took 0,033 sec
>    [junit] Testcase: test_signature_rsa_enveloped_bad_digest_val took 0,014
> sec
>    [junit] Testcase: test_signature_rsa_enveloped took 0,01 sec
>    [junit] Testcase: test_signature_rsa_enveloping took 0,009 sec
>    [junit] Testcase: test_signature_rsa_manifest_x509_data_cert_chain took
> 0,01 sec
>    [junit] Testcase: test_signature_rsa_manifest_x509_data_cert took 0,009
> sec
>    [junit] Testcase: test_signature_rsa_manifest_x509_data_issuer_serial
> took 0,011 sec
>    [junit] Testcase: test_signature_rsa_manifest_x509_data_ski took 0,01
> sec
>    [junit] Testcase: test_signature_rsa_manifest_x509_data_subject_name
> took 0,013 sec
>    [junit] Testcase: test_signature_rsa_manifest_x509_data took 0,012 sec
>    [junit] Testcase: test_signature_rsa_manifest took 0,009 sec
>    [junit] Testcase: test_signature_rsa_xpath_transform_enveloped took
> 0,054 sec
>    [junit] Running javax.xml.crypto.test.dsig.ReferenceTest
>    [junit] Testsuite: javax.xml.crypto.test.dsig.ReferenceTest
>    [junit] Tests run: 4, Failures: 0, Errors: 0, Time elapsed: 0,222 sec
>    [junit] Tests run: 4, Failures: 0, Errors: 0, Time elapsed: 0,222 sec
>    [junit]
>    [junit] Testcase: testConstructor took 0,017 sec
>    [junit] Testcase: testisFeatureSupported took 0,004 sec
>    [junit] Testcase: testvalidate took 0,102 sec
>    [junit] Testcase: testvalidateWithCaching took 0,059 sec
>    [junit] Running javax.xml.crypto.test.dsig.SecureXSLTTest
>    [junit] Testsuite: javax.xml.crypto.test.dsig.SecureXSLTTest
>    [junit] Tests run: 1, Failures: 0, Errors: 0, Time elapsed: 0,113 sec
>    [junit] Tests run: 1, Failures: 0, Errors: 0, Time elapsed: 0,113 sec
>    [junit] ------------- Standard Output ---------------
>    [junit] Validating signature1.xml
>    [junit] Validating signature2.xml
>    [junit] Validating signature3.xml
>    [junit] Test PASSED
>    [junit] ------------- ---------------- ---------------
>    [junit]
>    [junit] Testcase: test took 0,074 sec
>    [junit] Running javax.xml.crypto.test.dsig.SignatureMethodTest
>    [junit] Testsuite: javax.xml.crypto.test.dsig.SignatureMethodTest
>    [junit] Tests run: 2, Failures: 0, Errors: 0, Time elapsed: 0,345 sec
>    [junit] Tests run: 2, Failures: 0, Errors: 0, Time elapsed: 0,345 sec
>    [junit]
>    [junit] Testcase: testisFeatureSupported took 0,301 sec
>    [junit] Testcase: testConstructor took 0,003 sec
>    [junit] Running javax.xml.crypto.test.dsig.SignaturePropertiesTest
>    [junit] Testsuite: javax.xml.crypto.test.dsig.SignaturePropertiesTest
>    [junit] Tests run: 2, Failures: 0, Errors: 0, Time elapsed: 0,048 sec
>    [junit] Tests run: 2, Failures: 0, Errors: 0, Time elapsed: 0,048 sec
>    [junit]
>    [junit] Testcase: testConstructor took 0,005 sec
>    [junit] Testcase: testisFeatureSupported took 0,002 sec
>    [junit] Running javax.xml.crypto.test.dsig.SignaturePropertyTest
>    [junit] Testsuite: javax.xml.crypto.test.dsig.SignaturePropertyTest
>    [junit] Tests run: 2, Failures: 0, Errors: 0, Time elapsed: 0,048 sec
>    [junit] Tests run: 2, Failures: 0, Errors: 0, Time elapsed: 0,048 sec
>    [junit]
>    [junit] Testcase: testConstructor took 0,005 sec
>    [junit] Testcase: testisFeatureSupported took 0,002 sec
>    [junit] Running javax.xml.crypto.test.dsig.SignedInfoTest
>    [junit] Testsuite: javax.xml.crypto.test.dsig.SignedInfoTest
>    [junit] Tests run: 1, Failures: 0, Errors: 0, Time elapsed: 0,054 sec
>    [junit] Tests run: 1, Failures: 0, Errors: 0, Time elapsed: 0,054 sec
>    [junit]
>    [junit] Testcase: testConstructor took 0,015 sec
>    [junit] Running javax.xml.crypto.test.dsig.TransformTest
>    [junit] Testsuite: javax.xml.crypto.test.dsig.TransformTest
>    [junit] Tests run: 2, Failures: 0, Errors: 0, Time elapsed: 0,063 sec
>    [junit] Tests run: 2, Failures: 0, Errors: 0, Time elapsed: 0,063 sec
>    [junit]
>    [junit] Testcase: testisFeatureSupported took 0,016 sec
>    [junit] Testcase: testConstructor took 0,003 sec
>    [junit] Running javax.xml.crypto.test.dsig.ValidateSignatureTest
>    [junit] Testsuite: javax.xml.crypto.test.dsig.ValidateSignatureTest
>    [junit] Tests run: 3, Failures: 0, Errors: 1, Time elapsed: 0,522 sec
>    [junit] Tests run: 3, Failures: 0, Errors: 1, Time elapsed: 0,522 sec
>    [junit]
>    [junit] Testcase: test_signature_with_ID took 0,089 sec
>    [junit]     Caused an ERROR
>    [junit] javax.xml.crypto.URIReferenceException:
> com.sun.org.apache.xml.internal.security.utils.resolver.ResourceResolverException:
> Cannot resolve element with ID foo
>    [junit] javax.xml.crypto.dsig.XMLSignatureException:
> javax.xml.crypto.URIReferenceException:
> com.sun.org.apache.xml.internal.security.utils.resolver.ResourceResolverException:
> Cannot resolve element with ID foo
>    [junit]     at
> org.jcp.xml.dsig.internal.dom.DOMReference.dereference(DOMReference.java:352)
>    [junit]     at
> org.jcp.xml.dsig.internal.dom.DOMReference.validate(DOMReference.java:311)
>    [junit]     at
> org.jcp.xml.dsig.internal.dom.DOMXMLSignature.validate(DOMXMLSignature.java:244)
>    [junit]     at
> javax.xml.crypto.test.dsig.SignatureValidator.validate(Unknown Source)
>    [junit]     at
> javax.xml.crypto.test.dsig.ValidateSignatureTest.test_signature_with_ID(Unknown
> Source)
>    [junit] Caused by: javax.xml.crypto.URIReferenceException:
> com.sun.org.apache.xml.internal.security.utils.resolver.ResourceResolverException:
> Cannot resolve element with ID foo
>    [junit]     at
> org.jcp.xml.dsig.internal.dom.DOMURIDereferencer.dereference(DOMURIDereferencer.java:84)
>    [junit]     at
> org.jcp.xml.dsig.internal.dom.DOMReference.dereference(DOMReference.java:344)
>    [junit] Caused by:
> com.sun.org.apache.xml.internal.security.utils.resolver.ResourceResolverException:
> Cannot resolve element with ID foo
>    [junit]     at
> com.sun.org.apache.xml.internal.security.utils.resolver.implementations.ResolverFragment.engineResolve(ResolverFragment.java:89)
>    [junit]     at
> com.sun.org.apache.xml.internal.security.utils.resolver.ResourceResolver.resolve(ResourceResolver.java:236)
>    [junit]     at
> org.jcp.xml.dsig.internal.dom.DOMURIDereferencer.dereference(DOMURIDereferencer.java:77)
>    [junit] javax.xml.crypto.URIReferenceException:
> com.sun.org.apache.xml.internal.security.utils.resolver.ResourceResolverException:
> Cannot resolve element with ID foo
>    [junit]     at
> org.jcp.xml.dsig.internal.dom.DOMURIDereferencer.dereference(DOMURIDereferencer.java:84)
>    [junit]     at
> org.jcp.xml.dsig.internal.dom.DOMReference.dereference(DOMReference.java:344)
>    [junit]     at
> org.jcp.xml.dsig.internal.dom.DOMReference.validate(DOMReference.java:311)
>    [junit]     at
> org.jcp.xml.dsig.internal.dom.DOMXMLSignature.validate(DOMXMLSignature.java:244)
>    [junit]     at
> javax.xml.crypto.test.dsig.SignatureValidator.validate(Unknown Source)
>    [junit]     at
> javax.xml.crypto.test.dsig.ValidateSignatureTest.test_signature_with_ID(Unknown
> Source)
>    [junit] Caused by:
> com.sun.org.apache.xml.internal.security.utils.resolver.ResourceResolverException:
> Cannot resolve element with ID foo
>    [junit]     at
> com.sun.org.apache.xml.internal.security.utils.resolver.implementations.ResolverFragment.engineResolve(ResolverFragment.java:89)
>    [junit]     at
> com.sun.org.apache.xml.internal.security.utils.resolver.ResourceResolver.resolve(ResourceResolver.java:236)
>    [junit]     at
> org.jcp.xml.dsig.internal.dom.DOMURIDereferencer.dereference(DOMURIDereferencer.java:77)
>    [junit]
>    [junit] Testcase: test_signature_external_c14n_xmlattrs took 0,362 sec
>    [junit] Testcase: test_invalid_signature took 0,01 sec
>    [junit] Running javax.xml.crypto.test.dsig.XMLObjectTest
>    [junit] Testsuite: javax.xml.crypto.test.dsig.XMLObjectTest
>    [junit] Tests run: 2, Failures: 0, Errors: 0, Time elapsed: 0,048 sec
>    [junit] Tests run: 2, Failures: 0, Errors: 0, Time elapsed: 0,048 sec
>    [junit]
>    [junit] Testcase: testConstructor took 0,005 sec
>    [junit] Testcase: testisFeatureSupported took 0,002 sec
>    [junit] Running javax.xml.crypto.test.dsig.XMLSignContextTest
>    [junit] Testsuite: javax.xml.crypto.test.dsig.XMLSignContextTest
>    [junit] Tests run: 4, Failures: 0, Errors: 0, Time elapsed: 0,075 sec
>    [junit] Tests run: 4, Failures: 0, Errors: 0, Time elapsed: 0,075 sec
>    [junit]
>    [junit] Testcase: testsetngetBaseURI took 0,02 sec
>    [junit] Testcase: testsetngetProperty took 0,003 sec
>    [junit] Testcase: testsetngetURIDereferencer took 0,003 sec
>    [junit] Testcase: testsetngetKeySelector took 0,002 sec
>    [junit] Running javax.xml.crypto.test.dsig.XMLSignatureFactoryTest
>    [junit] Testsuite: javax.xml.crypto.test.dsig.XMLSignatureFactoryTest
>    [junit] Tests run: 5, Failures: 0, Errors: 0, Time elapsed: 0,126 sec
>    [junit] Tests run: 5, Failures: 0, Errors: 0, Time elapsed: 0,126 sec
>    [junit]
>    [junit] Testcase: testgetInstance took 0,01 sec
>    [junit] Testcase: testgetMechanismType took 0,002 sec
>    [junit] Testcase: testisFeatureSupported took 0,002 sec
>    [junit] Testcase: testgetKeyInfoFactory took 0,002 sec
>    [junit] Testcase: testunmarshalXMLSignature took 0,068 sec
>    [junit] Running javax.xml.crypto.test.dsig.XMLSignatureTest
>    [junit] Testsuite: javax.xml.crypto.test.dsig.XMLSignatureTest
>    [junit] Tests run: 5, Failures: 1, Errors: 1, Time elapsed: 0,62 sec
>    [junit] Tests run: 5, Failures: 1, Errors: 1, Time elapsed: 0,62 sec
>    [junit]
>    [junit] Testcase: testConstructor took 0,273 sec
>    [junit] Testcase: testisFeatureSupported took 0,005 sec
>    [junit] Testcase: testsignANDvalidate took 0,239 sec
>    [junit] Testcase: testsignWithProvider took 0,04 sec
>    [junit]     FAILED
>    [junit] Should have failed because TestProvider does not support RSA
>    [junit] junit.framework.AssertionFailedError: Should have failed because
> TestProvider does not support RSA
>    [junit]     at
> javax.xml.crypto.test.dsig.XMLSignatureTest.testsignWithProvider(Unknown
> Source)
>    [junit]
>    [junit] Testcase: testSignWithEmptyNSPrefix took 0,021 sec
>    [junit]     Caused an ERROR
>    [junit] NAMESPACE_ERR: An attempt is made to create or change an object
> in a way which is incorrect with regard to namespaces.
>    [junit] org.w3c.dom.DOMException: NAMESPACE_ERR: An attempt is made to
> create or change an object in a way which is incorrect with regard to
> namespaces.
>    [junit]     at
> org.apache.xerces.dom.CoreDocumentImpl.checkNamespaceWF(Unknown Source)
>    [junit]     at org.apache.xerces.dom.ElementNSImpl.setName(Unknown Source)
>    [junit]     at org.apache.xerces.dom.ElementNSImpl.<init>(Unknown Source)
>    [junit]     at
> org.apache.xerces.dom.CoreDocumentImpl.createElementNS(Unknown Source)
>    [junit]     at
> org.jcp.xml.dsig.internal.dom.DOMUtils.createElement(DOMUtils.java:60)
>    [junit]     at
> org.jcp.xml.dsig.internal.dom.DOMXMLSignature.marshal(DOMXMLSignature.java:178)
>    [junit]     at
> org.jcp.xml.dsig.internal.dom.DOMXMLSignature.sign(DOMXMLSignature.java:304)
>    [junit]     at
> javax.xml.crypto.test.dsig.XMLSignatureTest.testSignWithEmptyNSPrefix(Unknown
> Source)
>    [junit]
>    [junit] Running javax.xml.crypto.test.dsig.XMLValidateContextTest
>    [junit] Testsuite: javax.xml.crypto.test.dsig.XMLValidateContextTest
>    [junit] Tests run: 4, Failures: 0, Errors: 0, Time elapsed: 0,066 sec
>    [junit] Tests run: 4, Failures: 0, Errors: 0, Time elapsed: 0,066 sec
>    [junit]
>    [junit] Testcase: testsetngetKeySelector took 0,015 sec
>    [junit] Testcase: testsetngetBaseURI took 0,003 sec
>    [junit] Testcase: testsetngetProperty took 0,002 sec
>    [junit] Testcase: testsetngetURIDereferencer took 0,003 sec
>    [junit] Running javax.xml.crypto.test.dsig.dom.DOMValidateContextTest
>    [junit] Testsuite: javax.xml.crypto.test.dsig.dom.DOMValidateContextTest
>    [junit] Tests run: 3, Failures: 0, Errors: 0, Time elapsed: 0,105 sec
>    [junit] Tests run: 3, Failures: 0, Errors: 0, Time elapsed: 0,105 sec
>    [junit]
>    [junit] Testcase: testConstructor took 0,038 sec
>    [junit] Testcase: testsetngetProperty took 0,011 sec
>    [junit] Testcase: testsetngetNode took 0,011 sec
>    [junit] Running javax.xml.crypto.test.dsig.keyinfo.KeyInfoFactoryTest
>    [junit] Testsuite: javax.xml.crypto.test.dsig.keyinfo.KeyInfoFactoryTest
>    [junit] Tests run: 10, Failures: 0, Errors: 0, Time elapsed: 0,149 sec
>    [junit] Tests run: 10, Failures: 0, Errors: 0, Time elapsed: 0,149 sec
>    [junit]
>    [junit] Testcase: testgetInstance took 0,086 sec
>    [junit] Testcase: testgetMechanismType took 0,002 sec
>    [junit] Testcase: testisFeatureSupported took 0,002 sec
>    [junit] Testcase: testnewKeyInfo took 0,002 sec
>    [junit] Testcase: testnewKeyName took 0,002 sec
>    [junit] Testcase: testnewKeyValue took 0,002 sec
>    [junit] Testcase: testnewPGPKeyId took 0,002 sec
>    [junit] Testcase: testnewRetrievalMethod took 0,002 sec
>    [junit] Testcase: testnewX509Data took 0,002 sec
>    [junit] Testcase: testnewX509IssuerSerial took 0,002 sec
>    [junit] Running javax.xml.crypto.test.dsig.keyinfo.KeyInfoTest
>    [junit] Testsuite: javax.xml.crypto.test.dsig.keyinfo.KeyInfoTest
>    [junit] Tests run: 5, Failures: 0, Errors: 0, Time elapsed: 0,06 sec
>    [junit] Tests run: 5, Failures: 0, Errors: 0, Time elapsed: 0,06 sec
>    [junit]
>    [junit] Testcase: testgetId took 0,005 sec
>    [junit] Testcase: testgetContent took 0,002 sec
>    [junit] Testcase: testConstructor took 0,002 sec
>    [junit] Testcase: testisFeatureSupported took 0,002 sec
>    [junit] Testcase: testMarshal took 0,007 sec
>    [junit] Running javax.xml.crypto.test.dsig.keyinfo.KeyNameTest
>    [junit] Testsuite: javax.xml.crypto.test.dsig.keyinfo.KeyNameTest
>    [junit] Tests run: 3, Failures: 0, Errors: 0, Time elapsed: 0,057 sec
>    [junit] Tests run: 3, Failures: 0, Errors: 0, Time elapsed: 0,057 sec
>    [junit]
>    [junit] Testcase: testgetName took 0,006 sec
>    [junit] Testcase: testConstructor took 0,002 sec
>    [junit] Testcase: testisFeatureSupported took 0,002 sec
>    [junit] Running javax.xml.crypto.test.dsig.keyinfo.KeyValueTest
>    [junit] Testsuite: javax.xml.crypto.test.dsig.keyinfo.KeyValueTest
>    [junit] Tests run: 3, Failures: 0, Errors: 0, Time elapsed: 0,931 sec
>    [junit] Tests run: 3, Failures: 0, Errors: 0, Time elapsed: 0,931 sec
>    [junit]
>    [junit] Testcase: testgetPublicKey took 0,294 sec
>    [junit] Testcase: testConstructor took 0,261 sec
>    [junit] Testcase: testisFeatureSupported took 0,335 sec
>    [junit] Running javax.xml.crypto.test.dsig.keyinfo.PGPDataTest
>    [junit] Testsuite: javax.xml.crypto.test.dsig.keyinfo.PGPDataTest
>    [junit] Tests run: 5, Failures: 0, Errors: 0, Time elapsed: 0,055 sec
>    [junit] Tests run: 5, Failures: 0, Errors: 0, Time elapsed: 0,055 sec
>    [junit]
>    [junit] Testcase: testgetExternalElements took 0,004 sec
>    [junit] Testcase: testgetKeyId took 0,002 sec
>    [junit] Testcase: testgetKeyPacket took 0,001 sec
>    [junit] Testcase: testConstructor took 0,002 sec
>    [junit] Testcase: testisFeatureSupported took 0,002 sec
>    [junit] Running javax.xml.crypto.test.dsig.keyinfo.RetrievalMethodTest
>    [junit] Testsuite:
> javax.xml.crypto.test.dsig.keyinfo.RetrievalMethodTest
>    [junit] Tests run: 5, Failures: 0, Errors: 0, Time elapsed: 0,055 sec
>    [junit] Tests run: 5, Failures: 0, Errors: 0, Time elapsed: 0,055 sec
>    [junit]
>    [junit] Testcase: testgetURI took 0,005 sec
>    [junit] Testcase: testgetTransforms took 0,002 sec
>    [junit] Testcase: testgetType took 0,002 sec
>    [junit] Testcase: testConstructors took 0,001 sec
>    [junit] Testcase: testisFeatureSupported took 0,001 sec
>    [junit] Running javax.xml.crypto.test.dsig.keyinfo.X509DataTest
>    [junit] Testsuite: javax.xml.crypto.test.dsig.keyinfo.X509DataTest
>    [junit] Tests run: 3, Failures: 0, Errors: 0, Time elapsed: 0,077 sec
>    [junit] Tests run: 3, Failures: 0, Errors: 0, Time elapsed: 0,077 sec
>    [junit]
>    [junit] Testcase: testgetTypes took 0,012 sec
>    [junit] Testcase: testConstructor took 0,003 sec
>    [junit] Testcase: testisFeatureSupported took 0,003 sec
>    [junit] Running javax.xml.crypto.test.dsig.keyinfo.X509IssuerSerialTest
>    [junit] Testsuite:
> javax.xml.crypto.test.dsig.keyinfo.X509IssuerSerialTest
>    [junit] Tests run: 5, Failures: 0, Errors: 0, Time elapsed: 0,066 sec
>    [junit] Tests run: 5, Failures: 0, Errors: 0, Time elapsed: 0,066 sec
>    [junit]
>    [junit] Testcase: testgetIssuerName took 0,01 sec
>    [junit] Testcase: testgetSerialNumber took 0,002 sec
>    [junit] Testcase: testConstructor took 0,002 sec
>    [junit] Testcase: testConstructorBadIssuerName took 0,002 sec
>    [junit] Testcase: testisFeatureSupported took 0,002 sec
>    [junit] Running org.apache.xml.security.c14n.implementations.AllTests
>    [junit] Testsuite: org.apache.xml.security.c14n.implementations.AllTests
>    [junit] Tests run: 14, Failures: 0, Errors: 0, Time elapsed: 0,155 sec
>    [junit] Tests run: 14, Failures: 0, Errors: 0, Time elapsed: 0,155 sec
>    [junit] ------------- Standard Output ---------------
>    [junit] chunk:0
>    [junit] ------------- ---------------- ---------------
>    [junit]
>    [junit] Testcase: testNullFirstXmlns took 0,004 sec
>    [junit] Testcase: testXmlnsPut took 0 sec
>    [junit] Testcase: testXmlnsMap took 0 sec
>    [junit] Testcase: testXmlnsMap2 took 0 sec
>    [junit] Testcase: testXmlnsPrefix took 0 sec
>    [junit] Testcase: testXmlnsRemovePrefix took 0 sec
>    [junit] Testcase: testPrefix took 0 sec
>    [junit] Testcase: testSeveralPrefixes took 0 sec
>    [junit] Testcase: testSeveralPrefixes2 took 0 sec
>    [junit] Testcase: testGetUnrenderedNodes took 0 sec
>    [junit] Testcase: testUnrederedNodes took 0 sec
>    [junit] Testcase: testBug38655 took 0 sec
>    [junit] Testcase: testBug40156 took 0,001 sec
>    [junit] Testcase: testUtf took 0,124 sec
>    [junit] Running
> org.apache.xml.security.c14n.implementations.NameSpaceSymbTableTest
>    [junit] Testsuite:
> org.apache.xml.security.c14n.implementations.NameSpaceSymbTableTest
>    [junit] Tests run: 12, Failures: 0, Errors: 0, Time elapsed: 0,03 sec
>    [junit] Tests run: 12, Failures: 0, Errors: 0, Time elapsed: 0,03 sec
>    [junit]
>    [junit] Testcase: testNullFirstXmlns took 0,004 sec
>    [junit] Testcase: testXmlnsPut took 0 sec
>    [junit] Testcase: testXmlnsMap took 0 sec
>    [junit] Testcase: testXmlnsMap2 took 0 sec
>    [junit] Testcase: testXmlnsPrefix took 0 sec
>    [junit] Testcase: testXmlnsRemovePrefix took 0 sec
>    [junit] Testcase: testPrefix took 0 sec
>    [junit] Testcase: testSeveralPrefixes took 0 sec
>    [junit] Testcase: testSeveralPrefixes2 took 0,001 sec
>    [junit] Testcase: testGetUnrenderedNodes took 0 sec
>    [junit] Testcase: testUnrederedNodes took 0,001 sec
>    [junit] Testcase: testBug38655 took 0 sec
>    [junit] Running
> org.apache.xml.security.c14n.implementations.UtfHelperTest
>    [junit] Testsuite:
> org.apache.xml.security.c14n.implementations.UtfHelperTest
>    [junit] Tests run: 2, Failures: 0, Errors: 0, Time elapsed: 0,169 sec
>    [junit] Tests run: 2, Failures: 0, Errors: 0, Time elapsed: 0,169 sec
>    [junit] ------------- Standard Output ---------------
>    [junit] chunk:0
>    [junit] ------------- ---------------- ---------------
>    [junit]
>    [junit] Testcase: testBug40156 took 0,002 sec
>    [junit] Testcase: testUtf took 0,125 sec
>    [junit] Running org.apache.xml.security.test.AllTests
>    [junit] Testsuite: org.apache.xml.security.test.AllTests
>    [junit] Tests run: 129, Failures: 0, Errors: 0, Time elapsed: 22,568 sec
>    [junit] Tests run: 129, Failures: 0, Errors: 0, Time elapsed: 22,568 sec
>    [junit] ------------- Standard Output ---------------
>    [junit] chunk:0
>    [junit] ------------- ---------------- ---------------
>    [junit]
>    [junit] Testcase: testNamespaceIsAbsolute01 took 0,002 sec
>    [junit] Testcase: testNamespaceIsAbsolute02 took 0,001 sec
>    [junit] Testcase: testNamespaceIsAbsolute03 took 0 sec
>    [junit] Testcase: testNamespaceIsRelative01 took 0 sec
>    [junit] Testcase: testNamespaceIsRelative02 took 0 sec
>    [junit] Testcase: test31withCommentsSubtree took 0,023 sec
>    [junit] Testcase: test31withCommentsSubset took 0,026 sec
>    [junit] Testcase: test31subtree took 0,003 sec
>    [junit] Testcase: test31subset took 0,005 sec
>    [junit] Testcase: test32subtree took 0,003 sec
>    [junit] Testcase: test32subset took 0,005 sec
>    [junit] Testcase: test33subtree took 0,006 sec
>    [junit] Testcase: test33subset took 0,007 sec
>    [junit] Testcase: test34 took 0,004 sec
>    [junit] Testcase: test34subtree took 0,004 sec
>    [junit] Testcase: test34subset took 0,005 sec
>    [junit] Testcase: test35subtree took 0,007 sec
>    [junit] Testcase: test35subset took 0,005 sec
>    [junit] Testcase: test36subtree took 0,004 sec
>    [junit] Testcase: test36subset took 0,003 sec
>    [junit] Testcase: test37 took 0,013 sec
>    [junit] Testcase: test37byNodeList took 0,012 sec
>    [junit] Testcase: testRelativeNSbehaviour took 0,004 sec
>    [junit] Testcase: testTranslationFromUTF16toUTF8 took 0,028 sec
>    [junit] Testcase: testXMLAttributes1 took 0,005 sec
>    [junit] Testcase: testXMLAttributes2 took 0,004 sec
>    [junit] Testcase: testXMLAttributes3 took 0,003 sec
>    [junit] Testcase: testA took 0,201 sec
>    [junit] Testcase: test221 took 0,004 sec
>    [junit] Testcase: test222 took 0,004 sec
>    [junit] Testcase: test221excl took 0,004 sec
>    [junit] Testcase: test222excl took 0,004 sec
>    [junit] Testcase: test223excl took 0,009 sec
>    [junit] Testcase: testNodeSet took 0,004 sec
>    [junit] Testcase: testBad01 took 0,006 sec
>    [junit] Testcase: testBad02 took 0,005 sec
>    [junit] Testcase: testBad03 took 0,005 sec
>    [junit] Testcase: testGood01 took 0,005 sec
>    [junit] Testcase: testGood02 took 0,005 sec
>    [junit] Testcase: testGood03 took 0,005 sec
>    [junit] Testcase: testGood04 took 0,005 sec
>    [junit] Testcase: testGood05 took 0,005 sec
>    [junit] Testcase: test01 took 0,006 sec
>    [junit] Testcase: test02 took 0,01 sec
>    [junit] Testcase: test03 took 0,006 sec
>    [junit] Testcase: testEmptyNodeSet took 2,605 sec
>    [junit] Testcase: testOne took 2,742 sec
>    [junit] Testcase: testTwo took 2,758 sec
>    [junit] Testcase: testWithNSPrefixDisabled took 1,717 sec
>    [junit] Testcase: testAddX509SubjectName took 0,059 sec
>    [junit] Testcase: testSetOctetStreamGetOctetStream took 0,001 sec
>    [junit] Testcase: testIsInitializedWithOctetStream took 0 sec
>    [junit] Testcase: testOctetStreamIsOctetStream took 0 sec
>    [junit] Testcase: testOctetStreamIsNotNodeSet took 0 sec
>    [junit] Testcase: testGood took 0,076 sec
>    [junit] Testcase: testBadC14NAlgo took 0,006 sec
>    [junit] Testcase: testBadSigAlgo took 0,008 sec
>    [junit] Testcase: testBadTransformAlgo took 0,009 sec
>    [junit] Testcase: testDSAPublicKey took 0,005 sec
>    [junit] Testcase: testIdSoap took 0,004 sec
>    [junit] Testcase: testIdWithOtherIdSoap took 0,004 sec
>    [junit] Testcase: testANoId took 0,003 sec
>    [junit] Testcase: testA1 took 0 sec
>    [junit] Testcase: testWrap1 took 0,001 sec
>    [junit] Testcase: testWrap2 took 0 sec
>    [junit] Testcase: testOldTransformSpiApi took 0,003 sec
>    [junit] Testcase: testOldResourceResolverSpi took 0,003 sec
>    [junit] Testcase: testOldKeyResolverSpi took 0,003 sec
>    [junit] Testcase: testOldKeyResolverSpiInKeyInfo took 0,002 sec
>    [junit] Testcase: testCustomResolver took 0,003 sec
>    [junit] Testcase: testLocalFileWithEmptyBaseURI took 0,002 sec
>    [junit] Testcase: testBug40783 took 0,004 sec
>    [junit] Testcase: testNullFirstXmlns took 0 sec
>    [junit] Testcase: testXmlnsPut took 0,001 sec
>    [junit] Testcase: testXmlnsMap took 0 sec
>    [junit] Testcase: testXmlnsMap2 took 0 sec
>    [junit] Testcase: testXmlnsPrefix took 0 sec
>    [junit] Testcase: testXmlnsRemovePrefix took 0 sec
>    [junit] Testcase: testPrefix took 0 sec
>    [junit] Testcase: testSeveralPrefixes took 0 sec
>    [junit] Testcase: testSeveralPrefixes2 took 0 sec
>    [junit] Testcase: testGetUnrenderedNodes took 0 sec
>    [junit] Testcase: testUnrederedNodes took 0 sec
>    [junit] Testcase: testBug38655 took 0 sec
>    [junit] Testcase: testBug40156 took 0 sec
>    [junit] Testcase: testUtf took 0,129 sec
>    [junit] Testcase: test1 took 0,002 sec
>    [junit] Testcase: test2 took 0,002 sec
>    [junit] Testcase: test3 took 0,005 sec
>    [junit] Testcase: testXpath2Transform took 0,017 sec
>    [junit] Testcase: testSameKeySeveralAlgorithSigning took 1,891 sec
>    [junit] Testcase: test_fifteen_enveloping_hmac_sha1 took 0,392 sec
>    [junit] Testcase: test_fifteen_enveloping_hmac_sha1_40 took 0,006 sec
>    [junit] Testcase: test_fifteen_enveloped_dsa took 0,081 sec
>    [junit] Testcase: test_fifteen_enveloping_b64_dsa took 0,081 sec
>    [junit] Testcase: test_fifteen_enveloping_dsa took 0,082 sec
>    [junit] Testcase: test_fifteen_enveloping_rsa took 0,011 sec
>    [junit] Testcase: test_fifteen_external_b64_dsa took 0,095 sec
>    [junit] Testcase: test_fifteen_external_dsa took 0,086 sec
>    [junit] Testcase: test_sixteen_external_dsa took 0,415 sec
>    [junit] Testcase: test_sixteen_bad_signature took 0,42 sec
>    [junit] Testcase: test_twenty_three_enveloping_hmac_sha1 took 0,007 sec
>    [junit] Testcase: test_twenty_three_enveloping_hmac_sha1_40 took 0,007
> sec
>    [junit] Testcase: test_twenty_three_enveloped_dsa took 0,082 sec
>    [junit] Testcase: test_twenty_three_enveloping_b64_dsa took 0,082 sec
>    [junit] Testcase: test_twenty_three_enveloping_dsa took 0,082 sec
>    [junit] Testcase: test_twenty_three_enveloping_rsa took 0,011 sec
>    [junit] Testcase: test_twenty_three_external_b64_dsa took 0,095 sec
>    [junit] Testcase: test_twenty_three_external_dsa took 0,084 sec
>    [junit] Testcase: test_twenty_three_external_dsa_2 took 0,417 sec
>    [junit] Testcase: test_signatureAlgorithms_signatures_hMACShortSignature
> took 0,007 sec
>    [junit] Testcase: test_signatureAlgorithms_signatures_hMACSignature took
> 0,007 sec
>    [junit] Testcase: test_coreFeatures_signatures_manifestSignature_core
> took 0,01 sec
>    [junit] Testcase:
> test_coreFeatures_signatures_manifestSignature_manifest took 0,016 sec
>    [junit] Testcase: test_coreFeatures_signatures_signatureTypesSignature
> took 0,118 sec
>    [junit] Testcase:
> test_coreFeatures_signatures_anonymousReferenceSignature took 0,012 sec
>    [junit] Testcase: test_signatureAlgorithms_signatures_dSASignature took
> 0,08 sec
>    [junit] Testcase: test_signatureAlgorithms_signatures_rSASignature took
> 0,009 sec
>    [junit] Testcase: test_transforms_signatures_base64DecodeSignature took
> 0,023 sec
>    [junit] Testcase: test_transforms_signatures_c14nSignature took 0,017
> sec
>    [junit] Testcase: test_transforms_signatures_envelopedSignatureSignature
> took 0,009 sec
>    [junit] Testcase: test_transforms_signatures_xPathSignature took 0,018
> sec
>    [junit] Testcase: test_enveloping took 0,009 sec
>    [junit] Testcase: test_enveloped took 0,009 sec
>    [junit] Testcase: test_Y1 took 0,089 sec
>    [junit] Testcase: test_Y2 took 0,132 sec
>    [junit] Testcase: test_Y3 took 0,191 sec
>    [junit] Testcase: test_Y4 took 6,622 sec
>    [junit] Testcase: test_xfilter2 took 0,067 sec
>    [junit] Running org.apache.xml.security.test.EncryptionTest
>    [junit] Testsuite: org.apache.xml.security.test.EncryptionTest
>    [junit] Tests run: 22, Failures: 0, Errors: 0, Time elapsed: 2,732 sec
>    [junit] Tests run: 22, Failures: 0, Errors: 0, Time elapsed: 2,732 sec
>    [junit] ------------- Standard Output ---------------
>    [junit] <?xml version="1.0" encoding="UTF-8"?><users>
>    [junit]   <user><xenc:EncryptedData
> xmlns:xenc="http://www.w3.org/2001/04/xmlenc#"
> Type="http://www.w3.org/2001/04/xmlenc#Content"><xenc:EncryptionMethod
> Algorithm="http://www.w3.org/2001/04/xmlenc#tripledes-cbc"
> xmlns:xenc="http://www.w3.org/2001/04/xmlenc#"/><xenc:CipherData
> xmlns:xenc="http://www.w3.org/2001/04/xmlenc#"><xenc:CipherValue
> xmlns:xenc="http://www.w3.org/2001/04/xmlenc#">GeVmEemCNJhgNfJ9UpvH+pICBL+LbCH7Ua3w2GL8UO33h7FYcY+F2UYxuwpeh73wfOo7HnuU0hOR
>    [junit]
> /OCnVCtnhbw/UIDM5y+PCjxZ5uSt4N89Nt0LpVpLkebYTMov9TXuro5iTu7W49KWaq6Ejoj5pmKJ
>    [junit]
> 1A7nxZeP</xenc:CipherValue></xenc:CipherData></xenc:EncryptedData></user>
>    [junit] </users>------------- ---------------- ---------------
>    [junit]
>    [junit] Testcase: testAES128ElementAES192KWCipherUsingKEK took 0,556 sec
>    [junit] Testcase: testAES128ElementRSAKWCipherUsingKEK took 1,005 sec
>    [junit] Testcase: testAES192ElementAES256KWCipher took 0,089 sec
>    [junit] Testcase: testTrippleDesElementCipher took 0,074 sec
>    [junit] Testcase: testAes128ElementCipher took 0,071 sec
>    [junit] Testcase: testAes192ElementCipher took 0,07 sec
>    [junit] Testcase: testAes265ElementCipher took 0,071 sec
>    [junit] Testcase: testTrippleDesDocumentCipher took 0,395 sec
>    [junit] Testcase: testSameDocumentCipherReference took 0,039 sec
>    [junit] Testcase: testSerializedData took 0,03 sec
>    [junit] Testcase: testEncryptedKeyWithRecipient took 0,006 sec
>    [junit] Testcase: test_five_content_3des_cbc took 0,023 sec
>    [junit] Testcase: test_five_content_aes256_cbc took 0,019 sec
>    [junit] Testcase: test_five_content_aes128_cbc_kw_aes192 took 0,017 sec
>    [junit] Testcase: test_five_content_3des_cbc_kw_aes128 took 0,017 sec
>    [junit] Testcase: test_five_content_aes128_cbc_rsa_15 took 0,074 sec
>    [junit] Testcase: test_five_element_aes192_cbc_ref took 0,021 sec
>    [junit] Testcase: test_five_data_aes128_cbc took 0,011 sec
>    [junit] Testcase: test_five_data_aes256_cbc_3des took 0,016 sec
>    [junit] Testcase: test_five_data_aes192_cbc_aes256 took 0,012 sec
>    [junit] Testcase: test_five_data_3des_cbc_rsa_oaep took 0,068 sec
>    [junit] Testcase: testContentRemoved took 0,023 sec
>    [junit] Running org.apache.xml.security.test.InteropTest
>    [junit] Testsuite: org.apache.xml.security.test.InteropTest
>    [junit] Tests run: 38, Failures: 0, Errors: 0, Time elapsed: 12,546 sec
>    [junit] Tests run: 38, Failures: 0, Errors: 0, Time elapsed: 12,546 sec
>    [junit]
>    [junit] Testcase: test_fifteen_enveloping_hmac_sha1 took 0,69 sec
>    [junit] Testcase: test_fifteen_enveloping_hmac_sha1_40 took 0,008 sec
>    [junit] Testcase: test_fifteen_enveloped_dsa took 0,09 sec
>    [junit] Testcase: test_fifteen_enveloping_b64_dsa took 0,083 sec
>    [junit] Testcase: test_fifteen_enveloping_dsa took 0,089 sec
>    [junit] Testcase: test_fifteen_enveloping_rsa took 0,017 sec
>    [junit] Testcase: test_fifteen_external_b64_dsa took 0,098 sec
>    [junit] Testcase: test_fifteen_external_dsa took 0,088 sec
>    [junit] Testcase: test_sixteen_external_dsa took 0,455 sec
>    [junit] Testcase: test_sixteen_bad_signature took 0,295 sec
>    [junit] Testcase: test_twenty_three_enveloping_hmac_sha1 took 0,005 sec
>    [junit] Testcase: test_twenty_three_enveloping_hmac_sha1_40 took 0,005
> sec
>    [junit] Testcase: test_twenty_three_enveloped_dsa took 0,058 sec
>    [junit] Testcase: test_twenty_three_enveloping_b64_dsa took 0,054 sec
>    [junit] Testcase: test_twenty_three_enveloping_dsa took 0,055 sec
>    [junit] Testcase: test_twenty_three_enveloping_rsa took 0,012 sec
>    [junit] Testcase: test_twenty_three_external_b64_dsa took 0,082 sec
>    [junit] Testcase: test_twenty_three_external_dsa took 0,084 sec
>    [junit] Testcase: test_twenty_three_external_dsa_2 took 0,442 sec
>    [junit] Testcase: test_signatureAlgorithms_signatures_hMACShortSignature
> took 0,007 sec
>    [junit] Testcase: test_signatureAlgorithms_signatures_hMACSignature took
> 0,007 sec
>    [junit] Testcase: test_coreFeatures_signatures_manifestSignature_core
> took 0,011 sec
>    [junit] Testcase:
> test_coreFeatures_signatures_manifestSignature_manifest took 0,015 sec
>    [junit] Testcase: test_coreFeatures_signatures_signatureTypesSignature
> took 0,116 sec
>    [junit] Testcase:
> test_coreFeatures_signatures_anonymousReferenceSignature took 0,012 sec
>    [junit] Testcase: test_signatureAlgorithms_signatures_dSASignature took
> 0,08 sec
>    [junit] Testcase: test_signatureAlgorithms_signatures_rSASignature took
> 0,009 sec
>    [junit] Testcase: test_transforms_signatures_base64DecodeSignature took
> 0,024 sec
>    [junit] Testcase: test_transforms_signatures_c14nSignature took 0,019
> sec
>    [junit] Testcase: test_transforms_signatures_envelopedSignatureSignature
> took 0,01 sec
>    [junit] Testcase: test_transforms_signatures_xPathSignature took 0,018
> sec
>    [junit] Testcase: test_enveloping took 0,009 sec
>    [junit] Testcase: test_enveloped took 0,009 sec
>    [junit] Testcase: test_Y1 took 0,091 sec
>    [junit] Testcase: test_Y2 took 0,137 sec
>    [junit] Testcase: test_Y3 took 0,19 sec
>    [junit] Testcase: test_Y4 took 8,961 sec
>    [junit] Testcase: test_xfilter2 took 0,068 sec
>    [junit] Running org.apache.xml.security.test.ModuleTest
>    [junit] Testsuite: org.apache.xml.security.test.ModuleTest
>    [junit] Tests run: 91, Failures: 0, Errors: 0, Time elapsed: 15,741 sec
>    [junit] Tests run: 91, Failures: 0, Errors: 0, Time elapsed: 15,741 sec
>    [junit] ------------- Standard Output ---------------
>    [junit] chunk:0
>    [junit] ------------- ---------------- ---------------
>    [junit]
>    [junit] Testcase: testNamespaceIsAbsolute01 took 0,002 sec
>    [junit] Testcase: testNamespaceIsAbsolute02 took 0 sec
>    [junit] Testcase: testNamespaceIsAbsolute03 took 0,001 sec
>    [junit] Testcase: testNamespaceIsRelative01 took 0 sec
>    [junit] Testcase: testNamespaceIsRelative02 took 0,001 sec
>    [junit] Testcase: test31withCommentsSubtree took 0,022 sec
>    [junit] Testcase: test31withCommentsSubset took 0,026 sec
>    [junit] Testcase: test31subtree took 0,004 sec
>    [junit] Testcase: test31subset took 0,004 sec
>    [junit] Testcase: test32subtree took 0,003 sec
>    [junit] Testcase: test32subset took 0,005 sec
>    [junit] Testcase: test33subtree took 0,006 sec
>    [junit] Testcase: test33subset took 0,007 sec
>    [junit] Testcase: test34 took 0,004 sec
>    [junit] Testcase: test34subtree took 0,004 sec
>    [junit] Testcase: test34subset took 0,005 sec
>    [junit] Testcase: test35subtree took 0,006 sec
>    [junit] Testcase: test35subset took 0,005 sec
>    [junit] Testcase: test36subtree took 0,004 sec
>    [junit] Testcase: test36subset took 0,004 sec
>    [junit] Testcase: test37 took 0,013 sec
>    [junit] Testcase: test37byNodeList took 0,013 sec
>    [junit] Testcase: testRelativeNSbehaviour took 0,003 sec
>    [junit] Testcase: testTranslationFromUTF16toUTF8 took 0,024 sec
>    [junit] Testcase: testXMLAttributes1 took 0,008 sec
>    [junit] Testcase: testXMLAttributes2 took 0,004 sec
>    [junit] Testcase: testXMLAttributes3 took 0,004 sec
>    [junit] Testcase: testA took 0,197 sec
>    [junit] Testcase: test221 took 0,004 sec
>    [junit] Testcase: test222 took 0,004 sec
>    [junit] Testcase: test221excl took 0,004 sec
>    [junit] Testcase: test222excl took 0,004 sec
>    [junit] Testcase: test223excl took 0,009 sec
>    [junit] Testcase: testNodeSet took 0,004 sec
>    [junit] Testcase: testBad01 took 0,006 sec
>    [junit] Testcase: testBad02 took 0,005 sec
>    [junit] Testcase: testBad03 took 0,005 sec
>    [junit] Testcase: testGood01 took 0,005 sec
>    [junit] Testcase: testGood02 took 0,005 sec
>    [junit] Testcase: testGood03 took 0,005 sec
>    [junit] Testcase: testGood04 took 0,005 sec
>    [junit] Testcase: testGood05 took 0,005 sec
>    [junit] Testcase: test01 took 0,005 sec
>    [junit] Testcase: test02 took 0,005 sec
>    [junit] Testcase: test03 took 0,009 sec
>    [junit] Testcase: testEmptyNodeSet took 1,551 sec
>    [junit] Testcase: testOne took 2,729 sec
>    [junit] Testcase: testTwo took 2,082 sec
>    [junit] Testcase: testWithNSPrefixDisabled took 1,48 sec
>    [junit] Testcase: testAddX509SubjectName took 0,059 sec
>    [junit] Testcase: testSetOctetStreamGetOctetStream took 0 sec
>    [junit] Testcase: testIsInitializedWithOctetStream took 0 sec
>    [junit] Testcase: testOctetStreamIsOctetStream took 0 sec
>    [junit] Testcase: testOctetStreamIsNotNodeSet took 0 sec
>    [junit] Testcase: testGood took 0,083 sec
>    [junit] Testcase: testBadC14NAlgo took 0,008 sec
>    [junit] Testcase: testBadSigAlgo took 0,009 sec
>    [junit] Testcase: testBadTransformAlgo took 0,01 sec
>    [junit] Testcase: testDSAPublicKey took 0,005 sec
>    [junit] Testcase: testIdSoap took 0,003 sec
>    [junit] Testcase: testIdWithOtherIdSoap took 0,004 sec
>    [junit] Testcase: testANoId took 0,004 sec
>    [junit] Testcase: testA1 took 0 sec
>    [junit] Testcase: testWrap1 took 0,001 sec
>    [junit] Testcase: testWrap2 took 0 sec
>    [junit] Testcase: testOldTransformSpiApi took 0,003 sec
>    [junit] Testcase: testOldResourceResolverSpi took 0,004 sec
>    [junit] Testcase: testOldKeyResolverSpi took 0,004 sec
>    [junit] Testcase: testOldKeyResolverSpiInKeyInfo took 0,003 sec
>    [junit] Testcase: testCustomResolver took 0,005 sec
>    [junit] Testcase: testLocalFileWithEmptyBaseURI took 0,003 sec
>    [junit] Testcase: testBug40783 took 0,006 sec
>    [junit] Testcase: testNullFirstXmlns took 0 sec
>    [junit] Testcase: testXmlnsPut took 0,001 sec
>    [junit] Testcase: testXmlnsMap took 0 sec
>    [junit] Testcase: testXmlnsMap2 took 0 sec
>    [junit] Testcase: testXmlnsPrefix took 0 sec
>    [junit] Testcase: testXmlnsRemovePrefix took 0 sec
>    [junit] Testcase: testPrefix took 0 sec
>    [junit] Testcase: testSeveralPrefixes took 0 sec
>    [junit] Testcase: testSeveralPrefixes2 took 0,001 sec
>    [junit] Testcase: testGetUnrenderedNodes took 0 sec
>    [junit] Testcase: testUnrederedNodes took 0,001 sec
>    [junit] Testcase: testBug38655 took 0 sec
>    [junit] Testcase: testBug40156 took 0,001 sec
>    [junit] Testcase: testUtf took 0,17 sec
>    [junit] Testcase: test1 took 0,003 sec
>    [junit] Testcase: test2 took 0,003 sec
>    [junit] Testcase: test3 took 0,007 sec
>    [junit] Testcase: testXpath2Transform took 0,024 sec
>    [junit] Testcase: testSameKeySeveralAlgorithSigning took 6,966 sec
>    [junit] Running org.apache.xml.security.test.algorithms.AllTests
>    [junit] Testsuite: org.apache.xml.security.test.algorithms.AllTests
>    [junit] Tests run: 1, Failures: 0, Errors: 0, Time elapsed: 1,89 sec
>    [junit] Tests run: 1, Failures: 0, Errors: 0, Time elapsed: 1,89 sec
>    [junit]
>    [junit] Testcase: testSameKeySeveralAlgorithSigning took 1,87 sec
>    [junit] Running
> org.apache.xml.security.test.algorithms.SignatureAlgorithmTest
>    [junit] Testsuite:
> org.apache.xml.security.test.algorithms.SignatureAlgorithmTest
>    [junit] Tests run: 1, Failures: 0, Errors: 0, Time elapsed: 2,002 sec
>    [junit] Tests run: 1, Failures: 0, Errors: 0, Time elapsed: 2,002 sec
>    [junit]
>    [junit] Testcase: testSameKeySeveralAlgorithSigning took 1,982 sec
>    [junit] Running org.apache.xml.security.test.c14n.helper.AttrCompareTest
>    [junit] Testsuite:
> org.apache.xml.security.test.c14n.helper.AttrCompareTest
>    [junit] Tests run: 3, Failures: 0, Errors: 0, Time elapsed: 0,028 sec
>    [junit] Tests run: 3, Failures: 0, Errors: 0, Time elapsed: 0,028 sec
>    [junit] ------------- Standard Output ---------------
>    [junit] Attr1: goo:foo="" (foo)
>    [junit] ------------- ---------------- ---------------
>    [junit]
>    [junit] Testcase: testA1 took 0,003 sec
>    [junit] Testcase: testA2 took 0,002 sec
>    [junit] Testcase: testComplete took 0,002 sec
>    [junit] Running org.apache.xml.security.test.c14n.helper.C14nHelperTest
>    [junit] Testsuite:
> org.apache.xml.security.test.c14n.helper.C14nHelperTest
>    [junit] Tests run: 5, Failures: 0, Errors: 0, Time elapsed: 0,03 sec
>    [junit] Tests run: 5, Failures: 0, Errors: 0, Time elapsed: 0,03 sec
>    [junit]
>    [junit] Testcase: testNamespaceIsAbsolute01 took 0,002 sec
>    [junit] Testcase: testNamespaceIsAbsolute02 took 0 sec
>    [junit] Testcase: testNamespaceIsAbsolute03 took 0,001 sec
>    [junit] Testcase: testNamespaceIsRelative01 took 0 sec
>    [junit] Testcase: testNamespaceIsRelative02 took 0 sec
>    [junit] Running
> org.apache.xml.security.test.c14n.implementations.Canonicalizer20010315ExclusiveTest
>    [junit] Testsuite:
> org.apache.xml.security.test.c14n.implementations.Canonicalizer20010315ExclusiveTest
>    [junit] Tests run: 7, Failures: 0, Errors: 0, Time elapsed: 0,223 sec
>    [junit] Tests run: 7, Failures: 0, Errors: 0, Time elapsed: 0,223 sec
>    [junit]
>    [junit] Testcase: testA took 0,175 sec
>    [junit] Testcase: test221 took 0,003 sec
>    [junit] Testcase: test222 took 0,002 sec
>    [junit] Testcase: test221excl took 0,003 sec
>    [junit] Testcase: test222excl took 0,004 sec
>    [junit] Testcase: test223excl took 0,011 sec
>    [junit] Testcase: testNodeSet took 0,003 sec
>    [junit] Running
> org.apache.xml.security.test.c14n.implementations.Canonicalizer20010315Test
>    [junit] Testsuite:
> org.apache.xml.security.test.c14n.implementations.Canonicalizer20010315Test
>    [junit] Tests run: 22, Failures: 0, Errors: 0, Time elapsed: 0,211 sec
>    [junit] Tests run: 22, Failures: 0, Errors: 0, Time elapsed: 0,211 sec
>    [junit]
>    [junit] Testcase: test31withCommentsSubtree took 0,029 sec
>    [junit] Testcase: test31withCommentsSubset took 0,026 sec
>    [junit] Testcase: test31subtree took 0,003 sec
>    [junit] Testcase: test31subset took 0,004 sec
>    [junit] Testcase: test32subtree took 0,003 sec
>    [junit] Testcase: test32subset took 0,004 sec
>    [junit] Testcase: test33subtree took 0,007 sec
>    [junit] Testcase: test33subset took 0,007 sec
>    [junit] Testcase: test34 took 0,004 sec
>    [junit] Testcase: test34subtree took 0,004 sec
>    [junit] Testcase: test34subset took 0,005 sec
>    [junit] Testcase: test35subtree took 0,005 sec
>    [junit] Testcase: test35subset took 0,007 sec
>    [junit] Testcase: test36subtree took 0,004 sec
>    [junit] Testcase: test36subset took 0,003 sec
>    [junit] Testcase: test37 took 0,013 sec
>    [junit] Testcase: test37byNodeList took 0,012 sec
>    [junit] Testcase: testRelativeNSbehaviour took 0,003 sec
>    [junit] Testcase: testTranslationFromUTF16toUTF8 took 0,024 sec
>    [junit] Testcase: testXMLAttributes1 took 0,004 sec
>    [junit] Testcase: testXMLAttributes2 took 0,004 sec
>    [junit] Testcase: testXMLAttributes3 took 0,007 sec
>    [junit] Running
> org.apache.xml.security.test.c14n.implementations.ExclusiveC14NInterop
>    [junit] Testsuite:
> org.apache.xml.security.test.c14n.implementations.ExclusiveC14NInterop
>    [junit] Tests run: 5, Failures: 0, Errors: 0, Time elapsed: 10,311 sec
>    [junit] Tests run: 5, Failures: 0, Errors: 0, Time elapsed: 10,311 sec
>    [junit]
>    [junit] Testcase: test_Y1 took 0,105 sec
>    [junit] Testcase: test_Y2 took 0,121 sec
>    [junit] Testcase: test_Y3 took 0,134 sec
>    [junit] Testcase: test_Y4 took 9,824 sec
>    [junit] Testcase: test_xfilter2 took 0,102 sec
>    [junit] Running org.apache.xml.security.test.encryption.BaltimoreEncTest
>    [junit] Testsuite:
> org.apache.xml.security.test.encryption.BaltimoreEncTest
>    [junit] Tests run: 10, Failures: 0, Errors: 0, Time elapsed: 1,37 sec
>    [junit] Tests run: 10, Failures: 0, Errors: 0, Time elapsed: 1,37 sec
>    [junit]
>    [junit] Testcase: test_five_content_3des_cbc took 0,856 sec
>    [junit] Testcase: test_five_content_aes256_cbc took 0,073 sec
>    [junit] Testcase: test_five_content_aes128_cbc_kw_aes192 took 0,038 sec
>    [junit] Testcase: test_five_content_3des_cbc_kw_aes128 took 0,026 sec
>    [junit] Testcase: test_five_content_aes128_cbc_rsa_15 took 0,118 sec
>    [junit] Testcase: test_five_element_aes192_cbc_ref took 0,052 sec
>    [junit] Testcase: test_five_data_aes128_cbc took 0,015 sec
>    [junit] Testcase: test_five_data_aes256_cbc_3des took 0,023 sec
>    [junit] Testcase: test_five_data_aes192_cbc_aes256 took 0,017 sec
>    [junit] Testcase: test_five_data_3des_cbc_rsa_oaep took 0,091 sec
>    [junit] Running
> org.apache.xml.security.test.encryption.EncryptContentTest
>    [junit] Testsuite:
> org.apache.xml.security.test.encryption.EncryptContentTest
>    [junit] Tests run: 1, Failures: 0, Errors: 0, Time elapsed: 0,634 sec
>    [junit] Tests run: 1, Failures: 0, Errors: 0, Time elapsed: 0,634 sec
>    [junit] ------------- Standard Output ---------------
>    [junit] <?xml version="1.0" encoding="UTF-8"?><users>
>    [junit]   <user><xenc:EncryptedData
> xmlns:xenc="http://www.w3.org/2001/04/xmlenc#"
> Type="http://www.w3.org/2001/04/xmlenc#Content"><xenc:EncryptionMethod
> Algorithm="http://www.w3.org/2001/04/xmlenc#tripledes-cbc"
> xmlns:xenc="http://www.w3.org/2001/04/xmlenc#"/><xenc:CipherData
> xmlns:xenc="http://www.w3.org/2001/04/xmlenc#"><xenc:CipherValue
> xmlns:xenc="http://www.w3.org/2001/04/xmlenc#">3ut+4jaqN7+S/HrAP6maBLKpoXm8PIkmrrCCSLfWK4DsCm7PlnrThfM79uap1PJNJza5ohZFDO0t
>    [junit]
> LDKV0kmzKdybeLerGS4R6yaZ9m0lrV8trnp/gPmRrNTxAEC2ANUVMetDs61KO4fOdFSCe7At/m1R
>    [junit]
> o28YMW2M</xenc:CipherValue></xenc:CipherData></xenc:EncryptedData></user>
>    [junit] </users>------------- ---------------- ---------------
>    [junit]
>    [junit] Testcase: testContentRemoved took 0,594 sec
>    [junit] Running org.apache.xml.security.test.encryption.XMLCipherTester
>    [junit] Testsuite:
> org.apache.xml.security.test.encryption.XMLCipherTester
>    [junit] Tests run: 11, Failures: 0, Errors: 0, Time elapsed: 3,051 sec
>    [junit] Tests run: 11, Failures: 0, Errors: 0, Time elapsed: 3,051 sec
>    [junit]
>    [junit] Testcase: testAES128ElementAES192KWCipherUsingKEK took 0,573 sec
>    [junit] Testcase: testAES128ElementRSAKWCipherUsingKEK took 1,511 sec
>    [junit] Testcase: testAES192ElementAES256KWCipher took 0,091 sec
>    [junit] Testcase: testTrippleDesElementCipher took 0,075 sec
>    [junit] Testcase: testAes128ElementCipher took 0,073 sec
>    [junit] Testcase: testAes192ElementCipher took 0,071 sec
>    [junit] Testcase: testAes265ElementCipher took 0,072 sec
>    [junit] Testcase: testTrippleDesDocumentCipher took 0,449 sec
>    [junit] Testcase: testSameDocumentCipherReference took 0,058 sec
>    [junit] Testcase: testSerializedData took 0,045 sec
>    [junit] Testcase: testEncryptedKeyWithRecipient took 0,01 sec
>    [junit] Running
> org.apache.xml.security.test.external.org.apache.xalan.XPathAPI.AttributeAncestorOrSelfTest
>    [junit] Testsuite:
> org.apache.xml.security.test.external.org.apache.xalan.XPathAPI.AttributeAncestorOrSelfTest
>    [junit] Tests run: 3, Failures: 0, Errors: 0, Time elapsed: 0,057 sec
>    [junit] Tests run: 3, Failures: 0, Errors: 0, Time elapsed: 0,057 sec
>    [junit]
>    [junit] Testcase: test01 took 0,028 sec
>    [junit] Testcase: test02 took 0,004 sec
>    [junit] Testcase: test03 took 0,004 sec
>    [junit] Running
> org.apache.xml.security.test.external.org.apache.xalan.XPathAPI.XalanBug1425Test
>    [junit] Testsuite:
> org.apache.xml.security.test.external.org.apache.xalan.XPathAPI.XalanBug1425Test
>    [junit] Tests run: 8, Failures: 0, Errors: 0, Time elapsed: 0,086 sec
>    [junit] Tests run: 8, Failures: 0, Errors: 0, Time elapsed: 0,086 sec
>    [junit]
>    [junit] Testcase: testBad01 took 0,034 sec
>    [junit] Testcase: testBad02 took 0,004 sec
>    [junit] Testcase: testBad03 took 0,004 sec
>    [junit] Testcase: testGood01 took 0,004 sec
>    [junit] Testcase: testGood02 took 0,004 sec
>    [junit] Testcase: testGood03 took 0,003 sec
>    [junit] Testcase: testGood04 took 0,003 sec
>    [junit] Testcase: testGood05 took 0,004 sec
>    [junit] Running org.apache.xml.security.test.interop.BaltimoreTest
>    [junit] Testsuite: org.apache.xml.security.test.interop.BaltimoreTest
>    [junit] Tests run: 19, Failures: 0, Errors: 0, Time elapsed: 2,022 sec
>    [junit] Tests run: 19, Failures: 0, Errors: 0, Time elapsed: 2,022 sec
>    [junit]
>    [junit] Testcase: test_fifteen_enveloping_hmac_sha1 took 0,469 sec
>    [junit] Testcase: test_fifteen_enveloping_hmac_sha1_40 took 0,005 sec
>    [junit] Testcase: test_fifteen_enveloped_dsa took 0,06 sec
>    [junit] Testcase: test_fifteen_enveloping_b64_dsa took 0,056 sec
>    [junit] Testcase: test_fifteen_enveloping_dsa took 0,056 sec
>    [junit] Testcase: test_fifteen_enveloping_rsa took 0,017 sec
>    [junit] Testcase: test_fifteen_external_b64_dsa took 0,066 sec
>    [junit] Testcase: test_fifteen_external_dsa took 0,059 sec
>    [junit] Testcase: test_sixteen_external_dsa took 0,304 sec
>    [junit] Testcase: test_sixteen_bad_signature took 0,292 sec
>    [junit] Testcase: test_twenty_three_enveloping_hmac_sha1 took 0,005 sec
>    [junit] Testcase: test_twenty_three_enveloping_hmac_sha1_40 took 0,005
> sec
>    [junit] Testcase: test_twenty_three_enveloped_dsa took 0,058 sec
>    [junit] Testcase: test_twenty_three_enveloping_b64_dsa took 0,055 sec
>    [junit] Testcase: test_twenty_three_enveloping_dsa took 0,055 sec
>    [junit] Testcase: test_twenty_three_enveloping_rsa took 0,012 sec
>    [junit] Testcase: test_twenty_three_external_b64_dsa took 0,065 sec
>    [junit] Testcase: test_twenty_three_external_dsa took 0,057 sec
>    [junit] Testcase: test_twenty_three_external_dsa_2 took 0,292 sec
>    [junit] Running org.apache.xml.security.test.interop.IAIKTest
>    [junit] Testsuite: org.apache.xml.security.test.interop.IAIKTest
>    [junit] Tests run: 12, Failures: 0, Errors: 0, Time elapsed: 0,743 sec
>    [junit] Tests run: 12, Failures: 0, Errors: 0, Time elapsed: 0,743 sec
>    [junit]
>    [junit] Testcase: test_signatureAlgorithms_signatures_hMACShortSignature
> took 0,468 sec
>    [junit] Testcase: test_signatureAlgorithms_signatures_hMACSignature took
> 0,005 sec
>    [junit] Testcase: test_coreFeatures_signatures_manifestSignature_core
> took 0,015 sec
>    [junit] Testcase:
> test_coreFeatures_signatures_manifestSignature_manifest took 0,014 sec
>    [junit] Testcase: test_coreFeatures_signatures_signatureTypesSignature
> took 0,09 sec
>    [junit] Testcase:
> test_coreFeatures_signatures_anonymousReferenceSignature took 0,008 sec
>    [junit] Testcase: test_signatureAlgorithms_signatures_dSASignature took
> 0,065 sec
>    [junit] Testcase: test_signatureAlgorithms_signatures_rSASignature took
> 0,005 sec
>    [junit] Testcase: test_transforms_signatures_base64DecodeSignature took
> 0,016 sec
>    [junit] Testcase: test_transforms_signatures_c14nSignature took 0,013
> sec
>    [junit] Testcase: test_transforms_signatures_envelopedSignatureSignature
> took 0,006 sec
>    [junit] Testcase: test_transforms_signatures_xPathSignature took 0,013
> sec
>    [junit] Running org.apache.xml.security.test.interop.RSASecurityTest
>    [junit] Testsuite: org.apache.xml.security.test.interop.RSASecurityTest
>    [junit] Tests run: 2, Failures: 0, Errors: 0, Time elapsed: 0,097 sec
>    [junit] Tests run: 2, Failures: 0, Errors: 0, Time elapsed: 0,097 sec
>    [junit]
>    [junit] Testcase: test_enveloping took 0,069 sec
>    [junit] Testcase: test_enveloped took 0,007 sec
>    [junit] Running
> org.apache.xml.security.test.keys.content.x509.XMLX509CertificateTest
>    [junit] Testsuite:
> org.apache.xml.security.test.keys.content.x509.XMLX509CertificateTest
>    [junit] Tests run: 1, Failures: 0, Errors: 0, Time elapsed: 0,116 sec
>    [junit] Tests run: 1, Failures: 0, Errors: 0, Time elapsed: 0,116 sec
>    [junit] ------------- Standard Output ---------------
>    [junit] [
>    [junit] [
>    [junit]   Version: V3
>    [junit]   Subject: CN=Morigu, OU=X/Secure, O=Baltimore Technologies
> Ltd., ST=Dublin, C=IE
>    [junit]   Signature Algorithm: SHA1withDSA, OID = 1.2.840.10040.4.3
>    [junit]
>    [junit]   Key:  Sun DSA Public Key
>    [junit]     Parameters:...
>
> [Message clipped]



-- 
http://r-bg.com

Mime
View raw message