samza-commits mailing list archives

Site index · List index
Message view « Date » · « Thread »
Top « Date » · « Thread »
From "Chris Riccomini (JIRA)" <j...@apache.org>
Subject [jira] [Commented] (SAMZA-224) TestStatefulTask.testShouldStartAndRestore fails intermittently
Date Thu, 05 Jun 2014 19:58:02 GMT

    [ https://issues.apache.org/jira/browse/SAMZA-224?page=com.atlassian.jira.plugin.system.issuetabpanels:comment-tabpanel&focusedCommentId=14019159#comment-14019159
] 

Chris Riccomini commented on SAMZA-224:
---------------------------------------

+1 Totally.

Could you open a ticket to track the testing for SAMZA-142, so we don't lose track, since
we're losing coverage now?

> TestStatefulTask.testShouldStartAndRestore fails intermittently
> ---------------------------------------------------------------
>
>                 Key: SAMZA-224
>                 URL: https://issues.apache.org/jira/browse/SAMZA-224
>             Project: Samza
>          Issue Type: Bug
>          Components: test
>    Affects Versions: 0.6.0
>            Reporter: Martin Kleppmann
>            Assignee: Martin Kleppmann
>             Fix For: 0.7.0
>
>         Attachments: SAMZA-224.1.patch
>
>
> [~closeuris] reported the following issue on SAMZA-185. I'm now intermittently seeing
this problem too, so I'm opening a new issue for it (as I'm not sure the issue has anything
to do with the Kafka 0.8.1 upgrade).
> {noformat}
> org.apache.samza.test.integration.TestStatefulTask > testShouldStartAndRestore FAILED
>     java.lang.AssertionError at TestStatefulTask.scala:356
> 2 tests completed, 1 failed
> :samza-test_2.10:test FAILED
> {noformat}
> Logs provided by Yan (mine look similar):
> Failed tests: http://pastebin.com/3nEDw9jC
> Standard output: http://pastebin.com/20vZbk7c
> Standard error: http://pastebin.com/gU6cTNAr



--
This message was sent by Atlassian JIRA
(v6.2#6252)

Mime
View raw message