rya-dev mailing list archives

Site index · List index
Message view « Date » · « Thread »
Top « Date » · « Thread »
From Adina Crainiceanu <ad...@usna.edu>
Subject Re: [VOTE] Release Rya (Incubating) version 3.2.11 RC1
Date Wed, 06 Sep 2017 01:46:11 GMT
I'm trying to build from source using
mvn clean install
but I get errors in mongodb DAO (see below)

It builds OK if I do "mvn clean install -DskipTests" but it does not seem
normal to get errors when running the test.

I'm including the last part of the build output below. Any suggestions on
how to fix the problem?
Tests run: 8, Failures: 0, Errors: 8, Skipped: 0, Time elapsed: 15.507 sec
<<< FAILURE! - in org.apache.rya.mongodb.MongoDBRyaDAOTest
testAdd(org.apache.rya.mongodb.MongoDBRyaDAOTest)  Time elapsed: 15.413 sec
 <<< ERROR!
java.lang.NullPointerException: null
at com.google.common.base.Preconditions.checkNotNull(Preconditions.java:191)
at
org.apache.rya.mongodb.MongoDBRdfConfiguration.setMongoClient(MongoDBRdfConfiguration.java:267)
at org.apache.rya.mongodb.MongoTestBase.setupTest(MongoTestBase.java:43)
at sun.reflect.NativeMethodAccessorImpl.invoke0(Native Method)
at
sun.reflect.NativeMethodAccessorImpl.invoke(NativeMethodAccessorImpl.java:62)
at
sun.reflect.DelegatingMethodAccessorImpl.invoke(DelegatingMethodAccessorImpl.java:43)
at java.lang.reflect.Method.invoke(Method.java:498)
at
org.junit.runners.model.FrameworkMethod$1.runReflectiveCall(FrameworkMethod.java:50)
at
org.junit.internal.runners.model.ReflectiveCallable.run(ReflectiveCallable.java:12)
at
org.junit.runners.model.FrameworkMethod.invokeExplosively(FrameworkMethod.java:47)
at
org.junit.internal.runners.statements.RunBefores.evaluate(RunBefores.java:24)
at
org.junit.internal.runners.statements.RunAfters.evaluate(RunAfters.java:27)
at org.junit.runners.ParentRunner.runLeaf(ParentRunner.java:325)
at
org.junit.runners.BlockJUnit4ClassRunner.runChild(BlockJUnit4ClassRunner.java:78)
at
org.junit.runners.BlockJUnit4ClassRunner.runChild(BlockJUnit4ClassRunner.java:57)
at org.junit.runners.ParentRunner$3.run(ParentRunner.java:290)
at org.junit.runners.ParentRunner$1.schedule(ParentRunner.java:71)
at org.junit.runners.ParentRunner.runChildren(ParentRunner.java:288)
at org.junit.runners.ParentRunner.access$000(ParentRunner.java:58)
at org.junit.runners.ParentRunner$2.evaluate(ParentRunner.java:268)
at org.junit.runners.ParentRunner.run(ParentRunner.java:363)
at
org.apache.maven.surefire.junit4.JUnit4Provider.execute(JUnit4Provider.java:283)
at
org.apache.maven.surefire.junit4.JUnit4Provider.executeWithRerun(JUnit4Provider.java:173)
at
org.apache.maven.surefire.junit4.JUnit4Provider.executeTestSet(JUnit4Provider.java:153)
at
org.apache.maven.surefire.junit4.JUnit4Provider.invoke(JUnit4Provider.java:128)
at
org.apache.maven.surefire.booter.ForkedBooter.invokeProviderInSameClassLoader(ForkedBooter.java:203)
at
org.apache.maven.surefire.booter.ForkedBooter.runSuitesInProcess(ForkedBooter.java:155)
at org.apache.maven.surefire.booter.ForkedBooter.main(ForkedBooter.java:103)

testAdd(org.apache.rya.mongodb.MongoDBRyaDAOTest)  Time elapsed: 15.413 sec
 <<< ERROR!
java.lang.NullPointerException: null
at org.apache.rya.mongodb.MongoTestBase.cleanupTest(MongoTestBase.java:49)
at sun.reflect.NativeMethodAccessorImpl.invoke0(Native Method)
at
sun.reflect.NativeMethodAccessorImpl.invoke(NativeMethodAccessorImpl.java:62)
at
sun.reflect.DelegatingMethodAccessorImpl.invoke(DelegatingMethodAccessorImpl.java:43)
at java.lang.reflect.Method.invoke(Method.java:498)
at
org.junit.runners.model.FrameworkMethod$1.runReflectiveCall(FrameworkMethod.java:50)
at
org.junit.internal.runners.model.ReflectiveCallable.run(ReflectiveCallable.java:12)
at
org.junit.runners.model.FrameworkMethod.invokeExplosively(FrameworkMethod.java:47)
at
org.junit.internal.runners.statements.RunAfters.evaluate(RunAfters.java:33)
at org.junit.runners.ParentRunner.runLeaf(ParentRunner.java:325)
at
org.junit.runners.BlockJUnit4ClassRunner.runChild(BlockJUnit4ClassRunner.java:78)
at
org.junit.runners.BlockJUnit4ClassRunner.runChild(BlockJUnit4ClassRunner.java:57)
at org.junit.runners.ParentRunner$3.run(ParentRunner.java:290)
at org.junit.runners.ParentRunner$1.schedule(ParentRunner.java:71)
at org.junit.runners.ParentRunner.runChildren(ParentRunner.java:288)
at org.junit.runners.ParentRunner.access$000(ParentRunner.java:58)
at org.junit.runners.ParentRunner$2.evaluate(ParentRunner.java:268)
at org.junit.runners.ParentRunner.run(ParentRunner.java:363)
at
org.apache.maven.surefire.junit4.JUnit4Provider.execute(JUnit4Provider.java:283)
at
org.apache.maven.surefire.junit4.JUnit4Provider.executeWithRerun(JUnit4Provider.java:173)
at
org.apache.maven.surefire.junit4.JUnit4Provider.executeTestSet(JUnit4Provider.java:153)
at
org.apache.maven.surefire.junit4.JUnit4Provider.invoke(JUnit4Provider.java:128)
at
org.apache.maven.surefire.booter.ForkedBooter.invokeProviderInSameClassLoader(ForkedBooter.java:203)
at
org.apache.maven.surefire.booter.ForkedBooter.runSuitesInProcess(ForkedBooter.java:155)
at org.apache.maven.surefire.booter.ForkedBooter.main(ForkedBooter.java:103)

testDeleteWildcardSubjectWithContext(org.apache.rya.mongodb.MongoDBRyaDAOTest)
 Time elapsed: 0.026 sec  <<< ERROR!
java.lang.NullPointerException: null
at com.google.common.base.Preconditions.checkNotNull(Preconditions.java:191)
at
org.apache.rya.mongodb.MongoDBRdfConfiguration.setMongoClient(MongoDBRdfConfiguration.java:267)
at org.apache.rya.mongodb.MongoTestBase.setupTest(MongoTestBase.java:43)
at sun.reflect.NativeMethodAccessorImpl.invoke0(Native Method)
at
sun.reflect.NativeMethodAccessorImpl.invoke(NativeMethodAccessorImpl.java:62)
at
sun.reflect.DelegatingMethodAccessorImpl.invoke(DelegatingMethodAccessorImpl.java:43)
at java.lang.reflect.Method.invoke(Method.java:498)
at
org.junit.runners.model.FrameworkMethod$1.runReflectiveCall(FrameworkMethod.java:50)
at
org.junit.internal.runners.model.ReflectiveCallable.run(ReflectiveCallable.java:12)
at
org.junit.runners.model.FrameworkMethod.invokeExplosively(FrameworkMethod.java:47)
at
org.junit.internal.runners.statements.RunBefores.evaluate(RunBefores.java:24)
at
org.junit.internal.runners.statements.RunAfters.evaluate(RunAfters.java:27)
at org.junit.runners.ParentRunner.runLeaf(ParentRunner.java:325)
at
org.junit.runners.BlockJUnit4ClassRunner.runChild(BlockJUnit4ClassRunner.java:78)
at
org.junit.runners.BlockJUnit4ClassRunner.runChild(BlockJUnit4ClassRunner.java:57)
at org.junit.runners.ParentRunner$3.run(ParentRunner.java:290)
at org.junit.runners.ParentRunner$1.schedule(ParentRunner.java:71)
at org.junit.runners.ParentRunner.runChildren(ParentRunner.java:288)
at org.junit.runners.ParentRunner.access$000(ParentRunner.java:58)
at org.junit.runners.ParentRunner$2.evaluate(ParentRunner.java:268)
at org.junit.runners.ParentRunner.run(ParentRunner.java:363)
at
org.apache.maven.surefire.junit4.JUnit4Provider.execute(JUnit4Provider.java:283)
at
org.apache.maven.surefire.junit4.JUnit4Provider.executeWithRerun(JUnit4Provider.java:173)
at
org.apache.maven.surefire.junit4.JUnit4Provider.executeTestSet(JUnit4Provider.java:153)
at
org.apache.maven.surefire.junit4.JUnit4Provider.invoke(JUnit4Provider.java:128)
at
org.apache.maven.surefire.booter.ForkedBooter.invokeProviderInSameClassLoader(ForkedBooter.java:203)
at
org.apache.maven.surefire.booter.ForkedBooter.runSuitesInProcess(ForkedBooter.java:155)
at org.apache.maven.surefire.booter.ForkedBooter.main(ForkedBooter.java:103)

testDeleteWildcardSubjectWithContext(org.apache.rya.mongodb.MongoDBRyaDAOTest)
 Time elapsed: 0.027 sec  <<< ERROR!
java.lang.NullPointerException: null
at org.apache.rya.mongodb.MongoTestBase.cleanupTest(MongoTestBase.java:49)
at sun.reflect.NativeMethodAccessorImpl.invoke0(Native Method)
at
sun.reflect.NativeMethodAccessorImpl.invoke(NativeMethodAccessorImpl.java:62)
at
sun.reflect.DelegatingMethodAccessorImpl.invoke(DelegatingMethodAccessorImpl.java:43)
at java.lang.reflect.Method.invoke(Method.java:498)
at
org.junit.runners.model.FrameworkMethod$1.runReflectiveCall(FrameworkMethod.java:50)
at
org.junit.internal.runners.model.ReflectiveCallable.run(ReflectiveCallable.java:12)
at
org.junit.runners.model.FrameworkMethod.invokeExplosively(FrameworkMethod.java:47)
at
org.junit.internal.runners.statements.RunAfters.evaluate(RunAfters.java:33)
at org.junit.runners.ParentRunner.runLeaf(ParentRunner.java:325)
at
org.junit.runners.BlockJUnit4ClassRunner.runChild(BlockJUnit4ClassRunner.java:78)
at
org.junit.runners.BlockJUnit4ClassRunner.runChild(BlockJUnit4ClassRunner.java:57)
at org.junit.runners.ParentRunner$3.run(ParentRunner.java:290)
at org.junit.runners.ParentRunner$1.schedule(ParentRunner.java:71)
at org.junit.runners.ParentRunner.runChildren(ParentRunner.java:288)
at org.junit.runners.ParentRunner.access$000(ParentRunner.java:58)
at org.junit.runners.ParentRunner$2.evaluate(ParentRunner.java:268)
at org.junit.runners.ParentRunner.run(ParentRunner.java:363)
at
org.apache.maven.surefire.junit4.JUnit4Provider.execute(JUnit4Provider.java:283)
at
org.apache.maven.surefire.junit4.JUnit4Provider.executeWithRerun(JUnit4Provider.java:173)
at
org.apache.maven.surefire.junit4.JUnit4Provider.executeTestSet(JUnit4Provider.java:153)
at
org.apache.maven.surefire.junit4.JUnit4Provider.invoke(JUnit4Provider.java:128)
at
org.apache.maven.surefire.booter.ForkedBooter.invokeProviderInSameClassLoader(ForkedBooter.java:203)
at
org.apache.maven.surefire.booter.ForkedBooter.runSuitesInProcess(ForkedBooter.java:155)
at org.apache.maven.surefire.booter.ForkedBooter.main(ForkedBooter.java:103)

testDeleteWildcard(org.apache.rya.mongodb.MongoDBRyaDAOTest)  Time elapsed:
0.033 sec  <<< ERROR!
java.lang.NullPointerException: null
at com.google.common.base.Preconditions.checkNotNull(Preconditions.java:191)
at
org.apache.rya.mongodb.MongoDBRdfConfiguration.setMongoClient(MongoDBRdfConfiguration.java:267)
at org.apache.rya.mongodb.MongoTestBase.setupTest(MongoTestBase.java:43)
at sun.reflect.NativeMethodAccessorImpl.invoke0(Native Method)
at
sun.reflect.NativeMethodAccessorImpl.invoke(NativeMethodAccessorImpl.java:62)
at
sun.reflect.DelegatingMethodAccessorImpl.invoke(DelegatingMethodAccessorImpl.java:43)
at java.lang.reflect.Method.invoke(Method.java:498)
at
org.junit.runners.model.FrameworkMethod$1.runReflectiveCall(FrameworkMethod.java:50)
at
org.junit.internal.runners.model.ReflectiveCallable.run(ReflectiveCallable.java:12)
at
org.junit.runners.model.FrameworkMethod.invokeExplosively(FrameworkMethod.java:47)
at
org.junit.internal.runners.statements.RunBefores.evaluate(RunBefores.java:24)
at
org.junit.internal.runners.statements.RunAfters.evaluate(RunAfters.java:27)
at org.junit.runners.ParentRunner.runLeaf(ParentRunner.java:325)
at
org.junit.runners.BlockJUnit4ClassRunner.runChild(BlockJUnit4ClassRunner.java:78)
at
org.junit.runners.BlockJUnit4ClassRunner.runChild(BlockJUnit4ClassRunner.java:57)
at org.junit.runners.ParentRunner$3.run(ParentRunner.java:290)
at org.junit.runners.ParentRunner$1.schedule(ParentRunner.java:71)
at org.junit.runners.ParentRunner.runChildren(ParentRunner.java:288)
at org.junit.runners.ParentRunner.access$000(ParentRunner.java:58)
at org.junit.runners.ParentRunner$2.evaluate(ParentRunner.java:268)
at org.junit.runners.ParentRunner.run(ParentRunner.java:363)
at
org.apache.maven.surefire.junit4.JUnit4Provider.execute(JUnit4Provider.java:283)
at
org.apache.maven.surefire.junit4.JUnit4Provider.executeWithRerun(JUnit4Provider.java:173)
at
org.apache.maven.surefire.junit4.JUnit4Provider.executeTestSet(JUnit4Provider.java:153)
at
org.apache.maven.surefire.junit4.JUnit4Provider.invoke(JUnit4Provider.java:128)
at
org.apache.maven.surefire.booter.ForkedBooter.invokeProviderInSameClassLoader(ForkedBooter.java:203)
at
org.apache.maven.surefire.booter.ForkedBooter.runSuitesInProcess(ForkedBooter.java:155)
at org.apache.maven.surefire.booter.ForkedBooter.main(ForkedBooter.java:103)

testDeleteWildcard(org.apache.rya.mongodb.MongoDBRyaDAOTest)  Time elapsed:
0.034 sec  <<< ERROR!
java.lang.NullPointerException: null
at org.apache.rya.mongodb.MongoTestBase.cleanupTest(MongoTestBase.java:49)
at sun.reflect.NativeMethodAccessorImpl.invoke0(Native Method)
at
sun.reflect.NativeMethodAccessorImpl.invoke(NativeMethodAccessorImpl.java:62)
at
sun.reflect.DelegatingMethodAccessorImpl.invoke(DelegatingMethodAccessorImpl.java:43)
at java.lang.reflect.Method.invoke(Method.java:498)
at
org.junit.runners.model.FrameworkMethod$1.runReflectiveCall(FrameworkMethod.java:50)
at
org.junit.internal.runners.model.ReflectiveCallable.run(ReflectiveCallable.java:12)
at
org.junit.runners.model.FrameworkMethod.invokeExplosively(FrameworkMethod.java:47)
at
org.junit.internal.runners.statements.RunAfters.evaluate(RunAfters.java:33)
at org.junit.runners.ParentRunner.runLeaf(ParentRunner.java:325)
at
org.junit.runners.BlockJUnit4ClassRunner.runChild(BlockJUnit4ClassRunner.java:78)
at
org.junit.runners.BlockJUnit4ClassRunner.runChild(BlockJUnit4ClassRunner.java:57)
at org.junit.runners.ParentRunner$3.run(ParentRunner.java:290)
at org.junit.runners.ParentRunner$1.schedule(ParentRunner.java:71)
at org.junit.runners.ParentRunner.runChildren(ParentRunner.java:288)
at org.junit.runners.ParentRunner.access$000(ParentRunner.java:58)
at org.junit.runners.ParentRunner$2.evaluate(ParentRunner.java:268)
at org.junit.runners.ParentRunner.run(ParentRunner.java:363)
at
org.apache.maven.surefire.junit4.JUnit4Provider.execute(JUnit4Provider.java:283)
at
org.apache.maven.surefire.junit4.JUnit4Provider.executeWithRerun(JUnit4Provider.java:173)
at
org.apache.maven.surefire.junit4.JUnit4Provider.executeTestSet(JUnit4Provider.java:153)
at
org.apache.maven.surefire.junit4.JUnit4Provider.invoke(JUnit4Provider.java:128)
at
org.apache.maven.surefire.booter.ForkedBooter.invokeProviderInSameClassLoader(ForkedBooter.java:203)
at
org.apache.maven.surefire.booter.ForkedBooter.runSuitesInProcess(ForkedBooter.java:155)
at org.apache.maven.surefire.booter.ForkedBooter.main(ForkedBooter.java:103)

testDelete(org.apache.rya.mongodb.MongoDBRyaDAOTest)  Time elapsed: 0.03
sec  <<< ERROR!
java.lang.NullPointerException: null
at com.google.common.base.Preconditions.checkNotNull(Preconditions.java:191)
at
org.apache.rya.mongodb.MongoDBRdfConfiguration.setMongoClient(MongoDBRdfConfiguration.java:267)
at org.apache.rya.mongodb.MongoTestBase.setupTest(MongoTestBase.java:43)
at sun.reflect.NativeMethodAccessorImpl.invoke0(Native Method)
at
sun.reflect.NativeMethodAccessorImpl.invoke(NativeMethodAccessorImpl.java:62)
at
sun.reflect.DelegatingMethodAccessorImpl.invoke(DelegatingMethodAccessorImpl.java:43)
at java.lang.reflect.Method.invoke(Method.java:498)
at
org.junit.runners.model.FrameworkMethod$1.runReflectiveCall(FrameworkMethod.java:50)
at
org.junit.internal.runners.model.ReflectiveCallable.run(ReflectiveCallable.java:12)
at
org.junit.runners.model.FrameworkMethod.invokeExplosively(FrameworkMethod.java:47)
at
org.junit.internal.runners.statements.RunBefores.evaluate(RunBefores.java:24)
at
org.junit.internal.runners.statements.RunAfters.evaluate(RunAfters.java:27)
at org.junit.runners.ParentRunner.runLeaf(ParentRunner.java:325)
at
org.junit.runners.BlockJUnit4ClassRunner.runChild(BlockJUnit4ClassRunner.java:78)
at
org.junit.runners.BlockJUnit4ClassRunner.runChild(BlockJUnit4ClassRunner.java:57)
at org.junit.runners.ParentRunner$3.run(ParentRunner.java:290)
at org.junit.runners.ParentRunner$1.schedule(ParentRunner.java:71)
at org.junit.runners.ParentRunner.runChildren(ParentRunner.java:288)
at org.junit.runners.ParentRunner.access$000(ParentRunner.java:58)
at org.junit.runners.ParentRunner$2.evaluate(ParentRunner.java:268)
at org.junit.runners.ParentRunner.run(ParentRunner.java:363)
at
org.apache.maven.surefire.junit4.JUnit4Provider.execute(JUnit4Provider.java:283)
at
org.apache.maven.surefire.junit4.JUnit4Provider.executeWithRerun(JUnit4Provider.java:173)
at
org.apache.maven.surefire.junit4.JUnit4Provider.executeTestSet(JUnit4Provider.java:153)
at
org.apache.maven.surefire.junit4.JUnit4Provider.invoke(JUnit4Provider.java:128)
at
org.apache.maven.surefire.booter.ForkedBooter.invokeProviderInSameClassLoader(ForkedBooter.java:203)
at
org.apache.maven.surefire.booter.ForkedBooter.runSuitesInProcess(ForkedBooter.java:155)
at org.apache.maven.surefire.booter.ForkedBooter.main(ForkedBooter.java:103)

testDelete(org.apache.rya.mongodb.MongoDBRyaDAOTest)  Time elapsed: 0.031
sec  <<< ERROR!
java.lang.NullPointerException: null
at org.apache.rya.mongodb.MongoTestBase.cleanupTest(MongoTestBase.java:49)
at sun.reflect.NativeMethodAccessorImpl.invoke0(Native Method)
at
sun.reflect.NativeMethodAccessorImpl.invoke(NativeMethodAccessorImpl.java:62)
at
sun.reflect.DelegatingMethodAccessorImpl.invoke(DelegatingMethodAccessorImpl.java:43)
at java.lang.reflect.Method.invoke(Method.java:498)
at
org.junit.runners.model.FrameworkMethod$1.runReflectiveCall(FrameworkMethod.java:50)
at
org.junit.internal.runners.model.ReflectiveCallable.run(ReflectiveCallable.java:12)
at
org.junit.runners.model.FrameworkMethod.invokeExplosively(FrameworkMethod.java:47)
at
org.junit.internal.runners.statements.RunAfters.evaluate(RunAfters.java:33)
at org.junit.runners.ParentRunner.runLeaf(ParentRunner.java:325)
at
org.junit.runners.BlockJUnit4ClassRunner.runChild(BlockJUnit4ClassRunner.java:78)
at
org.junit.runners.BlockJUnit4ClassRunner.runChild(BlockJUnit4ClassRunner.java:57)
at org.junit.runners.ParentRunner$3.run(ParentRunner.java:290)
at org.junit.runners.ParentRunner$1.schedule(ParentRunner.java:71)
at org.junit.runners.ParentRunner.runChildren(ParentRunner.java:288)
at org.junit.runners.ParentRunner.access$000(ParentRunner.java:58)
at org.junit.runners.ParentRunner$2.evaluate(ParentRunner.java:268)
at org.junit.runners.ParentRunner.run(ParentRunner.java:363)
at
org.apache.maven.surefire.junit4.JUnit4Provider.execute(JUnit4Provider.java:283)
at
org.apache.maven.surefire.junit4.JUnit4Provider.executeWithRerun(JUnit4Provider.java:173)
at
org.apache.maven.surefire.junit4.JUnit4Provider.executeTestSet(JUnit4Provider.java:153)
at
org.apache.maven.surefire.junit4.JUnit4Provider.invoke(JUnit4Provider.java:128)
at
org.apache.maven.surefire.booter.ForkedBooter.invokeProviderInSameClassLoader(ForkedBooter.java:203)
at
org.apache.maven.surefire.booter.ForkedBooter.runSuitesInProcess(ForkedBooter.java:155)
at org.apache.maven.surefire.booter.ForkedBooter.main(ForkedBooter.java:103)

Running org.apache.rya.mongodb.MongoDBQueryEngineTest
Tests run: 6, Failures: 0, Errors: 6, Skipped: 0, Time elapsed: 0.069 sec
<<< FAILURE! - in org.apache.rya.mongodb.MongoDBQueryEngineTest
bindingSetsQuery(org.apache.rya.mongodb.MongoDBQueryEngineTest)  Time
elapsed: 0.027 sec  <<< ERROR!
java.lang.NullPointerException: null
at com.google.common.base.Preconditions.checkNotNull(Preconditions.java:191)
at
org.apache.rya.mongodb.MongoDBRdfConfiguration.setMongoClient(MongoDBRdfConfiguration.java:267)
at org.apache.rya.mongodb.MongoTestBase.setupTest(MongoTestBase.java:43)
at sun.reflect.NativeMethodAccessorImpl.invoke0(Native Method)
at
sun.reflect.NativeMethodAccessorImpl.invoke(NativeMethodAccessorImpl.java:62)
at
sun.reflect.DelegatingMethodAccessorImpl.invoke(DelegatingMethodAccessorImpl.java:43)
at java.lang.reflect.Method.invoke(Method.java:498)
at
org.junit.runners.model.FrameworkMethod$1.runReflectiveCall(FrameworkMethod.java:50)
at
org.junit.internal.runners.model.ReflectiveCallable.run(ReflectiveCallable.java:12)
at
org.junit.runners.model.FrameworkMethod.invokeExplosively(FrameworkMethod.java:47)
at
org.junit.internal.runners.statements.RunBefores.evaluate(RunBefores.java:24)
at
org.junit.internal.runners.statements.RunAfters.evaluate(RunAfters.java:27)
at org.junit.runners.ParentRunner.runLeaf(ParentRunner.java:325)
at
org.junit.runners.BlockJUnit4ClassRunner.runChild(BlockJUnit4ClassRunner.java:78)
at
org.junit.runners.BlockJUnit4ClassRunner.runChild(BlockJUnit4ClassRunner.java:57)
at org.junit.runners.ParentRunner$3.run(ParentRunner.java:290)
at org.junit.runners.ParentRunner$1.schedule(ParentRunner.java:71)
at org.junit.runners.ParentRunner.runChildren(ParentRunner.java:288)
at org.junit.runners.ParentRunner.access$000(ParentRunner.java:58)
at org.junit.runners.ParentRunner$2.evaluate(ParentRunner.java:268)
at org.junit.runners.ParentRunner.run(ParentRunner.java:363)
at
org.apache.maven.surefire.junit4.JUnit4Provider.execute(JUnit4Provider.java:283)
at
org.apache.maven.surefire.junit4.JUnit4Provider.executeWithRerun(JUnit4Provider.java:173)
at
org.apache.maven.surefire.junit4.JUnit4Provider.executeTestSet(JUnit4Provider.java:153)
at
org.apache.maven.surefire.junit4.JUnit4Provider.invoke(JUnit4Provider.java:128)
at
org.apache.maven.surefire.booter.ForkedBooter.invokeProviderInSameClassLoader(ForkedBooter.java:203)
at
org.apache.maven.surefire.booter.ForkedBooter.runSuitesInProcess(ForkedBooter.java:155)
at org.apache.maven.surefire.booter.ForkedBooter.main(ForkedBooter.java:103)

bindingSetsQuery(org.apache.rya.mongodb.MongoDBQueryEngineTest)  Time
elapsed: 0.028 sec  <<< ERROR!
java.lang.NullPointerException: null
at org.apache.rya.mongodb.MongoTestBase.cleanupTest(MongoTestBase.java:49)
at sun.reflect.NativeMethodAccessorImpl.invoke0(Native Method)
at
sun.reflect.NativeMethodAccessorImpl.invoke(NativeMethodAccessorImpl.java:62)
at
sun.reflect.DelegatingMethodAccessorImpl.invoke(DelegatingMethodAccessorImpl.java:43)
at java.lang.reflect.Method.invoke(Method.java:498)
at
org.junit.runners.model.FrameworkMethod$1.runReflectiveCall(FrameworkMethod.java:50)
at
org.junit.internal.runners.model.ReflectiveCallable.run(ReflectiveCallable.java:12)
at
org.junit.runners.model.FrameworkMethod.invokeExplosively(FrameworkMethod.java:47)
at
org.junit.internal.runners.statements.RunAfters.evaluate(RunAfters.java:33)
at org.junit.runners.ParentRunner.runLeaf(ParentRunner.java:325)
at
org.junit.runners.BlockJUnit4ClassRunner.runChild(BlockJUnit4ClassRunner.java:78)
at
org.junit.runners.BlockJUnit4ClassRunner.runChild(BlockJUnit4ClassRunner.java:57)
at org.junit.runners.ParentRunner$3.run(ParentRunner.java:290)
at org.junit.runners.ParentRunner$1.schedule(ParentRunner.java:71)
at org.junit.runners.ParentRunner.runChildren(ParentRunner.java:288)
at org.junit.runners.ParentRunner.access$000(ParentRunner.java:58)
at org.junit.runners.ParentRunner$2.evaluate(ParentRunner.java:268)
at org.junit.runners.ParentRunner.run(ParentRunner.java:363)
at
org.apache.maven.surefire.junit4.JUnit4Provider.execute(JUnit4Provider.java:283)
at
org.apache.maven.surefire.junit4.JUnit4Provider.executeWithRerun(JUnit4Provider.java:173)
at
org.apache.maven.surefire.junit4.JUnit4Provider.executeTestSet(JUnit4Provider.java:153)
at
org.apache.maven.surefire.junit4.JUnit4Provider.invoke(JUnit4Provider.java:128)
at
org.apache.maven.surefire.booter.ForkedBooter.invokeProviderInSameClassLoader(ForkedBooter.java:203)
at
org.apache.maven.surefire.booter.ForkedBooter.runSuitesInProcess(ForkedBooter.java:155)
at org.apache.maven.surefire.booter.ForkedBooter.main(ForkedBooter.java:103)

statementQuery(org.apache.rya.mongodb.MongoDBQueryEngineTest)  Time
elapsed: 0.021 sec  <<< ERROR!
java.lang.NullPointerException: null
at com.google.common.base.Preconditions.checkNotNull(Preconditions.java:191)
at
org.apache.rya.mongodb.MongoDBRdfConfiguration.setMongoClient(MongoDBRdfConfiguration.java:267)
at org.apache.rya.mongodb.MongoTestBase.setupTest(MongoTestBase.java:43)
at sun.reflect.NativeMethodAccessorImpl.invoke0(Native Method)
at
sun.reflect.NativeMethodAccessorImpl.invoke(NativeMethodAccessorImpl.java:62)
at
sun.reflect.DelegatingMethodAccessorImpl.invoke(DelegatingMethodAccessorImpl.java:43)
at java.lang.reflect.Method.invoke(Method.java:498)
at
org.junit.runners.model.FrameworkMethod$1.runReflectiveCall(FrameworkMethod.java:50)
at
org.junit.internal.runners.model.ReflectiveCallable.run(ReflectiveCallable.java:12)
at
org.junit.runners.model.FrameworkMethod.invokeExplosively(FrameworkMethod.java:47)
at
org.junit.internal.runners.statements.RunBefores.evaluate(RunBefores.java:24)
at
org.junit.internal.runners.statements.RunAfters.evaluate(RunAfters.java:27)
at org.junit.runners.ParentRunner.runLeaf(ParentRunner.java:325)
at
org.junit.runners.BlockJUnit4ClassRunner.runChild(BlockJUnit4ClassRunner.java:78)
at
org.junit.runners.BlockJUnit4ClassRunner.runChild(BlockJUnit4ClassRunner.java:57)
at org.junit.runners.ParentRunner$3.run(ParentRunner.java:290)
at org.junit.runners.ParentRunner$1.schedule(ParentRunner.java:71)
at org.junit.runners.ParentRunner.runChildren(ParentRunner.java:288)
at org.junit.runners.ParentRunner.access$000(ParentRunner.java:58)
at org.junit.runners.ParentRunner$2.evaluate(ParentRunner.java:268)
at org.junit.runners.ParentRunner.run(ParentRunner.java:363)
at
org.apache.maven.surefire.junit4.JUnit4Provider.execute(JUnit4Provider.java:283)
at
org.apache.maven.surefire.junit4.JUnit4Provider.executeWithRerun(JUnit4Provider.java:173)
at
org.apache.maven.surefire.junit4.JUnit4Provider.executeTestSet(JUnit4Provider.java:153)
at
org.apache.maven.surefire.junit4.JUnit4Provider.invoke(JUnit4Provider.java:128)
at
org.apache.maven.surefire.booter.ForkedBooter.invokeProviderInSameClassLoader(ForkedBooter.java:203)
at
org.apache.maven.surefire.booter.ForkedBooter.runSuitesInProcess(ForkedBooter.java:155)
at org.apache.maven.surefire.booter.ForkedBooter.main(ForkedBooter.java:103)

statementQuery(org.apache.rya.mongodb.MongoDBQueryEngineTest)  Time
elapsed: 0.022 sec  <<< ERROR!
java.lang.NullPointerException: null
at org.apache.rya.mongodb.MongoTestBase.cleanupTest(MongoTestBase.java:49)
at sun.reflect.NativeMethodAccessorImpl.invoke0(Native Method)
at
sun.reflect.NativeMethodAccessorImpl.invoke(NativeMethodAccessorImpl.java:62)
at
sun.reflect.DelegatingMethodAccessorImpl.invoke(DelegatingMethodAccessorImpl.java:43)
at java.lang.reflect.Method.invoke(Method.java:498)
at
org.junit.runners.model.FrameworkMethod$1.runReflectiveCall(FrameworkMethod.java:50)
at
org.junit.internal.runners.model.ReflectiveCallable.run(ReflectiveCallable.java:12)
at
org.junit.runners.model.FrameworkMethod.invokeExplosively(FrameworkMethod.java:47)
at
org.junit.internal.runners.statements.RunAfters.evaluate(RunAfters.java:33)
at org.junit.runners.ParentRunner.runLeaf(ParentRunner.java:325)
at
org.junit.runners.BlockJUnit4ClassRunner.runChild(BlockJUnit4ClassRunner.java:78)
at
org.junit.runners.BlockJUnit4ClassRunner.runChild(BlockJUnit4ClassRunner.java:57)
at org.junit.runners.ParentRunner$3.run(ParentRunner.java:290)
at org.junit.runners.ParentRunner$1.schedule(ParentRunner.java:71)
at org.junit.runners.ParentRunner.runChildren(ParentRunner.java:288)
at org.junit.runners.ParentRunner.access$000(ParentRunner.java:58)
at org.junit.runners.ParentRunner$2.evaluate(ParentRunner.java:268)
at org.junit.runners.ParentRunner.run(ParentRunner.java:363)
at
org.apache.maven.surefire.junit4.JUnit4Provider.execute(JUnit4Provider.java:283)
at
org.apache.maven.surefire.junit4.JUnit4Provider.executeWithRerun(JUnit4Provider.java:173)
at
org.apache.maven.surefire.junit4.JUnit4Provider.executeTestSet(JUnit4Provider.java:153)
at
org.apache.maven.surefire.junit4.JUnit4Provider.invoke(JUnit4Provider.java:128)
at
org.apache.maven.surefire.booter.ForkedBooter.invokeProviderInSameClassLoader(ForkedBooter.java:203)
at
org.apache.maven.surefire.booter.ForkedBooter.runSuitesInProcess(ForkedBooter.java:155)
at org.apache.maven.surefire.booter.ForkedBooter.main(ForkedBooter.java:103)

batchbindingSetsQuery(org.apache.rya.mongodb.MongoDBQueryEngineTest)  Time
elapsed: 0.016 sec  <<< ERROR!
java.lang.NullPointerException: null
at com.google.common.base.Preconditions.checkNotNull(Preconditions.java:191)
at
org.apache.rya.mongodb.MongoDBRdfConfiguration.setMongoClient(MongoDBRdfConfiguration.java:267)
at org.apache.rya.mongodb.MongoTestBase.setupTest(MongoTestBase.java:43)
at sun.reflect.NativeMethodAccessorImpl.invoke0(Native Method)
at
sun.reflect.NativeMethodAccessorImpl.invoke(NativeMethodAccessorImpl.java:62)
at
sun.reflect.DelegatingMethodAccessorImpl.invoke(DelegatingMethodAccessorImpl.java:43)
at java.lang.reflect.Method.invoke(Method.java:498)
at
org.junit.runners.model.FrameworkMethod$1.runReflectiveCall(FrameworkMethod.java:50)
at
org.junit.internal.runners.model.ReflectiveCallable.run(ReflectiveCallable.java:12)
at
org.junit.runners.model.FrameworkMethod.invokeExplosively(FrameworkMethod.java:47)
at
org.junit.internal.runners.statements.RunBefores.evaluate(RunBefores.java:24)
at
org.junit.internal.runners.statements.RunAfters.evaluate(RunAfters.java:27)
at org.junit.runners.ParentRunner.runLeaf(ParentRunner.java:325)
at
org.junit.runners.BlockJUnit4ClassRunner.runChild(BlockJUnit4ClassRunner.java:78)
at
org.junit.runners.BlockJUnit4ClassRunner.runChild(BlockJUnit4ClassRunner.java:57)
at org.junit.runners.ParentRunner$3.run(ParentRunner.java:290)
at org.junit.runners.ParentRunner$1.schedule(ParentRunner.java:71)
at org.junit.runners.ParentRunner.runChildren(ParentRunner.java:288)
at org.junit.runners.ParentRunner.access$000(ParentRunner.java:58)
at org.junit.runners.ParentRunner$2.evaluate(ParentRunner.java:268)
at org.junit.runners.ParentRunner.run(ParentRunner.java:363)
at
org.apache.maven.surefire.junit4.JUnit4Provider.execute(JUnit4Provider.java:283)
at
org.apache.maven.surefire.junit4.JUnit4Provider.executeWithRerun(JUnit4Provider.java:173)
at
org.apache.maven.surefire.junit4.JUnit4Provider.executeTestSet(JUnit4Provider.java:153)
at
org.apache.maven.surefire.junit4.JUnit4Provider.invoke(JUnit4Provider.java:128)
at
org.apache.maven.surefire.booter.ForkedBooter.invokeProviderInSameClassLoader(ForkedBooter.java:203)
at
org.apache.maven.surefire.booter.ForkedBooter.runSuitesInProcess(ForkedBooter.java:155)
at org.apache.maven.surefire.booter.ForkedBooter.main(ForkedBooter.java:103)

batchbindingSetsQuery(org.apache.rya.mongodb.MongoDBQueryEngineTest)  Time
elapsed: 0.017 sec  <<< ERROR!
java.lang.NullPointerException: null
at org.apache.rya.mongodb.MongoTestBase.cleanupTest(MongoTestBase.java:49)
at sun.reflect.NativeMethodAccessorImpl.invoke0(Native Method)
at
sun.reflect.NativeMethodAccessorImpl.invoke(NativeMethodAccessorImpl.java:62)
at
sun.reflect.DelegatingMethodAccessorImpl.invoke(DelegatingMethodAccessorImpl.java:43)
at java.lang.reflect.Method.invoke(Method.java:498)
at
org.junit.runners.model.FrameworkMethod$1.runReflectiveCall(FrameworkMethod.java:50)
at
org.junit.internal.runners.model.ReflectiveCallable.run(ReflectiveCallable.java:12)
at
org.junit.runners.model.FrameworkMethod.invokeExplosively(FrameworkMethod.java:47)
at
org.junit.internal.runners.statements.RunAfters.evaluate(RunAfters.java:33)
at org.junit.runners.ParentRunner.runLeaf(ParentRunner.java:325)
at
org.junit.runners.BlockJUnit4ClassRunner.runChild(BlockJUnit4ClassRunner.java:78)
at
org.junit.runners.BlockJUnit4ClassRunner.runChild(BlockJUnit4ClassRunner.java:57)
at org.junit.runners.ParentRunner$3.run(ParentRunner.java:290)
at org.junit.runners.ParentRunner$1.schedule(ParentRunner.java:71)
at org.junit.runners.ParentRunner.runChildren(ParentRunner.java:288)
at org.junit.runners.ParentRunner.access$000(ParentRunner.java:58)
at org.junit.runners.ParentRunner$2.evaluate(ParentRunner.java:268)
at org.junit.runners.ParentRunner.run(ParentRunner.java:363)
at
org.apache.maven.surefire.junit4.JUnit4Provider.execute(JUnit4Provider.java:283)
at
org.apache.maven.surefire.junit4.JUnit4Provider.executeWithRerun(JUnit4Provider.java:173)
at
org.apache.maven.surefire.junit4.JUnit4Provider.executeTestSet(JUnit4Provider.java:153)
at
org.apache.maven.surefire.junit4.JUnit4Provider.invoke(JUnit4Provider.java:128)
at
org.apache.maven.surefire.booter.ForkedBooter.invokeProviderInSameClassLoader(ForkedBooter.java:203)
at
org.apache.maven.surefire.booter.ForkedBooter.runSuitesInProcess(ForkedBooter.java:155)
at org.apache.maven.surefire.booter.ForkedBooter.main(ForkedBooter.java:103)

Running org.apache.rya.mongodb.MongoDBRdfConfigurationTest
Tests run: 2, Failures: 0, Errors: 0, Skipped: 0, Time elapsed: 0.216 sec -
in org.apache.rya.mongodb.MongoDBRdfConfigurationTest

Results :

Tests in error:
org.apache.rya.mongodb.MongoDBQueryEngineTest.batchbindingSetsQuery(org.apache.rya.mongodb.MongoDBQueryEngineTest)
  Run 1: MongoDBQueryEngineTest>MongoTestBase.setupTest:43 » NullPointer
  Run 2: MongoDBQueryEngineTest>MongoTestBase.cleanupTest:49 » NullPointer

org.apache.rya.mongodb.MongoDBQueryEngineTest.bindingSetsQuery(org.apache.rya.mongodb.MongoDBQueryEngineTest)
  Run 1: MongoDBQueryEngineTest>MongoTestBase.setupTest:43 » NullPointer
  Run 2: MongoDBQueryEngineTest>MongoTestBase.cleanupTest:49 » NullPointer

org.apache.rya.mongodb.MongoDBQueryEngineTest.statementQuery(org.apache.rya.mongodb.MongoDBQueryEngineTest)
  Run 1: MongoDBQueryEngineTest>MongoTestBase.setupTest:43 » NullPointer
  Run 2: MongoDBQueryEngineTest>MongoTestBase.cleanupTest:49 » NullPointer

org.apache.rya.mongodb.MongoDBRyaDAOTest.testAdd(org.apache.rya.mongodb.MongoDBRyaDAOTest)
  Run 1: MongoDBRyaDAOTest>MongoTestBase.setupTest:43 » NullPointer
  Run 2: MongoDBRyaDAOTest>MongoTestBase.cleanupTest:49 » NullPointer

org.apache.rya.mongodb.MongoDBRyaDAOTest.testDelete(org.apache.rya.mongodb.MongoDBRyaDAOTest)
  Run 1: MongoDBRyaDAOTest>MongoTestBase.setupTest:43 » NullPointer
  Run 2: MongoDBRyaDAOTest>MongoTestBase.cleanupTest:49 » NullPointer

org.apache.rya.mongodb.MongoDBRyaDAOTest.testDeleteWildcard(org.apache.rya.mongodb.MongoDBRyaDAOTest)
  Run 1: MongoDBRyaDAOTest>MongoTestBase.setupTest:43 » NullPointer
  Run 2: MongoDBRyaDAOTest>MongoTestBase.cleanupTest:49 » NullPointer

org.apache.rya.mongodb.MongoDBRyaDAOTest.testDeleteWildcardSubjectWithContext(org.apache.rya.mongodb.MongoDBRyaDAOTest)
  Run 1: MongoDBRyaDAOTest>MongoTestBase.setupTest:43 » NullPointer
  Run 2: MongoDBRyaDAOTest>MongoTestBase.cleanupTest:49 » NullPointer


Tests run: 39, Failures: 0, Errors: 7, Skipped: 0

[INFO]
------------------------------------------------------------------------
[INFO] Reactor Summary:
[INFO]
[INFO] Apache Rya Project ................................ SUCCESS [5.503s]
[INFO] Apache Rya Common Projects ........................ SUCCESS [1.351s]
[INFO] Apache Rya Common API ............................. SUCCESS [14.110s]
[INFO] Apache Rya Provenance ............................. SUCCESS [3.674s]
[INFO] Apache Rya DAO Projects ........................... SUCCESS [1.255s]
[INFO] Apache Rya Accumulo DAO ........................... SUCCESS [15.484s]
[INFO] Apache Rya MongoDB DAO ............................ FAILURE [23.563s]
[INFO] Apache Rya Extra Projects ......................... SKIPPED
[INFO] Apache Rya Prospector ............................. SKIPPED
[INFO] Apache Rya Manual ................................. SKIPPED
[INFO] Apache Rya SAIL ................................... SKIPPED
[INFO] Apache Rya PCJ Core ............................... SKIPPED
[INFO] Apache Rya PCJ Fluo Parent ........................ SKIPPED
[INFO] Apache Rya PCJ Fluo App ........................... SKIPPED
[INFO] Apache Rya PCJ Fluo API ........................... SKIPPED
[INFO] Apache Rya Secondary Indexing ..................... SKIPPED
[INFO] Apache Rya Periodic Service ....................... SKIPPED
[INFO] Apache Rya Periodic Service Notification .......... SKIPPED
[INFO] Apache Rya PCJ Fluo Client ........................ SKIPPED
[INFO] Apache Rya Integration Base ....................... SKIPPED
[INFO] Apache Rya Periodic Service Integration Tests ..... SKIPPED
[INFO] Apache Rya Shell .................................. SKIPPED
[INFO] Apache Rya Secondary Indexing Example ............. SKIPPED
[INFO] Apache Rya MapReduce Tools ........................ SKIPPED
[INFO] Apache Rya Reasoning .............................. SKIPPED
[INFO] Apache Rya Vagrant VM ............................. SKIPPED
[INFO] Apache Rya PCJ Fluo Integration Tests ............. SKIPPED
[INFO] Apache Rya PCJ Fluo Demo .......................... SKIPPED
[INFO] Apache Rya Export Parent .......................... SKIPPED
[INFO] Apache Rya Export API ............................. SKIPPED
[INFO] Apache Rya Export Accumulo ........................ SKIPPED
[INFO] Apache Rya Export Mongo ........................... SKIPPED
[INFO] Apache Rya Export Client .......................... SKIPPED
[INFO] Apache Rya Export Integration Tests ............... SKIPPED
[INFO] Apache Rya Merge Tool ............................. SKIPPED
[INFO] Apache Rya Giraph ................................. SKIPPED
[INFO] Apache Rya Benchmarks ............................. SKIPPED
[INFO] Apache Rya Geo Indexing Projects .................. SKIPPED
[INFO] Apache Rya Geo Indexing Common Code ............... SKIPPED
[INFO] Apache Rya Geo Indexing using GeoMesa ............. SKIPPED
[INFO] Apache Rya Geo indexing using GeoWave ............. SKIPPED
[INFO] Apache Rya Geo Indexing using MongoDB ............. SKIPPED
[INFO] Apache Rya OSGI Bundle ............................ SKIPPED
[INFO] Apache Rya ALX .................................... SKIPPED
[INFO] Apache Rya ALX Console ............................ SKIPPED
[INFO] Apache Rya Camel .................................. SKIPPED
[INFO] Apache Rya Pig Projects ........................... SKIPPED
[INFO] Apache Rya Accumulo Pig ........................... SKIPPED
[INFO] Apache Rya Spark Support .......................... SKIPPED
[INFO] Apache Rya Web Projects ........................... SKIPPED
[INFO] Apache Rya Web Implementation ..................... SKIPPED
[INFO]
------------------------------------------------------------------------
[INFO] BUILD FAILURE
[INFO]
------------------------------------------------------------------------
[INFO] Total time: 1:06.651s
[INFO] Finished at: Tue Sep 05 19:44:35 EDT 2017
[INFO] Final Memory: 64M/1119M
[INFO]
------------------------------------------------------------------------
[ERROR] Failed to execute goal
org.apache.maven.plugins:maven-surefire-plugin:2.18.1:test (default-test)
on project mongodb.rya: There are test failures.
[ERROR]
[ERROR] Please refer to
/home/adina/RyaRelease3.2.11/rya-project-3.2.11-incubating/dao/mongodb.rya/target/surefire-reports
for the individual test results.
[ERROR] -> [Help 1]
[ERROR]
[ERROR] To see the full stack trace of the errors, re-run Maven with the -e
switch.
[ERROR] Re-run Maven using the -X switch to enable full debug logging.
[ERROR]
[ERROR] For more information about the errors and possible solutions,
please read the following articles:
[ERROR] [Help 1]
http://cwiki.apache.org/confluence/display/MAVEN/MojoFailureException
[ERROR]
[ERROR] After correcting the problems, you can resume the build with the
command
[ERROR]   mvn <goals> -rf :mongodb.rya

On Sat, Sep 2, 2017 at 1:08 AM, David Lotts <dlotts@gmail.com> wrote:

> I am pleased to be calling this vote for the source release of Apache Rya
> (Incubating), version 3.2.11.
> Since I am sending this on the eve of a holiday weekend in the USA, we'll
> start the vote on Tuesday, although voting early is fine.
>
> The source zip, including signatures, digests, etc. can be found at:
> https://dist.apache.org/repos/dist/dev/incubator/rya/rya-incubating-3
> .2.11-rc1/
>
> Ancillary artifacts such as poms, jars, wars, ect. can be found here:
> https://repository.apache.org
> /content/repositories/orgapacherya-1005/org/apache/rya/rya-project/3
> .2.11-incubating/
>
> The Git tag is rya-incubating-3.2.11-rc1
> The Git commit ID is 2588d189d483698c0d2cd30e1e7c28f18c3d6871
> https://git-wip-us.apache.org/repos/asf
> ?p=incubator-rya.git;a=commit;h=2588d189d483698c0d2cd30e1e7c28f18c3d6871
>
> Checksums of rya-project-3.2.10-source-release.zip:
> SHA1: f40fe200b6768076d28ccd7b3d613ff6
> MD5: f40fe200b6768076d28ccd7b3d613ff6
>
> Release artifacts are signed with the following key:
> https://people.apache.org/keys/committer/dlotts.asc
>
> KEYS file available here:
> https://dist.apache.org/repos/dist/release/incubator/rya/KEYS
>
> Issues that were closed/resolved for this release are here:
> https://issues.apache.org/jira/secure/ReleaseNote.jspa?
> projectId=12319020&version=12341279
> (This is very incomplete as many items are yet to be tagged for the
> release.  I'll take care of that after the Labor day Monday along with
> release notes for the website.)
>
> The vote will be open for at least 72 hours starting Tuesday 9/12/2017 and
> close at 9/15/2017 Noon Eastern Time USA.
> Please download the release candidate and evaluate the necessary items
> including checking hashes, signatures, build from source, and test.  Then
> please vote:
>
> [ ] +1 Release this package as rya-project-3.2.11
> [ ] +0 no opinion
> [ ] -1 Do not release this package because because...
>



-- 
Dr. Adina Crainiceanu
Associate Professor, Computer Science Department
United States Naval Academy
410-293-6822
adina@usna.edu
http://www.usna.edu/Users/cs/adina/

Mime
  • Unnamed multipart/alternative (inline, None, 0 bytes)
View raw message