royale-users mailing list archives

Site index · List index
Message view « Date » · « Thread »
Top « Date » · « Thread »
From Takeshita Shoichiro <jl03...@gmail.com>
Subject Re: Build Failure: DataBindingExample_Flat: Unable to find artifact
Date Mon, 28 Oct 2019 01:39:59 GMT
Alex, thanks.  The problem was fixed. I opened issue 530.

2019年10月27日(日) 23:45 Alex Harui <aharui@adobe.com>:

> That looks like a bug to me.  Please open a github issue.
>
>
>
> I think you can just change the royale.framework.version in
> examples/pom.xml and remove the -SNAPSHOT
>
>
>
> Thanks,
>
> -Alex
>
>
>
> *From: *Takeshita Shoichiro <jl03119@gmail.com>
> *Reply-To: *"users@royale.apache.org" <users@royale.apache.org>
> *Date: *Saturday, October 26, 2019 at 11:15 PM
> *To: *"users@royale.apache.org" <users@royale.apache.org>
> *Subject: *Re: Build Failure: DataBindingExample_Flat: Unable to find
> artifact
>
>
>
> Alex, from the official Apache Royale download page.
>
>
>
> I run mvn clean install at Royale-asjs¥examples.
>
>
>
>
>
>
>
> 2019年10月27日(日) 15:01 Alex Harui <aharui@adobe.com>:
>
> Hi T-San,
>
>
>
> Where did you get the source?  Did you run “mvn clean install” in the
> royale-asjs folder first?
>
>
>
> -Alex
>
>
>
> *From: *Takeshita Shoichiro <jl03119@gmail.com>
> *Reply-To: *"users@royale.apache.org" <users@royale.apache.org>
> *Date: *Saturday, October 26, 2019 at 10:17 PM
> *To: *"users@royale.apache.org" <users@royale.apache.org>
> *Subject: *Build Failure: DataBindingExample_Flat: Unable to find artifact
>
>
>
> I run "mvn clean install"
> at C:\apache-royale-0.9.6-bin-js\royale-asjs\examples on Windows 10 with
> Japanese.  Build failed with the following console.
>
>
>
> This is the first time build of Apache Royale examples on this machine.  I
> cannot fine the subject WAR file in the designated link.  What's w
>
>
>
>
> *****************************************************************************************************************************************************************************************************
>
>
> [INFO]
> ------------------------------------------------------------------------
> [INFO] BUILD FAILURE
> [INFO]
> ------------------------------------------------------------------------
> [INFO] Total time:  19:06 min
> [INFO] Finished at: 2019-10-27T14:01:01+09:00
> [INFO]
> ------------------------------------------------------------------------
> [ERROR] Failed to execute goal
> org.apache.maven.plugins:maven-dependency-plugin:2.10:unpack (unpack-fonts)
> on project DataBindingExample_Flat: Unable to find artifact.: Could not
> find artifact org.apache.royale.framework:Fonts:war:0.9.6-SNAPSHOT in
> apache-snapshots (
> https://repository.apache.org/content/repositories/snapshots
> <https://nam04.safelinks.protection.outlook.com/?url=https%3A%2F%2Frepository.apache.org%2Fcontent%2Frepositories%2Fsnapshots&data=02%7C01%7Caharui%40adobe.com%7C8d4d865910dd4e429aa008d75aa521cf%7Cfa7b1b5a7b34438794aed2c178decee1%7C0%7C0%7C637077537592975363&sdata=wDxE3SyV4B5MHRZHOn8S2nZigFWCP29AGKzt84LH1N4%3D&reserved=0>
> )
> [ERROR]
> [ERROR] Try downloading the file manually from the project website.
> [ERROR]
> [ERROR] Then, install it using the command:
> [ERROR]     mvn install:install-file -DgroupId=org.apache.royale.framework
> -DartifactId=Fonts -Dversion=0.9.6-SNAPSHOT -Dpackaging=war
> -Dfile=/path/to/file
>
> --
>
> Shoichiro Takeshita
>
> --
>
> Shoichiro Takeshita
> 武下 祥一郎
>
-- 
Shoichiro Takeshita
武下 祥一郎

Mime
View raw message