royale-dev mailing list archives

Site index · List index
Message view « Date » · « Thread »
Top « Date » · « Thread »
From apacheroyal...@gmail.com
Subject Build failed in Jenkins: royale-asjs_jsonly #1665
Date Tue, 02 Oct 2018 18:40:45 GMT
See <http://apacheroyaleci.westus2.cloudapp.azure.com:8080/job/royale-asjs_jsonly/1665/display/redirect?page=changes>

Changes:

[carlosrovira] add vscode config to remoteobectamftest example

[carlosrovira] New RemoteObjectAMFTestBasic

------------------------------------------
[...truncated 225.46 KB...]
     [echo] ROYALE_COMPILER_HOME is C:\Program Files (x86)\Jenkins\workspace\royale-compiler\compiler

check-dependency:
     [echo] checking for C:\Program Files (x86)\Jenkins\workspace\royale-compiler\compiler/lib/external//commons-io.jar

download-dependency:
     [echo] basedir is C:\Program Files (x86)\Jenkins\workspace\royale-compiler\compiler\src\main\resources
     [echo] ROYALE_COMPILER_HOME is C:\Program Files (x86)\Jenkins\workspace\royale-compiler\compiler
     [echo] ROYALE_COMPILER_HOME is C:\Program Files (x86)\Jenkins\workspace\royale-compiler\compiler

check-dependency:
     [echo] checking for C:\Program Files (x86)\Jenkins\workspace\royale-compiler\compiler/lib/external//commons-lang-2.6.jar

download-dependency:
     [echo] basedir is C:\Program Files (x86)\Jenkins\workspace\royale-compiler\compiler\src\main\resources
     [echo] ROYALE_COMPILER_HOME is C:\Program Files (x86)\Jenkins\workspace\royale-compiler\compiler
     [echo] ROYALE_COMPILER_HOME is C:\Program Files (x86)\Jenkins\workspace\royale-compiler\compiler

check-dependency:
     [echo] checking for C:\Program Files (x86)\Jenkins\workspace\royale-compiler\compiler/lib/external//guava.jar

download-dependency:
     [echo] basedir is C:\Program Files (x86)\Jenkins\workspace\royale-compiler\compiler\src\main\resources
     [echo] ROYALE_COMPILER_HOME is C:\Program Files (x86)\Jenkins\workspace\royale-compiler\compiler
     [echo] ROYALE_COMPILER_HOME is C:\Program Files (x86)\Jenkins\workspace\royale-compiler\compiler

check-dependency:
     [echo] checking for C:\Program Files (x86)\Jenkins\workspace\royale-compiler\compiler/lib/external//jburg.jar

download-dependency:
     [echo] basedir is C:\Program Files (x86)\Jenkins\workspace\royale-compiler\compiler\src\main\resources
     [echo] ROYALE_COMPILER_HOME is C:\Program Files (x86)\Jenkins\workspace\royale-compiler\compiler
     [echo] ROYALE_COMPILER_HOME is C:\Program Files (x86)\Jenkins\workspace\royale-compiler\compiler

check-dependency:
     [echo] checking for C:\Program Files (x86)\Jenkins\workspace\royale-compiler\compiler/lib/external//jflex.jar

download-dependency:
     [copy] Warning: C:\Program Files (x86)\Jenkins\workspace\royale-compiler\compiler\in\temp\jflex-1.6.0
does not exist.
     [echo] basedir is C:\Program Files (x86)\Jenkins\workspace\royale-compiler\compiler\src\main\resources
     [echo] ROYALE_COMPILER_HOME is C:\Program Files (x86)\Jenkins\workspace\royale-compiler\compiler
     [echo] ROYALE_COMPILER_HOME is C:\Program Files (x86)\Jenkins\workspace\royale-compiler\compiler

check-dependency:
     [echo] checking for C:\Program Files (x86)\Jenkins\workspace\royale-compiler\compiler/lib/external//lzma-sdk.jar

download-dependency:
     [echo] basedir is C:\Program Files (x86)\Jenkins\workspace\royale-compiler\compiler\src\main\resources
     [echo] ROYALE_COMPILER_HOME is C:\Program Files (x86)\Jenkins\workspace\royale-compiler\compiler
     [echo] ROYALE_COMPILER_HOME is C:\Program Files (x86)\Jenkins\workspace\royale-compiler\compiler

check-dependency:
     [echo] checking for C:\Program Files (x86)\Jenkins\workspace\royale-compiler\compiler/lib/external//flex-tool-api.jar

download-dependency:

main:

setup:

set.raw.as.tokenizer.uptodate:

raw.as.tokenizer:

set.raw.asdoc.tokenizer.uptodate:

raw.asdoc.tokenizer:

set.raw.mxml.tokenizer.uptodate:

raw.mxml.tokenizer:

jflex:

set.as.parser.uptodate:

as.parser:

set.metadata.parser.uptodate:

metadata.parser:

set.css.lexer.and.parser.uptodate:

css.lexer.and.parser:
     [echo] Generating CSSLexer and CSSParser
     [java] Picked up JAVA_TOOL_OPTIONS: -Dfile.encoding=UTF-8 -Xmx512m

set.css.tree.uptodate:

css.tree:

antlr:

set.unknown.tree.handler.patterns.uptodate:

unknown.tree.handler.patterns:

set.cmc.emitter.uptodate:

cmc.emitter:

set.css.emitter.uptodate:

css.emitter:

jburg:

eclipse:

src.depend:
   [depend] Deleted 8 out of date files in 0 seconds

compile:
    [javac] Compiling 5 source files to C:\Program Files (x86)\Jenkins\workspace\royale-compiler\compiler\target\classes
    [javac] warning: [options] bootstrap class path not set in conjunction with -source 1.5
    [javac] warning: [options] source value 1.5 is obsolete and will be removed in a future
release
    [javac] warning: [options] target value 1.5 is obsolete and will be removed in a future
release
    [javac] warning: [options] To suppress warnings about obsolete options, use -Xlint:-options.
    [javac] 4 warnings

version-info:

set.compiler.jar.uptodate:

compiler.jar:

set.royale.asc.jar.uptodate:

royale.asc.jar:

set.royale.mxmlc.jar.uptodate:

royale.mxmlc.jar:

set.royale.compc.jar.uptodate:

royale.compc.jar:

set.royale.optimizer.jar.uptodate:

royale.optimizer.jar:

set.royale.swfdump.jar.uptodate:

royale.swfdump.jar:

jar:

sdk:

test:

jar.tests:
     [java] Exception in thread "main" java.lang.NoClassDefFoundError: org/apache/royale/compiler/internal/caches/CSSDocumentCache
     [java] 	at org.apache.royale.swc.SWCManager.<init>(SWCManager.java:81)
     [java] 	at org.apache.royale.compiler.internal.workspaces.Workspace.<init>(Workspace.java:179)
     [java] 	at org.apache.royale.compiler.internal.workspaces.Workspace.<init>(Workspace.java:158)
     [java] 	at org.apache.royale.compiler.clients.MXMLC.<init>(MXMLC.java:401)
     [java] 	at org.apache.royale.compiler.clients.MXMLC.staticMainNoExit(MXMLC.java:162)
     [java] 	at org.apache.royale.compiler.clients.MXMLC.main(MXMLC.java:150)
     [java] Caused by: java.lang.ClassNotFoundException: org.apache.royale.compiler.internal.caches.CSSDocumentCache
     [java] 	at java.net.URLClassLoader.findClass(URLClassLoader.java:381)
     [java] 	at java.lang.ClassLoader.loadClass(ClassLoader.java:424)
     [java] 	at sun.misc.Launcher$AppClassLoader.loadClass(Launcher.java:338)
     [java] 	at java.lang.ClassLoader.loadClass(ClassLoader.java:357)
     [java] 	... 6 more
     [java] Picked up JAVA_TOOL_OPTIONS: -Dfile.encoding=UTF-8 -Xmx512m
     [java] Java Result: 1
     [java] Exception in thread "main" java.lang.NoClassDefFoundError: org/apache/royale/compiler/internal/caches/CSSDocumentCache
     [java] 	at org.apache.royale.swc.SWCManager.<init>(SWCManager.java:81)
     [java] 	at org.apache.royale.compiler.internal.workspaces.Workspace.<init>(Workspace.java:179)
     [java] 	at org.apache.royale.compiler.internal.workspaces.Workspace.<init>(Workspace.java:158)
     [java] 	at org.apache.royale.compiler.clients.MXMLC.<init>(MXMLC.java:401)
     [java] 	at org.apache.royale.compiler.clients.COMPC.<init>(COMPC.java:56)
     [java] 	at org.apache.royale.compiler.clients.COMPC.staticMainNoExit(COMPC.java:77)
     [java] 	at org.apache.royale.compiler.clients.COMPC.main(COMPC.java:65)
     [java] Caused by: java.lang.ClassNotFoundException: org.apache.royale.compiler.internal.caches.CSSDocumentCache
     [java] 	at java.net.URLClassLoader.findClass(URLClassLoader.java:381)
     [java] 	at java.lang.ClassLoader.loadClass(ClassLoader.java:424)
     [java] 	at sun.misc.Launcher$AppClassLoader.loadClass(Launcher.java:338)
     [java] 	at java.lang.ClassLoader.loadClass(ClassLoader.java:357)
     [java] 	... 7 more
     [java] Picked up JAVA_TOOL_OPTIONS: -Dfile.encoding=UTF-8 -Xmx512m
     [java] Java Result: 1
     [java] ActionScript 3.0 Compiler for AVM+
     [java] Version 0.9.4 build 0
     [java] 
     [java] usage: asc [-abcfuture] [-api <version>] [-AS3] [-avmtarget <vm version
     [java]        number>] [-b] [-coach] [-config <ns::name=value>] [-d] [-doc]
     [java]        [-ES] [-ES4] [-exe <avmplus path>] [-f] [-h] [-i] [-import
     [java]        <filename>] [-in <filename>] [-inline] [-l] [-language <lang>]
     [java]        [-le <swc file>] [-li <swc file>] [-log] [-m] [-md] [-merge]
     [java]        [-movieclip] [-o] [-o2 <name=value>] [-optimize] [-out
     [java]        <basename>] [-outdir <output directory name>] [-p] [-parallel]
     [java]        [-removedeadcode] [-sanity] [-static] [-strict] [-swf
     [java]        <classname,width,height[,fps]>] [-use <namespace>] [-warnings]
     [java]        FILENAME...
     [java] Picked up JAVA_TOOL_OPTIONS: -Dfile.encoding=UTF-8 -Xmx512m
     [java] Java Result: 1
     [java] Exception in thread "main" java.lang.NoClassDefFoundError: org/apache/royale/compiler/internal/caches/CSSDocumentCache
     [java] 	at org.apache.royale.swc.SWCManager.<init>(SWCManager.java:81)
     [java] 	at org.apache.royale.compiler.internal.workspaces.Workspace.<init>(Workspace.java:179)
     [java] 	at org.apache.royale.compiler.internal.workspaces.Workspace.<init>(Workspace.java:158)
     [java] 	at org.apache.royale.compiler.clients.Optimizer.<init>(Optimizer.java:218)
     [java] 	at org.apache.royale.compiler.clients.Optimizer.staticMainNoExit(Optimizer.java:98)
     [java] 	at org.apache.royale.compiler.clients.Optimizer.main(Optimizer.java:91)
     [java] Caused by: java.lang.ClassNotFoundException: org.apache.royale.compiler.internal.caches.CSSDocumentCache
     [java] 	at java.net.URLClassLoader.findClass(URLClassLoader.java:381)
     [java] 	at java.lang.ClassLoader.loadClass(ClassLoader.java:424)
     [java] 	at sun.misc.Launcher$AppClassLoader.loadClass(Launcher.java:338)
     [java] 	at java.lang.ClassLoader.loadClass(ClassLoader.java:357)
     [java] 	... 6 more
     [java] Picked up JAVA_TOOL_OPTIONS: -Dfile.encoding=UTF-8 -Xmx512m
     [java] Java Result: 1
     [java] Apache Royale SWF Dump Utility
     [java] Version 0.9.4 build 0
     [java] 
     [java] Usage: swfdump [-abc] file1.swf
     [java] Picked up JAVA_TOOL_OPTIONS: -Dfile.encoding=UTF-8 -Xmx512m
     [java] Java Result: 1

js.swc:
     [java] Exception in thread "main" java.lang.NoClassDefFoundError: org/apache/royale/compiler/internal/caches/CSSDocumentCache
     [java] 	at org.apache.royale.swc.SWCManager.<init>(SWCManager.java:81)
     [java] 	at org.apache.royale.compiler.internal.workspaces.Workspace.<init>(Workspace.java:179)
     [java] 	at org.apache.royale.compiler.internal.workspaces.Workspace.<init>(Workspace.java:158)
     [java] 	at org.apache.royale.compiler.clients.MXMLC.<init>(MXMLC.java:401)
     [java] 	at org.apache.royale.compiler.clients.COMPC.<init>(COMPC.java:56)
     [java] 	at org.apache.royale.compiler.clients.COMPC.staticMainNoExit(COMPC.java:77)
     [java] 	at org.apache.royale.compiler.clients.COMPC.main(COMPC.java:65)
     [java] Caused by: java.lang.ClassNotFoundException: org.apache.royale.compiler.internal.caches.CSSDocumentCache
     [java] 	at java.net.URLClassLoader.findClass(URLClassLoader.java:381)
     [java] 	at java.lang.ClassLoader.loadClass(ClassLoader.java:424)
     [java] 	at sun.misc.Launcher$AppClassLoader.loadClass(Launcher.java:338)
     [java] 	at java.lang.ClassLoader.loadClass(ClassLoader.java:357)
     [java] 	... 7 more
     [java] Picked up JAVA_TOOL_OPTIONS: -Dfile.encoding=UTF-8 -Xmx512m

BUILD FAILED
<http://apacheroyaleci.westus2.cloudapp.azure.com:8080/job/royale-asjs_jsonly/ws/build.xml>:2014:
The following error occurred while executing this line:
C:\Program Files (x86)\Jenkins\workspace\royale-compiler\build.xml:80: The following error
occurred while executing this line:
C:\Program Files (x86)\Jenkins\workspace\royale-compiler\compiler\build.xml:711: The following
error occurred while executing this line:
C:\Program Files (x86)\Jenkins\workspace\royale-compiler\compiler\src\test\build.xml:76: Java
returned: 1

Total time: 58 minutes 29 seconds
Picked up JAVA_TOOL_OPTIONS: -Dfile.encoding=UTF-8 -Xmx512m
Build step 'Invoke Ant' marked build as failure
Archiving artifacts

Mime
View raw message