royale-dev mailing list archives

Site index · List index
Message view « Date » · « Thread »
Top « Date » · « Thread »
From apacheroyal...@gmail.com
Subject Build failed in Jenkins: royale-asjs_jsonly #1799
Date Thu, 25 Oct 2018 12:13:04 GMT
See <http://apacheroyaleci.westus2.cloudapp.azure.com:8080/job/royale-asjs_jsonly/1799/display/redirect?page=changes>

Changes:

[carlosrovira] cleaning debuggin VSCode file in JewelExample

------------------------------------------
[...truncated 819.30 KB...]
    [junit] 	at org.apache.tools.ant.util.DOMElementWriter.write(DOMElementWriter.java:223)
    [junit] 	at org.apache.tools.ant.util.DOMElementWriter.write(DOMElementWriter.java:223)
    [junit] 	at org.apache.tools.ant.taskdefs.optional.junit.XMLJUnitResultFormatter.endTestSuite(XMLJUnitResultFormatter.java:197)
    [junit] 	... 4 more
    [junit] Picked up JAVA_TOOL_OPTIONS: -Dfile.encoding=UTF-8 -Xmx512m
    [junit] <?xml version="1.0" encoding="UTF-8" ?>
    [junit] <testsuite errors="1" failures="0" hostname="ApacheRoyaleCI" name="org.apache.royale.compiler.internal.tree.mxml.Batch-With-Multiple-Tests"
skipped="0" tests="1" time="0.0" timestamp="2018-10-25T12:10:51">
    [junit]   <properties>
    [junit]     <property name="css.emitter.uptodate" value="true" />
    [junit]     <property name="file.encoding.pkg" value="sun.io" />
    [junit]     <property name="env.PROMPT" value="$P$G" />
    [junit]     <property name="qa.dir" value="<http://apacheroyaleci.westus2.cloudapp.azure.com:8080/job/royale-asjs_jsonly/ws/../qa">
/>
    [junit]     <property name="env.ROYALE_TRANSPILER_HOME" value="C:\Program Files (x86)\Jenkins\workspace\royale-compiler\compiler-jx"
/>
    [junit]     <property name="java.home" value="C:\Program Files\Java\jdk1.8.0_152\jre"
/>
    [junit]     <property name="build.number.date" value="20181025" />
    [junit]     <property name="env.GIT_URL" value="https://github.com/apache/royale-asjs.git"
/>
    [junit]     <property name="asc" value="<http://apacheroyaleci.westus2.cloudapp.azure.com:8080/job/royale-asjs_jsonly/ws/bin/asc">
/>
    [junit]     <property name="debug" value="true" />
    [junit]     <property name="sdk" value="C:/Program Files (x86)/Jenkins/workspace/royale-compiler/compiler/lib"
/>
    [junit]     <property name="java.endorsed.dirs" value="C:\Program Files\Java\jdk1.8.0_152\jre\lib\endorsed"
/>
    [junit]     <property name="javac.src" value="1.5" />
    [junit]     <property name="env.USERNAME" value="apacheroyale" />
    [junit]     <property name="env.HUDSON_HOME" value="C:\Program Files (x86)\Jenkins"
/>
    [junit]     <property name="isWindows" value="windows" />
    [junit]     <property name="compiler" value="C:/Program Files (x86)/Jenkins/workspace/royale-compiler/compiler"
/>
    [junit]     <property name="sun.os.patch.levelFrom dev-return-7342-apmail-royale-dev-archiveÈyale.apache.org@royale.apache.org
 Thu Oct 25 12:31:14 2018
Return-Path: <dev-return-7342-apmail-royale-dev-archiveÈyale.apache.org@royale.apache.org>
X-Original-To: apmail-royale-dev-archive@minotaur.apache.org
Delivered-To: apmail-royale-dev-archive@minotaur.apache.org
Received: from mail.apache.org (hermes.apache.org [140.211.11.3])
	by minotaur.apache.org (Postfix) with SMTP id E6A971813D
	for <apmail-royale-dev-archive@minotaur.apache.org>; Thu, 25 Oct 2018 12:13:12 +0000
(UTC)
Received: (qmail 67962 invoked by uid 500); 25 Oct 2018 12:13:12 -0000
Delivered-To: apmail-royale-dev-archive@royale.apache.org
Received: (qmail 67932 invoked by uid 500); 25 Oct 2018 12:13:12 -0000
Mailing-List: contact dev-help@royale.apache.org; run by ezmlm
Precedence: bulk
List-Help: <mailto:dev-help@royale.apache.org>
List-Unsubscribe: <mailto:dev-unsubscribe@royale.apache.org>
List-Post: <mailto:dev@royale.apache.org>
List-Id: <dev.royale.apache.org>
Reply-To: dev@royale.apache.org
Delivered-To: mailing list dev@royale.apache.org
Received: (qmail 67920 invoked by uid 99); 25 Oct 2018 12:13:12 -0000
Received: from pnap-us-west-generic-nat.apache.org (HELO spamd2-us-west.apache.org) (209.188.14.142)
    by apache.org (qpsmtpd/0.29) with ESMTP; Thu, 25 Oct 2018 12:13:12 +0000
Received: from localhost (localhost [127.0.0.1])
	by spamd2-us-west.apache.org (ASF Mail Server at spamd2-us-west.apache.org) with ESMTP id
BA1CE1A32E5
	for <dev@royale.apache.org>; Thu, 25 Oct 2018 12:13:11 +0000 (UTC)
X-Virus-Scanned: Debian amavisd-new at spamd2-us-west.apache.org
X-Spam-Flag: NO
X-Spam-Score: 0.389
X-Spam-Level:
X-Spam-Status: No, score×389 tagged_abovei99 required731
	testsMKIM_SIGNED×1, DKIM_VALID`.1, DKIM_VALID_AU`.1,
	KAM_NUMSUBJECT×5, RCVD_IN_DNSWL_NONE`.0001, SPF_PASS`.001,
	T_DKIMWL_WL_MED`.01] autolearnâsabled
Authentication-Results: spamd2-us-west.apache.org (amavisd-new);
	dkimšss (2048-bit key) header.dail.com
Received: from mx1-lw-us.apache.org ([10.40.0.8])
	by localhost (spamd2-us-west.apache.org [10.40.0.9]) (amavisd-new, port 10024)
	with ESMTP id qLP9S1JQfZ6c for <dev@royale.apache.org>;
	Thu, 25 Oct 2018 12:13:08 +0000 (UTC)
Received: from mail-pg1-f182.google.com (mail-pg1-f182.google.com [209.85.215.182])
	by mx1-lw-us.apache.org (ASF Mail Server at mx1-lw-us.apache.org) with ESMTPS id DDCFD5F42F
	for <dev@royale.apache.org>; Thu, 25 Oct 2018 12:13:07 +0000 (UTC)
Received: by mail-pg1-f182.google.com with SMTP id w3-v6so3888461pgs.11
        for <dev@royale.apache.org>; Thu, 25 Oct 2018 05:13:07 -0700 (PDT)
DKIM-Signature: vô aÌa-sha256; c¾laxed/relaxed;
        dail.com; s 161025;
        hom:date:reply-to:to:message-id:subject:mime-version
         :content-transfer-encoding;
        bh(ZYkvv1/xzFSLJXb6IEabLKenPngTcqNtmRZXUb5JYó        bÓieDpHq6zF76Svwup1bs5PaNfJOWLQFijIq6QWVE/nbfyk693Op+AiSkL3pNYQw60
         hUh3O2AjWCs0fusHgX9RaIM0wmfbp70m9Up1vwMpCdGf68UZGDdv8E4IyeUaK+xXL/gO
         Nzu//tzvd22+6KjZeHqTk5tPwJXoh8MF07BytLspNbtzkSP13kqEy/wmT5ZDGnFaVWnX
         76O/CgkLLyqS3bbVYlAVKzG4Wqjmmn6X/sq23vHT4XOySy4tVFG2JZDLGWMytmWbnH/A
         Fq4gR9FBZ7rx+q0SRh/1SsgB+uxYqQN/LriVRysWQMaLeJ54Jnlw73m1r2QtqPnFn1RX
         T9MgX-Google-DKIM-Signature: vô aÌa-sha256; c¾laxed/relaxed;
        d100.net; s 161025;
        hægm-message-state:from:date:reply-to:to:message-id:subject
         :mime-version:content-transfer-encoding;
        bh(ZYkvv1/xzFSLJXb6IEabLKenPngTcqNtmRZXUb5JYó        bOZ2f5aykKDaTC4L3a4yErS+vFGACUzMUF9KD8hONh89FkVnS6rSmyj/sUsFhOrgd
         8qFW/OUinPjtovfkReWvDGriY/mXJvHpci+z/NsAFTNqmMzoBBGJ4bnhva8xFP0QfNxh
         8ViNAOxLY6fxNEoRp6BsW3hzzAm6UrteZGm6gIWnoVcA9MBsiRAiEsyQd68w2ywh0vih
         jS4zz8pb+sZLv0JxBL3qVDIpUm00ssWu6KRv2AKGEDEiyDMK8szysWnak0CvFUoBSO0w
         CqbFXBdcxGVS3cS7E3RgvhZ51vM/wdqRrCRKinSPANL0LCt7aJVqMHPhF5Az9UrV1kIB
         EFsAX-Gm-Message-State: AGRZ1gJ8qIkiu03DcMhIUp7sUCTGQx+GKuGHLCcgairsYIbrSKERMvKX
	SDGUs+UpJtm8WGUStkAG33vuoqM9
X-Google-Smtp-Source: AJdET5d9scPqWtnxcC8DC2UgG+tMS1zvCZ5j+ycBcoQAp0OdzenPooXq40PGBwqwnU4UvJz1xBhkhQX-Received:
by 2002:a65:65c9:: with SMTP id y9mr1284718pgv.438.1540469586173;
        Thu, 25 Oct 2018 05:13:06 -0700 (PDT)
Received: from ApacheRoyaleCI.ddbg3qfpmwredo2xb4epkaumqc.xx.internal.cloudapp.net ([52.191.135.173])
        by smtp.gmail.com with ESMTPSA id h192-v6sm7702413pfe.146.2018.10.25.05.13.04
        for <dev@royale.apache.org>
        (versionåS1 cipherìDHE-RSA-AES128-SHA bits8/128);
        Thu, 25 Oct 2018 05:13:05 -0700 (PDT)
From: apacheroyaleci@gmail.com
Date: Thu, 25 Oct 2018 12:13:04 +0000 (UTC)
Reply-To: dev@royale.apache.org
To: dev@royale.apache.org
Message-ID: <16441687.396.1540469584442.JavaMail.apacheroyale@ApacheRoyaleCI>
Subject: Build failed in Jenkins: royale-asjs_jsonly #1799
MIME-Version: 1.0
Content-Type: text/plain; charsetýF-8
Content-Transfer-Encoding: quoted-printable
X-Instance-Identity: MIIBIjANBgkqhkiG9w0BAQEFAAOCAQ8AMIIBCgKCAQEAyTTnaJgzyOJ36ePl033Na+DGf1Qw+s67MlXTHtuVbPJ1ROitOtsXqCnLaXzBl9BgpgGzlbZeIR5Tu3ZzfYWvKPh04Xb7tqOoIHNzlO6V0aigtP5OBBYmpyg1kp06PVTm5rpPWVbkR+bz4g0bldabDiCbNEPEj3UeUN3ZJN0LIEFdRjuBYOgOLAN0eEfwlO0+CATFZacrVMpFmkVE47/uwMGaD4VhyQaoYKX+DqGTDIUqcZEP+Uh7J7RYUrcFiM6YUn1K4GyGNAAAuOpij2yE1H7YcYVVimA1/VaPZiH4KDSCnYbMQxwhHiS6Oea257dt9l4lgZo+Td9wzl7LBSf5gQIDAQAB
X-Jenkins-Job: royale-asjs_jsonly
X-Jenkins-Result: FAILURE

See <http://apacheroyaleci.westus2.cloudapp.azure.com:8080/job/royale-asjs_jsonly/1799/display/redirect?page=changes>

Changes:

[carlosrovira] cleaning debuggin VSCode file in JewelExample

------------------------------------------
[...truncated 819.30 KB...]
    [junit] 	at org.apache.tools.ant.util.DOMElementWriter.write(DOMElementWriter.java:223)
    [junit] 	at org.apache.tools.ant.util.DOMElementWriter.write(DOMElementWriter.java:223)
    [junit] 	at org.apache.tools.ant.taskdefs.optional.junit.XMLJUnitResultFormatter.endTestSuite(XMLJUnitResultFormatter.java:197)
    [junit] 	... 4 more
    [junit] Picked up JAVA_TOOL_OPTIONS: -Dfile.encoding=UTF-8 -Xmx512m
    [junit] <?xml version="1.0" encoding="UTF-8" ?>
    [junit] <testsuite errors="1" failures="0" hostname="ApacheRoyaleCI" name="org.apache.royale.compiler.internal.tree.mxml.Batch-With-Multiple-Tests"
skipped="0" tests="1" time="0.0" timestamp="2018-10-25T12:10:51">
    [junit]   <properties>
    [junit]     <property name="css.emitter.uptodate" value="true" />
    [junit]     <property name="file.encoding.pkg" value="sun.io" />
    [junit]     <property name="env.PROMPT" value="$P$G" />
    [junit]     <property name="qa.dir" value="<http://apacheroyaleci.westus2.cloudapp.azure.com:8080/job/royale-asjs_jsonly/ws/../qa">
/>
    [junit]     <property name="env.ROYALE_TRANSPILER_HOME" value="C:\Program Files (x86)\Jenkins\workspace\royale-compiler\compiler-jx"
/>
    [junit]     <property name="java.home" value="C:\Program Files\Java\jdk1.8.0_152\jre"
/>
    [junit]     <property name="build.number.date" value="20181025" />
    [junit]     <property name="env.GIT_URL" value="https://github.com/apache/royale-asjs.git"
/>
    [junit]     <property name="asc" value="<http://apacheroyaleci.westus2.cloudapp.azure.com:8080/job/royale-asjs_jsonly/ws/bin/asc">
/>
    [junit]     <property name="debug" value="true" />
    [junit]     <property name="sdk" value="C:/Program Files (x86)/Jenkins/workspace/royale-compiler/compiler/lib"
/>
    [junit]     <property name="java.endorsed.dirs" value="C:\Program Files\Java\jdk1.8.0_152\jre\lib\endorsed"
/>
    [junit]     <property name="javac.src" value="1.5" />
    [junit]     <property name="env.USERNAME" value="apacheroyale" />
    [junit]     <property name="env.HUDSON_HOME" value="C:\Program Files (x86)\Jenkins"
/>
    [junit]     <property name="isWindows" value="windows" />
    [junit]     <property name="compiler" value="C:/Program Files (x86)/Jenkins/workspace/royale-compiler/compiler"
/>
    [junit]     <property name="sun.os.patch.level" value="" />
    [junit]     <property name="java.vendor.url" value="http://java.oracle.com/" />
    [junit]     <property name="env.ASJS_HOME" value="<http://apacheroyaleci.westus2.cloudapp.azure.com:8080/job/royale-asjs_jsonly/ws/">
/>
    [junit]     <property name="env.COMPUTERNAME" value="ApacheRoyaleCI" />
    [junit]     <property name="env.=C:" value="<http://apacheroyaleci.westus2.cloudapp.azure.com:8080/job/royale-asjs_jsonly/ws/">
/>
    [junit]     <property name="env.ProgramFiles(x86)" value="C:\Program Files (x86)" />
    [junit]     <property name="env.NODE_NAME" value="agent1" />
    [junit]     <property name="java.version" value="1.8.0_152" />
    [junit]     <property name="javac.debug" value="true" />
    [junit]     <property name="env.NODE_LABELS" value="agent1" />
    [junit]     <property name="env.JENKINS_SERVER_COOKIE" value="bc2c85f7920ab4ef" />
    [junit]     <property name="java.vendor.url.bug" value="http://bugreport.sun.com/bugreport/"
/>
    [junit]     <property name="env.USERPROFILE" value="C:\Users\apacheroyale" />
    [junit]     <property name="ant.project.invoked-targets" value="main" />
    [junit]     <property name="test.timeout" value="3000000" />
    [junit]     <property name="generated.by.comment" value=" * Generated by Apache Royale
Compiler" />
    [junit]     <property name="env.SystemRoot" value="C:\Windows" />
    [junit]     <property name="flat.donot.ask" value="true" />
    [junit]     <property name="user.name" value="apacheroyale" />
    [junit]     <property name="build.number" value="0" />
    [junit]     <property name="font.donot.ask" value="set" />
    [junit]     <property name="sun.io.unicode.encoding" value="UnicodeLittle" />
    [junit]     <property name="release.target" value="true" />
    [junit]     <property name="sun.jnu.encoding" value="Cp1252" />
    [junit]     <property name="java.runtime.name" value="Java(TM) SE Runtime Environment"
/>
    [junit]     <property name="localized.jars" value="true" />
    [junit]     <property name="env.LOCALAPPDATA" value="C:\Users\apacheroyale\AppData\Local"
/>
    [junit]     <property name="ant.file.type.compiler.tests" value="file" />
    [junit]     <property name="build.noprompt" value="true" />
    [junit]     <property name="env.JAVA_TOOL_OPTIONS" value="-Dfile.encoding=UTF-8 -Xmx512m"
/>
    [junit]     <property name="playerglobal.version" value="11.7" />
    [junit]     <property name="java.specification.name" value="Java Platform API Specification"
/>
    [junit]     <property name="user.timezone" value="" />
    [junit]     <property name="user.script" value="" />
    [junit]     <property name="path.separator" value=";" />
    [junit]     <property name="as.parser.uptodate" value="true" />
    [junit]     <property name="env.PROCESSOR_IDENTIFIER" value="Intel64 Family 6 Model
85 Stepping 4, GenuineIntel" />
    [junit]     <property name="env._JAVACMD" value="C:\Program Files\Java\jdk1.8.0_152\bin\java.exe"
/>
    [junit]     <property name="javadoc.zip.uptodate" value="set" />
    [junit]     <property name="file.encoding" value="UTF-8" />
    [junit]     <property name="src.depend" value="true" />
    [junit]     <property name="ant.project.default-target" value="main" />
    [junit]     <property name="ant.file.compiler.tests" value="C:\Program Files (x86)\Jenkins\workspace\royale-compiler\compiler\src\test\build.xml"
/>
    [junit]     <property name="sun.java.command" value="org.apache.tools.ant.launch.Launcher
-DROYALE_COMPILER_REPO=C:\Program Files (x86)\Jenkins\workspace\royale-compiler -Denv.ROYALE_TRANSPILER_HOME=C:\Program
Files (x86)\Jenkins\workspace\royale-compiler\compiler-jx -Dbrowser=C:\Program Files\Mozilla
Firefox\firefox.exe -DROYALE_TYPEDEFS_HOME=C:\Program Files (x86)\Jenkins\workspace\royale-typedefs
-Dbuild.noprompt true -Dplayerglobal.version 11.7 -Denv.ROYALE_COMPILER_HOME=C:\Program Files
(x86)\Jenkins\workspace\royale-compiler\compiler release create-SHA-512 create-SHA-512-jsonly"
/>
    [junit]     <property name="env.RUN_DISPLAY_URL" value="http://apacheroyaleci.westus2.cloudapp.azure.com:8080/job/royale-asjs_jsonly/1799/display/redirect"
/>
    [junit]     <property name="env.NUMBER_OF_PROCESSORS" value="2" />
    [junit]     <property name="env.APPDATA" value="C:\Users\apacheroyale\AppData\Roaming"
/>
    [junit]     <property name="ant.file" value="C:\Program Files (x86)\Jenkins\workspace\royale-compiler\compiler\src\test\build.xml"
/>
    [junit]     <property name="env.BUILD_TAG" value="jenkins-royale-asjs_jsonly-1799"
/>
    [junit]     <property name="compiler.ant.binaries" value="org/apache/royale/compiler/ant/**/*.class"
/>
    [junit]     <property name="java.io.tmpdir" value="C:\Users\APACHE~1\AppData\Local\Temp\2\"
/>
    [junit]     <property name="TODAY" value="October 25 2018" />
    [junit]     <property name="user.language" value="en" />
    [junit]     <property name="env.SystemDrive" value="C:" />
    [junit]     <property name="line.separator" value="&#xd;&#xa;" />
    [junit]     <property name="air.version" value="14.0" />
    [junit]     <property name="ant.file.type" value="file" />
    [junit]     <property name="runtime.setup" value="true" />
    [junit]     <property name="env.JOB_NAME" value="royale-asjs_jsonly" />
    [junit]     <property name="java.vm.info" value="mixed mode" />
    [junit]     <property name="env.BUILD_DISPLAY_NAME" value="#1799" />
    [junit]     <property name="metadata.parser.uptodate" value="true" />
    [junit]     <property name="ant.file.compiler" value="C:\Program Files (x86)\Jenkins\workspace\royale-compiler\compiler\build.xml"
/>
    [junit]     <property name="sun.desktop" value="windows" />
    [junit]     <property name="java.vm.specification.name" value="Java Virtual Machine
Specification" />
    [junit]     <property name="env.JOB_DISPLAY_URL" value="http://apacheroyaleci.westus2.cloudapp.azure.com:8080/job/royale-asjs_jsonly/display/redirect"
/>
    [junit]     <property name="fpdbg" value="${env.FLASHPLAYER_DEBUGGER}" />
    [junit]     <property name="env.BUILD_URL" value="http://apacheroyaleci.westus2.cloudapp.azure.com:8080/job/royale-asjs_jsonly/1799/"
/>
    [junit]     <property name="env.PATHEXT" value=".COM;.EXE;.BAT;.CMD;.VBS;.VBE;.JS;.JSE;.WSF;.WSH;.MSC"
/>
    [junit]     <property name="env.USERDOMAIN_ROAMINGPROFILE" value="ApacheRoyaleCI" />
    [junit]     <property name="fb.release.version" value="4.14.1" />
    [junit]     <property name="env.LOGONSERVER" value="\\ApacheRoyaleCI" />
    [junit]     <property name="src.debug" value="on" />
    [junit]     <property name="java.awt.printerjob" value="sun.awt.windows.WPrinterJob"
/>
    [junit]     <property name="env.HUDSON_SERVER_COOKIE" value="bc2c85f7920ab4ef" />
    [junit]     <property name="env.PUBLIC" value="C:\Users\Public" />
    [junit]     <property name="ant.version" value="Apache Ant(TM) version 1.9.9 compiled
on February 2 2017" />
    [junit]     <property name="env.USERDOMAIN" value="ApacheRoyaleCI" />
    [junit]     <property name="env.PROCESSOR_LEVEL" value="6" />
    [junit]     <property name="manifest.sealed" value="false" />
    [junit]     <property name="env.windir" value="C:\Windows" />
    [junit]     <property name="env.BUILD_NUMBER" value="1799" />
    [junit]     <property name="env.CommonProgramFiles(x86)" value="C:\Program Files (x86)\Common
Files" />
    [junit]     <property name="os.name" value="Windows Server 2016" />
    [junit]     <property name="java.specification.vendor" value="Oracle Corporation" />
    [junit]     <property name="compiler.tests" value="C:/Program Files (x86)/Jenkins/workspace/royale-compiler/compiler/src/test"
/>
    [junit]     <property name="mxmlc.jvm.args" value=" -Xms64m -Xmx384m -ea -Dapple.awt.UIElement=true"
/>
    [junit]     <property name="env.TMP" value="C:\Users\APACHE~1\AppData\Local\Temp\2"
/>
    [junit]     <property name="java.vm.name" value="Java HotSpot(TM) 64-Bit Server VM"
/>
    [junit]     <property name="env.ProgramData" value="C:\ProgramData" />
    [junit]     <property name="env.JOB_URL" value="http://apacheroyaleci.westus2.cloudapp.azure.com:8080/job/royale-asjs_jsonly/"
/>
    [junit]     <property name="env.OS" value="Windows_NT" />
    [junit]     <property name="kit.prefix" value="apache-royale-0.9.4" />
    [junit]     <property name="java.library.path" value="C:\Program Files\Java\jdk1.8.0_152\bin;C:\Windows\Sun\Java\bin;C:\Windows\system32;C:\Windows;C:\apache\apache-ant-1.9.9/bin;C:\apache\apache-ant-1.9.9/bin;C:\Program
Files\Java\jre1.8.0_152\bin;C:\ProgramData\Oracle\Java\javapath;C:\Windows\system32;C:\Windows;C:\Windows\System32\Wbem;C:\Windows\System32\WindowsPowerShell\v1.0\;C:\Program
Files\Git\cmd;C:\Users\apacheroyale\AppData\Local\Microsoft\WindowsApps;C:\apache\apache-ant-1.9.9\bin;&quot;C:\Program
Files\Java\jre1.8.0_152\bin&quot;;." />
    [junit]     <property name="env.HUDSON_URL" value="http://apacheroyaleci.westus2.cloudapp.azure.com:8080/"
/>
    [junit]     <property name="ROYALE_TYPEDEFS_HOME" value="C:\Program Files (x86)\Jenkins\workspace\royale-typedefs"
/>
    [junit]     <property name="ant.java.version" value="1.8" />
    [junit]     <property name="env.JENKINS_URL" value="http://apacheroyaleci.westus2.cloudapp.azure.com:8080/"
/>
    [junit]     <property name="basedir" value="C:\Program Files (x86)\Jenkins\workspace\royale-compiler\compiler\src\test"
/>
    [junit]     <property name="java.class.version" value="52.0" />
    [junit]     <property name="ant.home" value="C:\apache\apache-ant-1.9.9" />
    [junit]     <property name="env.Path" value="C:\apache\apache-ant-1.9.9/bin;C:\apache\apache-ant-1.9.9/bin;C:\Program
Files\Java\jre1.8.0_152\bin;C:\ProgramData\Oracle\Java\javapath;C:\Windows\system32;C:\Windows;C:\Windows\System32\Wbem;C:\Windows\System32\WindowsPowerShell\v1.0\;C:\Program
Files\Git\cmd;C:\Users\apacheroyale\AppData\Local\Microsoft\WindowsApps;C:\apache\apache-ant-1.9.9\bin;&quot;C:\Program
Files\Java\jre1.8.0_152\bin&quot;" />
    [junit]     <property name="browser" value="C:\Program Files\Mozilla Firefox\firefox.exe"
/>
    [junit]     <property name="ant.file.royale-compiler" value="C:\Program Files (x86)\Jenkins\workspace\royale-compiler\build.xml"
/>
    [junit]     <property name="locale" value="en_US" />
    [junit]     <property name="env.GIT_COMMIT" value="31cfb92506236ca67db098d8b852c71cfe191881"
/>
    [junit]     <property name="env.JENKINS_HOME" value="C:\Program Files (x86)\Jenkins"
/>
    [junit]     <property name="env.HOMEDRIVE" value="C:" />
    [junit]     <property name="ant.file.type.royale-compiler" value="file" />
    [junit]     <property name="royale-compiler-exists" value="true" />
    [junit]     <property name="env.RUN_CHANGES_DISPLAY_URL" value="http://apacheroyaleci.westus2.cloudapp.azure.com:8080/job/royale-asjs_jsonly/1799/display/redirect?page=changes"
/>
    [junit]     <property name="manifest.Implementation-Version" value="0.9.4" />
    [junit]     <property name="sun.boot.library.path" value="C:\Program Files\Java\jdk1.8.0_152\jre\bin"
/>
    [junit]     <property name="env.PROCESSOR_REVISION" value="5504" />
    [junit]     <property name="sun.management.compiler" value="HotSpot 64-Bit Tiered Compilers"
/>
    [junit]     <property name="java.awt.graphicsenv" value="sun.awt.Win32GraphicsEnvironment"
/>
    [junit]     <property name="user.variant" value="" />
    [junit]     <property name="release.name" value="Apache Royale" />
    [junit]     <property name="cmc.emitter.uptodate" value="true" />
    [junit]     <property name="jvm.args" value=" -Xms64m -Xmx384m -ea -Dapple.awt.UIElement=true"
/>
    [junit]     <property name="local.d32" value="" />
    [junit]     <property name="base.folder.name" value="<http://apacheroyaleci.westus2.cloudapp.azure.com:8080/job/royale-asjs_jsonly/ws/..">
/>
    [junit]     <property name="ant.project.name" value="compiler.tests" />
    [junit]     <property name="generated.by.match" value=" * Generated by Apache Royale
Compiler" />
    [junit]     <property name="java.vm.specification.version" value="1.8" />
    [junit]     <property name="binary-js.kit" value="apache-royale-0.9.4-bin-js" />
    [junit]     <property name="mxmlc.jar.exists" value="true" />
    [junit]     <property name="awt.toolkit" value="sun.awt.windows.WToolkit" />
    [junit]     <property name="sun.cpu.isalist" value="amd64" />
    [junit]     <property name="ant.file.asjs" value="<http://apacheroyaleci.westus2.cloudapp.azure.com:8080/job/royale-asjs_jsonly/ws/build.xml">
/>
    [junit]     <property name="java.ext.dirs" value="C:\Program Files\Java\jdk1.8.0_152\jre\lib\ext;C:\Windows\Sun\Java\lib\ext"
/>
    [junit]     <property name="os.version" value="10.0" />
    [junit]     <property name="user.home" value="C:\Users\apacheroyale" />
    [junit]     <property name="compiler.font.binaries" value="org/apache/royale/fonts/**"
/>
    [junit]     <property name="java.vm.vendor" value="Oracle Corporation" />
    [junit]     <property name="env.CommonProgramW6432" value="C:\Program Files\Common
Files" />
    [junit]     <property name="royale-typedefs-exists" value="true" />
    [junit]     <property name="env.JAVA_HOME" value="C:\Program Files\Java\jdk1.8.0_152"
/>
    [junit]     <property name="env.ProgramW6432" value="C:\Program Files" />
    [junit]     <property name="manifest.Implementation-Vendor" value="The Apache Software
Foundation" />
    [junit]     <property name="user.dir" value="<http://apacheroyaleci.westus2.cloudapp.azure.com:8080/job/royale-asjs_jsonly/ws/">
/>
    [junit]     <property name="maxmem" value="512" />
    [junit]     <property name="ROYALE_COMPILER_REPO" value="C:\Program Files (x86)\Jenkins\workspace\royale-compiler"
/>
    [junit]     <property name="binary.kit" value="apache-royale-0.9.4-bin-js" />
    [junit]     <property name="release.version" value="0.9.4" />
    [junit]     <property name="css.tree.uptodate" value="true" />
    [junit]     <property name="env._USE_CLASSPATH" value="no" />
    [junit]     <property name="sun.cpu.endian" value="little" />
    [junit]     <property name="compc.jvm.args" value=" -Xms64m -Xmx384m -ea -Dapple.awt.UIElement=true"
/>
    [junit]     <property name="raw.as.tokenizer.uptodate" value="true" />
    [junit]     <property name="env.ALLUSERSPROFILE" value="C:\ProgramData" />
    [junit]     <property name="env.GIT_PREVIOUS_COMMIT" value="076570c0736fb511bb8a775db86cf3efad1561d4"
/>
    [junit]     <property name="env.PROCESSOR_ARCHITECTURE" value="AMD64" />
    [junit]     <property name="asfheader" value=" * Licensed under the Apache License,
Version 2.0 (the &apos;License&apos;);&#xa; * you may not use this file except
in compliance with the License.&#xa; * You may obtain a copy of the License at&#xa;
*&#xa; *     http://www.apache.org/licenses/LICENSE-2.0&#xa; *&#xa; * Unless required
by applicable law or agreed to in writing, software&#xa; * distributed under the License
is distributed on an &apos;AS IS&apos; BASIS,&#xa; * WITHOUT WARRANTIES OR CONDITIONS
OF ANY KIND, either express or implied.&#xa; * See the License for the specific language
governing permissions and&#xa; * limitations under the License.&#xa; *&#xa;" />
    [junit]     <property name="java.vm.version" value="25.152-b16" />
    [junit]     <property name="env.HOMEPATH" value="\Users\apacheroyale" />
    [junit]     <property name="java.class.path" value="C:\apache\apache-ant-1.9.9\lib\ant-launcher.jar;C:\apache\apache-ant-1.9.9\lib\ant-antlr.jar;C:\apache\apache-ant-1.9.9\lib\ant-apache-bcel.jar;C:\apache\apache-ant-1.9.9\lib\ant-apache-bsf.jar;C:\apache\apache-ant-1.9.9\lib\ant-apache-log4j.jar;C:\apache\apache-ant-1.9.9\lib\ant-apache-oro.jar;C:\apache\apache-ant-1.9.9\lib\ant-apache-regexp.jar;C:\apache\apache-ant-1.9.9\lib\ant-apache-resolver.jar;C:\apache\apache-ant-1.9.9\lib\ant-apache-xalan2.jar;C:\apache\apache-ant-1.9.9\lib\ant-commons-logging.jar;C:\apache\apache-ant-1.9.9\lib\ant-commons-net.jar;C:\apache\apache-ant-1.9.9\lib\ant-jai.jar;C:\apache\apache-ant-1.9.9\lib\ant-javamail.jar;C:\apache\apache-ant-1.9.9\lib\ant-jdepend.jar;C:\apache\apache-ant-1.9.9\lib\ant-jmf.jar;C:\apache\apache-ant-1.9.9\lib\ant-jsch.jar;C:\apache\apache-ant-1.9.9\lib\ant-junit.jar;C:\apache\apache-ant-1.9.9\lib\ant-junit4.jar;C:\apache\apache-ant-1.9.9\lib\ant-launcher.jar;C:\apache\apache-ant-1.9.9\lib\ant-netrexx.jar;C:\apache\apache-ant-1.9.9\lib\ant-swing.jar;C:\apache\apache-ant-1.9.9\lib\ant-testutil.jar;C:\apache\apache-ant-1.9.9\lib\ant.jar;C:\Program
Files\Java\jdk1.8.0_152\lib\tools.jar" />
    [junit]     <property name="DSTAMP" value="20181025" />
    [junit]     <property name="env.ROYALE_COMPILER_HOME" value="C:\Program Files (x86)\Jenkins\workspace\royale-compiler\compiler"
/>
    [junit]     <property name="ant.library.dir" value="C:\apache\apache-ant-1.9.9\lib"
/>
    [junit]     <property name="os.arch" value="amd64" />
    [junit]     <property name="unknown.tree.handler.patterns.uptodate" value="true" />
    [junit]     <property name="javac.deprecation" value="false" />
    [junit]     <property name="raw.asdoc.tokenizer.uptodate" value="true" />
    [junit]     <property name="strict" value="true" />
    [junit]     <property name="env.SESSIONNAME" value="RDP-Tcp#60" />
    [junit]     <property name="sun.java.launcher" value="SUN_STANDARD" />
    [junit]     <property name="env.CommonProgramFiles" value="C:\Program Files\Common
Files" />
    [junit]     <property name="env.BUILD_ID" value="1799" />
    [junit]     <property name="manifest.Implementation-Title" value="Apache Royale SDK"
/>
    [junit]     <property name="ant.core.lib" value="C:\apache\apache-ant-1.9.9\lib\ant.jar"
/>
    [junit]     <property name="env.ProgramFiles" value="C:\Program Files" />
    [junit]     <property name="java.vm.specification.vendor" value="Oracle Corporation"
/>
    [junit]     <property name="TSTAMP" value="1141" />
    [junit]     <property name="build.version" value="0.9.4.20181025" />
    [junit]     <property name="file.separator" value="\" />
    [junit]     <property name="env.GIT_BRANCH" value="origin/develop" />
    [junit]     <property name="java.runtime.version" value="1.8.0_152-b16" />
    [junit]     <property name="env.ANT_CMD_LINE_ARGS" value=" &quot;-DROYALE_COMPILER_REPO=C:\Program
Files (x86)\Jenkins\workspace\royale-compiler&quot; &quot;-Denv.ROYALE_TRANSPILER_HOME=C:\Program
Files (x86)\Jenkins\workspace\royale-compiler\compiler-jx&quot; &quot;-Dbrowser=C:\Program
Files\Mozilla Firefox\firefox.exe&quot; &quot;-DROYALE_TYPEDEFS_HOME=C:\Program Files
(x86)\Jenkins\workspace\royale-typedefs&quot; -Dbuild.noprompt true -Dplayerglobal.version
11.7 &quot;-Denv.ROYALE_COMPILER_HOME=C:\Program Files (x86)\Jenkins\workspace\royale-compiler\compiler&quot;
release create-SHA-512 create-SHA-512-jsonly" />
    [junit]     <property name="sun.boot.class.path" value="C:\Program Files\Java\jdk1.8.0_152\jre\lib\resources.jar;C:\Program
Files\Java\jdk1.8.0_152\jre\lib\rt.jar;C:\Program Files\Java\jdk1.8.0_152\jre\lib\sunrsasign.jar;C:\Program
Files\Java\jdk1.8.0_152\jre\lib\jsse.jar;C:\Program Files\Java\jdk1.8.0_152\jre\lib\jce.jar;C:\Program
Files\Java\jdk1.8.0_152\jre\lib\charsets.jar;C:\Program Files\Java\jdk1.8.0_152\jre\lib\jfr.jar;C:\Program
Files\Java\jdk1.8.0_152\jre\classes" />
    [junit]     <property name="ant.file.type.compiler" value="file" />
    [junit]     <property name="env.ComSpec" value="C:\Windows\system32\cmd.exe" />
    [junit]     <property name="royale" value="C:/Program Files (x86)/Jenkins/workspace/royale-compiler/compiler"
/>
    [junit]     <property name="env.WORKSPACE" value="<http://apacheroyaleci.westus2.cloudapp.azure.com:8080/job/royale-asjs_jsonly/ws/">
/>
    [junit]     <property name="staging-dir" value="<http://apacheroyaleci.westus2.cloudapp.azure.com:8080/job/royale-asjs_jsonly/ws/temp/royale-asjs">
/>
    [junit]     <property name="source.kit" value="apache-royale-0.9.4-src" />
    [junit]     <property name="env.TEMP" value="C:\Users\APACHE~1\AppData\Local\Temp\2"
/>
    [junit]     <property name="env.GIT_PREVIOUS_SUCCESSFUL_COMMIT" value="076570c0736fb511bb8a775db86cf3efad1561d4"
/>
    [junit]     <property name="manifest.Implementation-Vendor-Id" value="org.apache" />
    [junit]     <property name="env.ANT_HOME" value="C:\apache\apache-ant-1.9.9" />
    [junit]     <property name="user.country" value="US" />
    [junit]     <property name="raw.mxml.tokenizer.uptodate" value="true" />
    [junit]     <property name="env.EXECUTOR_NUMBER" value="0" />
    [junit]     <property name="javadoc.params" value="" />
    [junit]     <property name="env.CLIENTNAME" value="aharui-osx" />
    [junit]     <property name="compiler-externc" value="C:/Program Files (x86)/Jenkins/workspace/royale-compiler/compiler/../compiler-externc"
/>
    [junit]     <property name="env.JOB_BASE_NAME" value="royale-asjs_jsonly" />
    [junit]     <property name="java.vendor" value="Oracle Corporation" />
    [junit]     <property name="ROYALE_HOME" value="<http://apacheroyaleci.westus2.cloudapp.azure.com:8080/job/royale-asjs_jsonly/ws/">
/>
    [junit]     <property name="ant.file.type.asjs" value="file" />
    [junit]     <property name="env.PSModulePath" value="C:\Program Files\WindowsPowerShell\Modules;C:\Windows\system32\WindowsPowerShell\v1.0\Modules"
/>
    [junit]     <property name="env.HUDSON_COOKIE" value="9f7b7bcf-89e7-4a40-8af0-b71149c43940"
/>
    [junit]     <property name="java.specification.version" value="1.8" />
    [junit]     <property name="sun.arch.data.model" value="64" />
    [junit]   </properties>
    [junit]   <testcase classname="org.apache.royale.compiler.internal.tree.mxml.Batch-With-Multiple-Tests"
name="ASDateTests_day" time="0.001">
    [junit]     <error message="Forked Java VM exited abnormally. Please note the time
in the report does not reflect the time until the VM exit." type="junit.framework.AssertionFailedError">junit.framework.AssertionFailedError:
Forked Java VM exited abnormally. Please note the time in the report does not reflect the
time until the VM exit.
    [junit] </error>
    [junit]   </testcase>
    [junit] </testsuite>
    [junit] Running org.apache.royale.compiler.internal.tree.mxml.Batch-With-Multiple-Tests
    [junit] Tests run: 1, Failures: 0, Errors: 1, Skipped: 0, Time elapsed: 0 sec

BUILD FAILED
<http://apacheroyaleci.westus2.cloudapp.azure.com:8080/job/royale-asjs_jsonly/ws/build.xml>:1943:
The following error occurred while executing this line:
<http://apacheroyaleci.westus2.cloudapp.azure.com:8080/job/royale-asjs_jsonly/ws/build.xml>:2030:
The following error occurred while executing this line:
C:\Program Files (x86)\Jenkins\workspace\royale-compiler\build.xml:80: The following error
occurred while executing this line:
C:\Program Files (x86)\Jenkins\workspace\royale-compiler\compiler\build.xml:711: The following
error occurred while executing this line:
C:\Program Files (x86)\Jenkins\workspace\royale-compiler\compiler\src\test\build.xml:307:
Tests failed (crashed)

Total time: 29 minutes 42 seconds
Picked up JAVA_TOOL_OPTIONS: -Dfile.encoding=UTF-8 -Xmx512m
Build step 'Invoke Ant' marked build as failure
Archiving artifacts

Mime
View raw message