royale-dev mailing list archives

Site index · List index
Message view « Date » · « Thread »
Top « Date » · « Thread »
From apacheroyal...@gmail.com
Subject Build failed in Jenkins: royale-asjs_jsonly #1814
Date Sat, 27 Oct 2018 15:28:42 GMT
See <http://apacheroyaleci.westus2.cloudapp.azure.com:8080/job/royale-asjs_jsonly/1814/display/redirect?page=changes>

Changes:

[carlosrovira] fix assignement

[carlosrovira] fix unreachable code (return null;) in mx ArrayList

------------------------------------------
[...truncated 231.44 KB...]
     [echo] ${INFO_DOWNLOADING_FILE_FROM}
     [echo] basedir is C:\Program Files (x86)\Jenkins\workspace\royale-compiler\compiler\src\main\resources
     [echo] ROYALE_COMPILER_HOME is C:\Program Files (x86)\Jenkins\workspace\royale-compiler\compiler
     [echo] ROYALE_COMPILER_HOME is C:\Program Files (x86)\Jenkins\workspace\royale-compiler\compiler

download-apache-license:
     [echo] basedir is C:\Program Files (x86)\Jenkins\workspace\royale-compiler\compiler\src\main\resources
     [echo] ROYALE_COMPILER_HOME is C:\Program Files (x86)\Jenkins\workspace\royale-compiler\compiler
     [echo] ROYALE_COMPILER_HOME is C:\Program Files (x86)\Jenkins\workspace\royale-compiler\compiler

download-other-license:
      [get] Getting: https://www.7-zip.org/sdk.html
      [get] To: C:\Program Files (x86)\Jenkins\workspace\royale-compiler\compiler\lib\external\lzma-sdk-LICENSE.html
     [echo] basedir is C:\Program Files (x86)\Jenkins\workspace\royale-compiler\compiler\src\main\resources
     [echo] ROYALE_COMPILER_HOME is C:\Program Files (x86)\Jenkins\workspace\royale-compiler\compiler
     [echo] ROYALE_COMPILER_HOME is C:\Program Files (x86)\Jenkins\workspace\royale-compiler\compiler

double-check-file:
     [echo] ${env.ROYALE_DOWNLOAD_CACHE}
     [echo] Need file: ${still_no_file}

get-from-cache-if-needed:
     [echo] basedir is C:\Program Files (x86)\Jenkins\workspace\royale-compiler\compiler\src\main\resources
     [echo] ROYALE_COMPILER_HOME is C:\Program Files (x86)\Jenkins\workspace\royale-compiler\compiler
     [echo] ROYALE_COMPILER_HOME is C:\Program Files (x86)\Jenkins\workspace\royale-compiler\compiler

fail-if-not-found:
     [echo] basedir is C:\Program Files (x86)\Jenkins\workspace\royale-compiler\compiler\src\main\resources
     [echo] ROYALE_COMPILER_HOME is C:\Program Files (x86)\Jenkins\workspace\royale-compiler\compiler
     [echo] ROYALE_COMPILER_HOME is C:\Program Files (x86)\Jenkins\workspace\royale-compiler\compiler

download-dependency-jar:
     [echo] basedir is C:\Program Files (x86)\Jenkins\workspace\royale-compiler\compiler\src\main\resources
     [echo] ROYALE_COMPILER_HOME is C:\Program Files (x86)\Jenkins\workspace\royale-compiler\compiler
     [echo] ROYALE_COMPILER_HOME is C:\Program Files (x86)\Jenkins\workspace\royale-compiler\compiler

download-dependency-zip:
     [echo] basedir is C:\Program Files (x86)\Jenkins\workspace\royale-compiler\compiler\src\main\resources
     [echo] ROYALE_COMPILER_HOME is C:\Program Files (x86)\Jenkins\workspace\royale-compiler\compiler
     [echo] ROYALE_COMPILER_HOME is C:\Program Files (x86)\Jenkins\workspace\royale-compiler\compiler

check-cache:

download-zip:
     [echo] basedir is C:\Program Files (x86)\Jenkins\workspace\royale-compiler\compiler\src\main\resources
     [echo] ROYALE_COMPILER_HOME is C:\Program Files (x86)\Jenkins\workspace\royale-compiler\compiler
     [echo] ROYALE_COMPILER_HOME is C:\Program Files (x86)\Jenkins\workspace\royale-compiler\compiler

get-if-not-cached:
      [get] Getting: http://www.java2s.com/Code/JarDownload/lzma/lzma-9.20.jar.zip
      [get] To: C:\Program Files (x86)\Jenkins\workspace\royale-compiler\compiler\in\lzma-9.20.jar.zip
     [echo] basedir is C:\Program Files (x86)\Jenkins\workspace\royale-compiler\compiler\src\main\resources
     [echo] ROYALE_COMPILER_HOME is C:\Program Files (x86)\Jenkins\workspace\royale-compiler\compiler
     [echo] ROYALE_COMPILER_HOME is C:\Program Files (x86)\Jenkins\workspace\royale-compiler\compiler

double-check-file:
     [echo] ${env.ROYALE_DOWNLOAD_CACHE}
     [echo] Need file: ${still_no_file}

get-from-cache-if-needed:
     [echo] basedir is C:\Program Files (x86)\Jenkins\workspace\royale-compiler\compiler\src\main\resources
     [echo] ROYALE_COMPILER_HOME is C:\Program Files (x86)\Jenkins\workspace\royale-compiler\compiler
     [echo] ROYALE_COMPILER_HOME is C:\Program Files (x86)\Jenkins\workspace\royale-compiler\compiler

fail-if-not-found:
     [echo] basedir is C:\Program Files (x86)\Jenkins\workspace\royale-compiler\compiler\src\main\resources
     [echo] ROYALE_COMPILER_HOME is C:\Program Files (x86)\Jenkins\workspace\royale-compiler\compiler
     [echo] ROYALE_COMPILER_HOME is C:\Program Files (x86)\Jenkins\workspace\royale-compiler\compiler

check-sum:
     [echo] basedir is C:\Program Files (x86)\Jenkins\workspace\royale-compiler\compiler\src\main\resources
     [echo] ROYALE_COMPILER_HOME is C:\Program Files (x86)\Jenkins\workspace\royale-compiler\compiler
     [echo] ROYALE_COMPILER_HOME is C:\Program Files (x86)\Jenkins\workspace\royale-compiler\compiler

put-in-cache:
     [echo] basedir is C:\Program Files (x86)\Jenkins\workspace\royale-compiler\compiler\src\main\resources
     [echo] ROYALE_COMPILER_HOME is C:\Program Files (x86)\Jenkins\workspace\royale-compiler\compiler
     [echo] ROYALE_COMPILER_HOME is C:\Program Files (x86)\Jenkins\workspace\royale-compiler\compiler

copy-if-cached:
     [echo] basedir is C:\Program Files (x86)\Jenkins\workspace\royale-compiler\compiler\src\main\resources
     [echo] ROYALE_COMPILER_HOME is C:\Program Files (x86)\Jenkins\workspace\royale-compiler\compiler
     [echo] ROYALE_COMPILER_HOME is C:\Program Files (x86)\Jenkins\workspace\royale-compiler\compiler

untar-file:
     [echo] basedir is C:\Program Files (x86)\Jenkins\workspace\royale-compiler\compiler\src\main\resources
     [echo] ROYALE_COMPILER_HOME is C:\Program Files (x86)\Jenkins\workspace\royale-compiler\compiler
     [echo] ROYALE_COMPILER_HOME is C:\Program Files (x86)\Jenkins\workspace\royale-compiler\compiler

unzip-file:
    [unzip] Expanding: C:\Program Files (x86)\Jenkins\workspace\royale-compiler\compiler\in\lzma-9.20.jar.zip
into C:\Program Files (x86)\Jenkins\workspace\royale-compiler\compiler\in\temp
     [echo] basedir is C:\Program Files (x86)\Jenkins\workspace\royale-compiler\compiler\src\main\resources
     [echo] ROYALE_COMPILER_HOME is C:\Program Files (x86)\Jenkins\workspace\royale-compiler\compiler
     [echo] ROYALE_COMPILER_HOME is C:\Program Files (x86)\Jenkins\workspace\royale-compiler\compiler

copy-downloaded-jar:
     [copy] Copying 1 file to C:\Program Files (x86)\Jenkins\workspace\royale-compiler\compiler\lib\external
     [copy] Copying C:\Program Files (x86)\Jenkins\workspace\royale-compiler\compiler\in\temp\lzma-9.20.jar
to C:\Program Files (x86)\Jenkins\workspace\royale-compiler\compiler\lib\external\lzma-sdk.jar
     [echo] basedir is C:\Program Files (x86)\Jenkins\workspace\royale-compiler\compiler\src\main\resources
     [echo] ROYALE_COMPILER_HOME is C:\Program Files (x86)\Jenkins\workspace\royale-compiler\compiler
     [echo] ROYALE_COMPILER_HOME is C:\Program Files (x86)\Jenkins\workspace\royale-compiler\compiler

check-dependency:
     [echo] checking for C:\Program Files (x86)\Jenkins\workspace\royale-compiler\compiler/lib/external//flex-tool-api.jar

download-dependency:
     [echo] basedir is C:\Program Files (x86)\Jenkins\workspace\royale-compiler\compiler\src\main\resources
     [echo] ROYALE_COMPILER_HOME is C:\Program Files (x86)\Jenkins\workspace\royale-compiler\compiler
     [echo] ROYALE_COMPILER_HOME is C:\Program Files (x86)\Jenkins\workspace\royale-compiler\compiler

echo-project-jar:
   [delete] Deleting: C:\Program Files (x86)\Jenkins\workspace\royale-compiler\compiler\src\main\resources\project.properties
     [echo] ${INFO_DOWNLOADING_FILE_FROM}
     [echo] basedir is C:\Program Files (x86)\Jenkins\workspace\royale-compiler\compiler\src\main\resources
     [echo] ROYALE_COMPILER_HOME is C:\Program Files (x86)\Jenkins\workspace\royale-compiler\compiler
     [echo] ROYALE_COMPILER_HOME is C:\Program Files (x86)\Jenkins\workspace\royale-compiler\compiler

download-apache-license:
      [get] Getting: http://www.apache.org/licenses/LICENSE-2.0
      [get] To: C:\Program Files (x86)\Jenkins\workspace\royale-compiler\compiler\lib\external\flex-tool-api-LICENSE.html
     [echo] basedir is C:\Program Files (x86)\Jenkins\workspace\royale-compiler\compiler\src\main\resources
     [echo] ROYALE_COMPILER_HOME is C:\Program Files (x86)\Jenkins\workspace\royale-compiler\compiler
     [echo] ROYALE_COMPILER_HOME is C:\Program Files (x86)\Jenkins\workspace\royale-compiler\compiler

double-check-file:
     [echo] ${env.ROYALE_DOWNLOAD_CACHE}
     [echo] Need file: ${still_no_file}

get-from-cache-if-needed:
     [echo] basedir is C:\Program Files (x86)\Jenkins\workspace\royale-compiler\compiler\src\main\resources
     [echo] ROYALE_COMPILER_HOME is C:\Program Files (x86)\Jenkins\workspace\royale-compiler\compiler
     [echo] ROYALE_COMPILER_HOME is C:\Program Files (x86)\Jenkins\workspace\royale-compiler\compiler

fail-if-not-found:
     [echo] basedir is C:\Program Files (x86)\Jenkins\workspace\royale-compiler\compiler\src\main\resources
     [echo] ROYALE_COMPILER_HOME is C:\Program Files (x86)\Jenkins\workspace\royale-compiler\compiler
     [echo] ROYALE_COMPILER_HOME is C:\Program Files (x86)\Jenkins\workspace\royale-compiler\compiler

download-other-license:
     [echo] basedir is C:\Program Files (x86)\Jenkins\workspace\royale-compiler\compiler\src\main\resources
     [echo] ROYALE_COMPILER_HOME is C:\Program Files (x86)\Jenkins\workspace\royale-compiler\compiler
     [echo] ROYALE_COMPILER_HOME is C:\Program Files (x86)\Jenkins\workspace\royale-compiler\compiler

download-dependency-jar:
     [echo] basedir is C:\Program Files (x86)\Jenkins\workspace\royale-compiler\compiler\src\main\resources
     [echo] ROYALE_COMPILER_HOME is C:\Program Files (x86)\Jenkins\workspace\royale-compiler\compiler
     [echo] ROYALE_COMPILER_HOME is C:\Program Files (x86)\Jenkins\workspace\royale-compiler\compiler

check-cache:

download-jar:
     [echo] basedir is C:\Program Files (x86)\Jenkins\workspace\royale-compiler\compiler\src\main\resources
     [echo] ROYALE_COMPILER_HOME is C:\Program Files (x86)\Jenkins\workspace\royale-compiler\compiler
     [echo] ROYALE_COMPILER_HOME is C:\Program Files (x86)\Jenkins\workspace\royale-compiler\compiler

get-if-not-cached:
      [get] Getting: https://repo1.maven.org/maven2/org/apache/flex/flex-tool-api/1.0.0/flex-tool-api-1.0.0.jar
      [get] To: C:\Program Files (x86)\Jenkins\workspace\royale-compiler\compiler\lib\external\flex-tool-api.jar
     [echo] basedir is C:\Program Files (x86)\Jenkins\workspace\royale-compiler\compiler\src\main\resources
     [echo] ROYALE_COMPILER_HOME is C:\Program Files (x86)\Jenkins\workspace\royale-compiler\compiler
     [echo] ROYALE_COMPILER_HOME is C:\Program Files (x86)\Jenkins\workspace\royale-compiler\compiler

double-check-file:
     [echo] ${env.ROYALE_DOWNLOAD_CACHE}
     [echo] Need file: ${still_no_file}

get-from-cache-if-needed:
     [echo] basedir is C:\Program Files (x86)\Jenkins\workspace\royale-compiler\compiler\src\main\resources
     [echo] ROYALE_COMPILER_HOME is C:\Program Files (x86)\Jenkins\workspace\royale-compiler\compiler
     [echo] ROYALE_COMPILER_HOME is C:\Program Files (x86)\Jenkins\workspace\royale-compiler\compiler

fail-if-not-found:
     [echo] basedir is C:\Program Files (x86)\Jenkins\workspace\royale-compiler\compiler\src\main\resources
     [echo] ROYALE_COMPILER_HOME is C:\Program Files (x86)\Jenkins\workspace\royale-compiler\compiler
     [echo] ROYALE_COMPILER_HOME is C:\Program Files (x86)\Jenkins\workspace\royale-compiler\compiler

check-sum:
     [echo] basedir is C:\Program Files (x86)\Jenkins\workspace\royale-compiler\compiler\src\main\resources
     [echo] ROYALE_COMPILER_HOME is C:\Program Files (x86)\Jenkins\workspace\royale-compiler\compiler
     [echo] ROYALE_COMPILER_HOME is C:\Program Files (x86)\Jenkins\workspace\royale-compiler\compiler

put-in-cache:
     [echo] basedir is C:\Program Files (x86)\Jenkins\workspace\royale-compiler\compiler\src\main\resources
     [echo] ROYALE_COMPILER_HOME is C:\Program Files (x86)\Jenkins\workspace\royale-compiler\compiler
     [echo] ROYALE_COMPILER_HOME is C:\Program Files (x86)\Jenkins\workspace\royale-compiler\compiler

copy-if-cached:
     [echo] basedir is C:\Program Files (x86)\Jenkins\workspace\royale-compiler\compiler\src\main\resources
     [echo] ROYALE_COMPILER_HOME is C:\Program Files (x86)\Jenkins\workspace\royale-compiler\compiler
     [echo] ROYALE_COMPILER_HOME is C:\Program Files (x86)\Jenkins\workspace\royale-compiler\compiler

download-dependency-zip:

main:

IASNodeAdapter:
    [mkdir] Created dir: C:\Program Files (x86)\Jenkins\workspace\royale-compiler\compiler-jburg-types\target\classes
    [javac] Compiling 1 source file to C:\Program Files (x86)\Jenkins\workspace\royale-compiler\compiler-jburg-types\target\classes
    [javac] warning: [options] bootstrap class path not set in conjunction with -source 1.5
    [javac] warning: [options] source value 1.5 is obsolete and will be removed in a future
release
    [javac] warning: [options] target value 1.5 is obsolete and will be removed in a future
release
    [javac] warning: [options] To suppress warnings about obsolete options, use -Xlint:-options.
    [javac] 4 warnings

main:

compiler.test.downloads.cache:

compiler.test.downloads:

prepare:

junit-jar-check:

junit-jar:
     [echo] Obtaining lib/external/junit-4.10.jar

junit-jar-check:

junit-download-jar:

download-jar:
      [get] Getting: http://search.maven.org/remotecontent?filepath=junit/junit/4.10/junit-4.10.jar
      [get] To: C:\Program Files (x86)\Jenkins\workspace\royale-compiler\compiler\lib\external\junit-4.10.jar
      [get] Error opening connection java.io.IOException: Server returned HTTP response code:
503 for URL: http://search.maven.org/remotecontent?filepath=junit/junit/4.10/junit-4.10.jar
      [get] Error opening connection java.io.IOException: Server returned HTTP response code:
503 for URL: http://search.maven.org/remotecontent?filepath=junit/junit/4.10/junit-4.10.jar
      [get] Error opening connection java.io.IOException: Server returned HTTP response code:
503 for URL: http://search.maven.org/remotecontent?filepath=junit/junit/4.10/junit-4.10.jar
      [get] Can't get http://search.maven.org/remotecontent?filepath=junit/junit/4.10/junit-4.10.jar
to C:\Program Files (x86)\Jenkins\workspace\royale-compiler\compiler\lib\external\junit-4.10.jar

double-check-file:
     [echo] Need file: ${still_no_file}

get-from-cache-if-needed:

fail-if-not-found:

BUILD FAILED
<http://apacheroyaleci.westus2.cloudapp.azure.com:8080/job/royale-asjs_jsonly/ws/build.xml>:2030:
The following error occurred while executing this line:
C:\Program Files (x86)\Jenkins\workspace\royale-compiler\build.xml:65: The following error
occurred while executing this line:
C:\Program Files (x86)\Jenkins\workspace\royale-compiler\compiler-test-utils\build.xml:66:
The following error occurred while executing this line:
C:\Program Files (x86)\Jenkins\workspace\royale-compiler\compiler\src\test\downloads.xml:127:
The following error occurred while executing this line:
C:\Program Files (x86)\Jenkins\workspace\royale-compiler\compiler\src\test\downloads.xml:132:
The following error occurred while executing this line:
C:\Program Files (x86)\Jenkins\workspace\royale-compiler\compiler\src\test\downloads.xml:97:
The following error occurred while executing this line:
C:\Program Files (x86)\Jenkins\workspace\royale-compiler\compiler\src\test\downloads.xml:197:
C:/Program Files (x86)/Jenkins/workspace/royale-compiler/compiler/lib/external/junit-4.10.jar
could not be downloaded or found in cache

Total time: 25 minutes 40 seconds
Picked up JAVA_TOOL_OPTIONS: -Dfile.encoding=UTF-8 -Xmx512m
Build step 'Invoke Ant' marked build as failure
Archiving artifacts

Mime
View raw message