royale-dev mailing list archives

Site index · List index
Message view « Date » · « Thread »
Top « Date » · « Thread »
From apacheroyal...@gmail.com
Subject Build failed in Jenkins: royale-asjs #1307
Date Wed, 12 Sep 2018 02:47:26 GMT
See <http://apacheroyaleci.westus2.cloudapp.azure.com:8080/job/royale-asjs/1307/display/redirect>

------------------------------------------
[...truncated 1.04 MB...]
clean:

check-for-tests:

clean-tests:

clean:

check-for-tests:

clean-tests:

clean:

check-for-tests:

clean-tests:

clean:

check-for-tests:

clean-tests:

clean:

thirdparty-downloads:

prepare:
    [mkdir] Created dir: <http://apacheroyaleci.westus2.cloudapp.azure.com:8080/job/royale-asjs/ws/frameworks/js/libs>
    [mkdir] Created dir: <http://apacheroyaleci.westus2.cloudapp.azure.com:8080/job/royale-asjs/ws/frameworks/libs>

check-playerglobal:

fake-playerglobal:

check-airglobal:

fake-airglobal:

compile:

Language:

clean:

check-for-tests:

clean-tests:

check-compiler-home:

check-transpiler-home:

check-compiler:

compile:
     [echo] Compiling libs/Language.swc
     [echo] ROYALE_HOME: <http://apacheroyaleci.westus2.cloudapp.azure.com:8080/job/royale-asjs/ws/>
     [echo] ROYALE_SWF_COMPILER_HOME: <http://apacheroyaleci.westus2.cloudapp.azure.com:8080/job/royale-asjs/ws/>
     [echo] ROYALE_COMPILER_HOME: <http://apacheroyaleci.westus2.cloudapp.azure.com:8080/job/royale-asjs/ws/js>
     [java] args:
     [java] +royalelib=<http://apacheroyaleci.westus2.cloudapp.azure.com:8080/job/royale-asjs/ws/frameworks>
     [java] +playerglobal.version=11.7
     [java] +env.AIR_HOME=C:\adobe\air\4.0\AdobeAIRSDK
     [java] -compiler.strict-xml=true
     [java] -compiler.targets=SWF,JSRoyale
     [java] -output=<http://apacheroyaleci.westus2.cloudapp.azure.com:8080/job/royale-asjs/ws/frameworks/projects/Language/target/Language.swc>
     [java] -load-config=<http://apacheroyaleci.westus2.cloudapp.azure.com:8080/job/royale-asjs/ws/frameworks/projects/Language/src/main/config/compile-swf-config.xml>
     [java] -js-load-config=<http://apacheroyaleci.westus2.cloudapp.azure.com:8080/job/royale-asjs/ws/frameworks/js-config.xml>
     [java] -js-load-config+=<http://apacheroyaleci.westus2.cloudapp.azure.com:8080/job/royale-asjs/ws/frameworks/projects/Language/../../js/projects/LanguageJS/src/main/config/compile-js-config.xml>
     [java] target:SWF
     [java] target:JSRoyale
     [java] COMPC
     [java] Loading configuration: <http://apacheroyaleci.westus2.cloudapp.azure.com:8080/job/royale-asjs/ws/frameworks/projects/Language/src/main/config/compile-swf-config.xml>
     [java] 
     [java] 3045 bytes written to <http://apacheroyaleci.westus2.cloudapp.azure.com:8080/job/royale-asjs/ws/frameworks/projects/Language/target/Language.swc>
in 1.403 seconds
     [java] COMPCJSCRoyale
     [java] Copy library.swf
     [java] Compiling file: Namespace
     [java] Writing file: js\out\Namespace.js
     [java] Compiling file: org.apache.royale.language.string.search
     [java] Writing file: js\out\org\apache\royale\language\string\search.js
     [java] Compiling file: org.apache.royale.utils.Language
     [java] Found ignorable: goog.bind
     [java] Found ignorable: goog.global
     [java] Writing file: js\out\org\apache\royale\utils\Language.js
     [java] Compiling file: org.apache.royale.language.string.match
     [java] Writing file: js\out\org\apache\royale\language\string\match.js
     [java] Compiling file: LanguageClasses
     [java] Writing file: js\out\LanguageClasses.js
     [java] Compiling file: QName
     [java] Writing file: js\out\QName.js
     [java] 4.2612297 seconds
     [java] Picked up JAVA_TOOL_OPTIONS: -Dfile.encoding=UTF-8 -Xmx512m

compile-js:
   [delete] Deleting: <http://apacheroyaleci.westus2.cloudapp.azure.com:8080/job/royale-asjs/ws/frameworks/js/projects/LanguageJS/LanguageJS.swc.properties>

clean:

check-compiler-home:

check-transpiler-home:

check-compiler:

compile:
     [echo] Cross-compiling LanguageJS.swc
     [echo] ROYALE_COMPILER_HOME: <http://apacheroyaleci.westus2.cloudapp.azure.com:8080/job/royale-asjs/ws/js>
    [mkdir] Created dir: <http://apacheroyaleci.westus2.cloudapp.azure.com:8080/job/royale-asjs/ws/frameworks/js/projects/LanguageJS/target/generated-sources/royale>
     [java] args:
     [java] +royalelib=<http://apacheroyaleci.westus2.cloudapp.azure.com:8080/job/royale-asjs/ws/frameworks>
     [java] -compiler.strict-xml=true
     [java] -compiler.targets=SWF,JSRoyale
     [java] -output=<http://apacheroyaleci.westus2.cloudapp.azure.com:8080/job/royale-asjs/ws/frameworks/js/projects/LanguageJS/target/LanguageJS.swc>
     [java] -load-config=<http://apacheroyaleci.westus2.cloudapp.azure.com:8080/job/royale-asjs/ws/frameworks/js-config.xml>
     [java] -load-config+=<http://apacheroyaleci.westus2.cloudapp.azure.com:8080/job/royale-asjs/ws/frameworks/js/projects/LanguageJS/src/main/config/compile-js-config.xml>
     [java] target:SWF
     [java] target:JSRoyale
     [java] COMPC
     [java] Loading configuration: <http://apacheroyaleci.westus2.cloudapp.azure.com:8080/job/royale-asjs/ws/frameworks/js-config.xml>
     [java] Loading configuration: <http://apacheroyaleci.westus2.cloudapp.azure.com:8080/job/royale-asjs/ws/frameworks/js/projects/LanguageJS/src/main/config/compile-js-config.xml>
     [java] 
     [java] 9545 bytes written to <http://apacheroyaleci.westus2.cloudapp.azure.com:8080/job/royale-asjs/ws/frameworks/js/projects/LanguageJS/target/LanguageJS.swc>
in 2.475 seconds
     [java] COMPCJSCRoyale
     [java] Copy library.swf
     [java] Compiling file: Namespace
     [java] Writing file: js\out\Namespace.js
     [java] Compiling file: org.apache.royale.language.string.search
     [java] Writing file: js\out\org\apache\royale\language\string\search.js
     [java] Compiling file: org.apache.royale.utils.Language
     [java] Found ignorable: goog.bind
     [java] Found ignorable: goog.global
     [java] Writing file: js\out\org\apache\royale\utils\Language.js
     [java] Compiling file: org.apache.royale.language.string.match
     [java] Writing file: js\out\org\apache\royale\language\string\match.js
     [java] Compiling file: LanguageClasses
     [java] Writing file: js\out\LanguageClasses.js
     [java] Compiling file: QName
     [java] Writing file: js\out\QName.js
     [java] 5.3874449 seconds
     [java] Picked up JAVA_TOOL_OPTIONS: -Dfile.encoding=UTF-8 -Xmx512m
     [copy] Copying 1 file to <http://apacheroyaleci.westus2.cloudapp.azure.com:8080/job/royale-asjs/ws/frameworks/js/libs>

main:

copy-swc:
     [copy] Copying 1 file to <http://apacheroyaleci.westus2.cloudapp.azure.com:8080/job/royale-asjs/ws/frameworks/libs>

check-for-tests:

test:

main:

Testing:

clean:

check-for-tests:

clean-tests:

clean:

check-compiler-home:

check-transpiler-home:

check-compiler:

compile:
     [echo] Compiling libs/Testing.swc
     [echo] FLEX_HOME: <http://apacheroyaleci.westus2.cloudapp.azure.com:8080/job/royale-asjs/ws/>
     [echo] ROYALE_COMPILER_HOME: <http://apacheroyaleci.westus2.cloudapp.azure.com:8080/job/royale-asjs/ws/js>
     [echo] FLEXUNIT_HOME: <http://apacheroyaleci.westus2.cloudapp.azure.com:8080/job/royale-asjs/ws/in/flexunit>
     [java] args:
     [java] +royalelib=<http://apacheroyaleci.westus2.cloudapp.azure.com:8080/job/royale-asjs/ws/frameworks>
     [java] -library-path+=<http://apacheroyaleci.westus2.cloudapp.azure.com:8080/job/royale-asjs/ws/in/flexunit/flexunit>
     [java] +playerglobal.version=11.7
     [java] +env.AIR_HOME=C:\adobe\air\4.0\AdobeAIRSDK
     [java] -compiler.strict-xml=true
     [java] -compiler.targets=SWF,JSRoyale
     [java] -output=<http://apacheroyaleci.westus2.cloudapp.azure.com:8080/job/royale-asjs/ws/frameworks/projects/Testing/target/Testing.swc>
     [java] -load-config=<http://apacheroyaleci.westus2.cloudapp.azure.com:8080/job/royale-asjs/ws/frameworks/projects/Testing/src/main/config/compile-swf-config.xml>
     [java] -js-load-config=<http://apacheroyaleci.westus2.cloudapp.azure.com:8080/job/royale-asjs/ws/frameworks/js-config.xml>
     [java] -js-load-config+=<http://apacheroyaleci.westus2.cloudapp.azure.com:8080/job/royale-asjs/ws/frameworks/projects/Testing/../../js/projects/TestingJS/src/main/config/compile-js-config.xml>
     [java] target:SWF
     [java] target:JSRoyale
     [java] COMPC
     [java] Loading configuration: <http://apacheroyaleci.westus2.cloudapp.azure.com:8080/job/royale-asjs/ws/frameworks/projects/Testing/src/main/config/compile-swf-config.xml>
     [java] 
     [java] 17478 bytes written to <http://apacheroyaleci.westus2.cloudapp.azure.com:8080/job/royale-asjs/ws/frameworks/projects/Testing/target/Testing.swc>
in 2.460 seconds
     [java] COMPCJSCRoyale
     [java] Copy library.swf
     [java] Copy defaults.css
     [java] Compiling file: org.apache.royale.test.asserts.assertTrue
     [java] Writing file: js\out\org\apache\royale\test\asserts\assertTrue.js
     [java] Compiling file: org.apache.royale.test.asserts.fail
     [java] Writing file: js\out\org\apache\royale\test\asserts\fail.js
     [java] Compiling file: TestingClasses
     [java] Writing file: js\out\TestingClasses.js
     [java] Compiling file: org.apache.royale.test.asserts.assertStrictlyEquals
     [java] Writing file: js\out\org\apache\royale\test\asserts\assertStrictlyEquals.js
     [java] Compiling file: org.apache.royale.test.asserts.assertNotNull
     [java] Writing file: js\out\org\apache\royale\test\asserts\assertNotNull.js
     [java] Compiling file: org.apache.royale.test.asserts.assertUndefined
     [java] Writing file: js\out\org\apache\royale\test\asserts\assertUndefined.js
     [java] Compiling file: org.apache.royale.test.asserts.assertFalse
     [java] Writing file: js\out\org\apache\royale\test\asserts\assertFalse.js
     [java] Compiling file: org.apache.royale.test.TestEvent
     [java] Writing file: js\out\org\apache\royale\test\TestEvent.js
     [java] Compiling file: org.apache.royale.test.AssertionError
     [java] Writing file: js\out\org\apache\royale\test\AssertionError.js
     [java] Compiling file: org.apache.royale.test.TestRunner
     [java] Writing file: js\out\org\apache\royale\test\TestRunner.js
     [java] Compiling file: org.apache.royale.test.TraceListener
     [java] Writing file: js\out\org\apache\royale\test\TraceListener.js
     [java] Compiling file: org.apache.royale.test.asserts.assertNull
     [java] Writing file: js\out\org\apache\royale\test\asserts\assertNull.js
     [java] Compiling file: org.apache.royale.test.asserts.assertDefined
     [java] Writing file: js\out\org\apache\royale\test\asserts\assertDefined.js
     [java] Compiling file: org.apache.royale.test.asserts.assertEquals
     [java] Writing file: js\out\org\apache\royale\test\asserts\assertEquals.js
     [java] Compiling file: org.apache.royale.test.Assert
     [java] Writing file: js\out\org\apache\royale\test\Assert.js
     [java] 5.6459314 seconds
     [java] Picked up JAVA_TOOL_OPTIONS: -Dfile.encoding=UTF-8 -Xmx512m

compile-js:
   [delete] Deleting: <http://apacheroyaleci.westus2.cloudapp.azure.com:8080/job/royale-asjs/ws/frameworks/js/projects/TestingJS/TestingJS.swc.properties>

clean:

check-compiler-home:
     [echo] ROYALE_SWF_COMPILER_HOME is ${env.ROYALE_SWF_COMPILER_HOME}

BUILD FAILED
<http://apacheroyaleci.westus2.cloudapp.azure.com:8080/job/royale-asjs/ws/build.xml>:648:
The following error occurred while executing this line:
<http://apacheroyaleci.westus2.cloudapp.azure.com:8080/job/royale-asjs/ws/frameworks/build.xml>:112:
The following error occurred while executing this line:
<http://apacheroyaleci.westus2.cloudapp.azure.com:8080/job/royale-asjs/ws/frameworks/build.xml>:230:
The following error occurred while executing this line:
<http://apacheroyaleci.westus2.cloudapp.azure.com:8080/job/royale-asjs/ws/frameworks/projects/Testing/build.xml>:64:
The following error occurred while executing this line:
<http://apacheroyaleci.westus2.cloudapp.azure.com:8080/job/royale-asjs/ws/frameworks/js/projects/TestingJS/build.xml>:102:
ROYALE_SWF_COMPILER_HOME must be set to a folder with a lib sub-folder containing compiler-mxmlc.jar
such as the compiler folder in royale-compiler repo or a Royale SDK folder

Total time: 39 minutes 40 seconds
Picked up JAVA_TOOL_OPTIONS: -Dfile.encoding=UTF-8 -Xmx512m
Build step 'Invoke Ant' marked build as failure
Skipped archiving because build is not successful

Mime
View raw message