royale-dev mailing list archives

Site index · List index
Message view « Date » · « Thread »
Top « Date » · « Thread »
From apacheroyal...@gmail.com
Subject Build failed in Jenkins: royale-asjs_jsonly #1497
Date Mon, 10 Sep 2018 12:38:59 GMT
See <http://apacheroyaleci.westus2.cloudapp.azure.com:8080/job/royale-asjs_jsonly/1497/display/redirect?page=changes>

Changes:

[carlosrovira] Merge branch 'develop' of https://github.com/yestaro/royale-asjs into

[carlosrovira] SASS doesn't allow ";" characters and indentation is not right for SASS

[carlosrovira] Code need COMPILE::JS blocks to compile (maybe you can compile it since

[carlosrovira] forgot to add theme styles

[carlosrovira] better use StyleUIBase methods

[carlosrovira] improve organization in jewel theme code for snackbar. and remove round

[carlosrovira] add snackbar to all jewel themes

[carlosrovira] update all jewel themes

------------------------------------------
[...truncated 235.06 KB...]
    [junit] Picked up JAVA_TOOL_OPTIONS: -Dfile.encoding=UTF-8 -Xmx512m

main:

jar-test:
     [echo] using externc.jar from C:/Program Files (x86)/Jenkins/workspace/royale-compiler/compiler-jx/lib
     [java] Math parameters not found!  0
     [java] Reflect parameters not found!  0
     [java] chrome parameters not found!  0
     [java] app parameters not found!  0
     [java] webstore parameters not found!  0
     [java] runtime parameters not found!  0
     [java] Intl parameters not found!  0
     [java] 6.1701214 seconds
     [java] Picked up JAVA_TOOL_OPTIONS: -Dfile.encoding=UTF-8 -Xmx512m

download:
     [echo] basedir is C:\Program Files (x86)\Jenkins\workspace\royale-compiler\compiler\src\main\resources
     [echo] ROYALE_COMPILER_HOME is ${ROYALE_COMPILER_HOME}
     [echo] ROYALE_COMPILER_HOME is C:\Program Files (x86)\Jenkins\workspace\royale-compiler\compiler

prepare:
     [echo] Making lib directory C:\Program Files (x86)\Jenkins\workspace\royale-compiler\compiler/lib/external

all:
     [echo] basedir is C:\Program Files (x86)\Jenkins\workspace\royale-compiler\compiler\src\main\resources
     [echo] ROYALE_COMPILER_HOME is C:\Program Files (x86)\Jenkins\workspace\royale-compiler\compiler
     [echo] ROYALE_COMPILER_HOME is C:\Program Files (x86)\Jenkins\workspace\royale-compiler\compiler

check-dependency:
     [echo] checking for C:\Program Files (x86)\Jenkins\workspace\royale-compiler\compiler/lib/external//antlr.jar

download-dependency:
     [echo] basedir is C:\Program Files (x86)\Jenkins\workspace\royale-compiler\compiler\src\main\resources
     [echo] ROYALE_COMPILER_HOME is C:\Program Files (x86)\Jenkins\workspace\royale-compiler\compiler
     [echo] ROYALE_COMPILER_HOME is C:\Program Files (x86)\Jenkins\workspace\royale-compiler\compiler

check-dependency:
     [echo] checking for C:\Program Files (x86)\Jenkins\workspace\royale-compiler\compiler/lib/external//commons-cli.jar

download-dependency:
     [echo] basedir is C:\Program Files (x86)\Jenkins\workspace\royale-compiler\compiler\src\main\resources
     [echo] ROYALE_COMPILER_HOME is C:\Program Files (x86)\Jenkins\workspace\royale-compiler\compiler
     [echo] ROYALE_COMPILER_HOME is C:\Program Files (x86)\Jenkins\workspace\royale-compiler\compiler

check-dependency:
     [echo] checking for C:\Program Files (x86)\Jenkins\workspace\royale-compiler\compiler/lib/external//commons-io.jar

download-dependency:
     [echo] basedir is C:\Program Files (x86)\Jenkins\workspace\royale-compiler\compiler\src\main\resources
     [echo] ROYALE_COMPILER_HOME is C:\Program Files (x86)\Jenkins\workspace\royale-compiler\compiler
     [echo] ROYALE_COMPILER_HOME is C:\Program Files (x86)\Jenkins\workspace\royale-compiler\compiler

check-dependency:
     [echo] checking for C:\Program Files (x86)\Jenkins\workspace\royale-compiler\compiler/lib/external//commons-lang-2.6.jar

download-dependency:
     [echo] basedir is C:\Program Files (x86)\Jenkins\workspace\royale-compiler\compiler\src\main\resources
     [echo] ROYALE_COMPILER_HOME is C:\Program Files (x86)\Jenkins\workspace\royale-compiler\compiler
     [echo] ROYALE_COMPILER_HOME is C:\Program Files (x86)\Jenkins\workspace\royale-compiler\compiler

check-dependency:
     [echo] checking for C:\Program Files (x86)\Jenkins\workspace\royale-compiler\compiler/lib/external//guava.jar

download-dependency:
     [echo] basedir is C:\Program Files (x86)\Jenkins\workspace\royale-compiler\compiler\src\main\resources
     [echo] ROYALE_COMPILER_HOME is C:\Program Files (x86)\Jenkins\workspace\royale-compiler\compiler
     [echo] ROYALE_COMPILER_HOME is C:\Program Files (x86)\Jenkins\workspace\royale-compiler\compiler

check-dependency:
     [echo] checking for C:\Program Files (x86)\Jenkins\workspace\royale-compiler\compiler/lib/external//jburg.jar

download-dependency:
     [echo] basedir is C:\Program Files (x86)\Jenkins\workspace\royale-compiler\compiler\src\main\resources
     [echo] ROYALE_COMPILER_HOME is C:\Program Files (x86)\Jenkins\workspace\royale-compiler\compiler
     [echo] ROYALE_COMPILER_HOME is C:\Program Files (x86)\Jenkins\workspace\royale-compiler\compiler

check-dependency:
     [echo] checking for C:\Program Files (x86)\Jenkins\workspace\royale-compiler\compiler/lib/external//jflex.jar

download-dependency:
     [echo] basedir is C:\Program Files (x86)\Jenkins\workspace\royale-compiler\compiler\src\main\resources
     [echo] ROYALE_COMPILER_HOME is C:\Program Files (x86)\Jenkins\workspace\royale-compiler\compiler
     [echo] ROYALE_COMPILER_HOME is C:\Program Files (x86)\Jenkins\workspace\royale-compiler\compiler

check-dependency:
     [echo] checking for C:\Program Files (x86)\Jenkins\workspace\royale-compiler\compiler/lib/external//lzma-sdk.jar

download-dependency:
     [echo] basedir is C:\Program Files (x86)\Jenkins\workspace\royale-compiler\compiler\src\main\resources
     [echo] ROYALE_COMPILER_HOME is C:\Program Files (x86)\Jenkins\workspace\royale-compiler\compiler
     [echo] ROYALE_COMPILER_HOME is C:\Program Files (x86)\Jenkins\workspace\royale-compiler\compiler

check-dependency:
     [echo] checking for C:\Program Files (x86)\Jenkins\workspace\royale-compiler\compiler/lib/external//flex-tool-api.jar

download-dependency:

main:
   [delete] Deleting directory C:\Program Files (x86)\Jenkins\workspace\royale-compiler\compiler\in

setup:

set.raw.as.tokenizer.uptodate:

raw.as.tokenizer:
     [echo] Generating RawASTokenizer
     [java] 
     [java] Warning in file "C:\Program Files (x86)\Jenkins\workspace\royale-compiler\compiler\src\main\jflex\org\apache\royale\compiler\internal\parsing\as\RawASTokenizer.lex"
(line 848): 
     [java] ".|\n" does not match all characters, because "." excludes all Unicode newline
chars - use "[^]" instead
     [java] <TYPED_COLLECTION, TYPED_COLLECTION_LITERAL> .|"\n"
     [java]                                              ^
     [java] 
     [java] Warning in file "C:\Program Files (x86)\Jenkins\workspace\royale-compiler\compiler\src\main\jflex\org\apache\royale\compiler\internal\parsing\as\RawASTokenizer.lex"
(line 935): 
     [java] ".|\n" does not match all characters, because "." excludes all Unicode newline
chars - use "[^]" instead
     [java] <E4X> .|"\n"
     [java]       ^
     [java] 
     [java] Warning in file "C:\Program Files (x86)\Jenkins\workspace\royale-compiler\compiler\src\main\jflex\org\apache\royale\compiler\internal\parsing\as\RawASTokenizer.lex"
(line 1290): 
     [java] ".|\n" does not match all characters, because "." excludes all Unicode newline
chars - use "[^]" instead
     [java] <YYINITIAL, STRINGLITERAL, ESCAPE_SEQUENCE, TYPED_COLLECTION, TYPED_COLLECTION_LITERAL>
.|"\n"
     [java]                                                                              
          ^
     [java] Picked up JAVA_TOOL_OPTIONS: -Dfile.encoding=UTF-8 -Xmx512m

set.raw.asdoc.tokenizer.uptodate:

raw.asdoc.tokenizer:
     [echo] Generating RawASDocTokenizer
     [java] 
     [java] Warning in file "C:\Program Files (x86)\Jenkins\workspace\royale-compiler\compiler\src\main\jflex\org\apache\royale\compiler\internal\parsing\as\RawASDocTokenizer.lex"
(line 192): 
     [java] ".|\n" does not match all characters, because "." excludes all Unicode newline
chars - use "[^]" instead
     [java] <STRING1> ([\\](.|"\n"))+
     [java]                 ^
     [java] 
     [java] Warning in file "C:\Program Files (x86)\Jenkins\workspace\royale-compiler\compiler\src\main\jflex\org\apache\royale\compiler\internal\parsing\as\RawASDocTokenizer.lex"
(line 229): 
     [java] ".|\n" does not match all characters, because "." excludes all Unicode newline
chars - use "[^]" instead
     [java] <YYINITIAL, TAG, STRING1> .|"\n"
     [java]                           ^
     [java] Picked up JAVA_TOOL_OPTIONS: -Dfile.encoding=UTF-8 -Xmx512m

set.raw.mxml.tokenizer.uptodate:

raw.mxml.tokenizer:
     [echo] Generating RawMXMLTokenizer
     [java] Picked up JAVA_TOOL_OPTIONS: -Dfile.encoding=UTF-8 -Xmx512m

jflex:

set.as.parser.uptodate:

as.parser:
     [echo] Generating ASParser and ASTokenTypes
    [mkdir] Created dir: C:\Program Files (x86)\Jenkins\workspace\royale-compiler\compiler\target\generated-sources\antlr\org\apache\royale\compiler\internal\parsing\as
    [antlr] ANTLR Parser Generator   Version 2.7.7 (20060906)   1989-2005
    [antlr] C:\Program Files (x86)\Jenkins\workspace\royale-compiler\compiler\src\main\antlr\org\apache\royale\compiler\internal\parsing\as\ASParser.g:189:9:
warning:nondeterminism between alts 1 and 2 of block upon
    [antlr] C:\Program Files (x86)\Jenkins\workspace\royale-compiler\compiler\src\main\antlr\org\apache\royale\compiler\internal\parsing\as\ASParser.g:189:9:
    k==1:TOKEN_NAMESPACE_NAME
    [antlr] C:\Program Files (x86)\Jenkins\workspace\royale-compiler\compiler\src\main\antlr\org\apache\royale\compiler\internal\parsing\as\ASParser.g:2061:
warning:nondeterminism between alts 2 and 3 of block upon
    [antlr] C:\Program Files (x86)\Jenkins\workspace\royale-compiler\compiler\src\main\antlr\org\apache\royale\compiler\internal\parsing\as\ASParser.g:2061:
    k==1:TOKEN_NAMESPACE_NAME
    [antlr] Picked up JAVA_TOOL_OPTIONS: -Dfile.encoding=UTF-8 -Xmx512m
     [java] Adding @SuppressWarnings("unused") to class: C:\Program Files (x86)\Jenkins\workspace\royale-compiler\compiler\target\generated-sources\antlr\org\apache\royale\compiler\internal\parsing\as\ASParser.java
     [java] Adding @SuppressWarnings("unused") to class: C:\Program Files (x86)\Jenkins\workspace\royale-compiler\compiler\target\generated-sources\antlr\org\apache\royale\compiler\internal\parsing\as\ASTokenTypes.java

set.metadata.parser.uptodate:

metadata.parser:
     [echo] Generating MetadataParser and MetadataTokenTypes
    [antlr] ANTLR Parser Generator   Version 2.7.7 (20060906)   1989-2005
    [antlr] Picked up JAVA_TOOL_OPTIONS: -Dfile.encoding=UTF-8 -Xmx512m
     [java] Adding @SuppressWarnings("all") to class: C:\Program Files (x86)\Jenkins\workspace\royale-compiler\compiler\target\generated-sources\antlr\org\apache\royale\compiler\internal\parsing\as\MetadataParser.java
     [java] Adding @SuppressWarnings("unused") to class: C:\Program Files (x86)\Jenkins\workspace\royale-compiler\compiler\target\generated-sources\antlr\org\apache\royale\compiler\internal\parsing\as\MetadataTokenTypes.java

set.css.lexer.and.parser.uptodate:

css.lexer.and.parser:
     [echo] Generating CSSLexer and CSSParser
    [mkdir] Created dir: C:\Program Files (x86)\Jenkins\workspace\royale-compiler\compiler\target\generated-sources\antlr3\org\apache\royale\compiler\internal\css
     [java] Picked up JAVA_TOOL_OPTIONS: -Dfile.encoding=UTF-8 -Xmx512m

set.css.tree.uptodate:

css.tree:
     [echo] Generating CSSTree
     [java] Picked up JAVA_TOOL_OPTIONS: -Dfile.encoding=UTF-8 -Xmx512m

antlr:

set.unknown.tree.handler.patterns.uptodate:

unknown.tree.handler.patterns:
    [mkdir] Created dir: C:\Program Files (x86)\Jenkins\workspace\royale-compiler\compiler\target\generated-sources\unknowntreehandler\org\apache\royale\compiler\internal\as\codegen
     [java] Picked up JAVA_TOOL_OPTIONS: -Dfile.encoding=UTF-8 -Xmx512m

set.cmc.emitter.uptodate:

cmc.emitter:
     [echo] Generating CmcEmitter
    [mkdir] Created dir: C:\Program Files (x86)\Jenkins\workspace\royale-compiler\compiler\target\generated-sources\jburg\org\apache\royale\compiler\internal\as\codegen
     [java] Using Language Adaptor : jburg.burg.emitlangs.EmitJava
     [java] Using i-node adapter org.apache.royale.compiler.internal.as.codegen.IASNodeAdapter
     [java] Picked up JAVA_TOOL_OPTIONS: -Dfile.encoding=UTF-8 -Xmx512m
     [java] Adding @SuppressWarnings({"rawtypes", "unchecked", "unused"}) to class: C:\Program
Files (x86)\Jenkins\workspace\royale-compiler\compiler\target\generated-sources\jburg\org\apache\royale\compiler\internal\as\codegen\CmcEmitter.java

set.css.emitter.uptodate:

css.emitter:
     [echo] Generating CSSEmitter
    [mkdir] Created dir: C:\Program Files (x86)\Jenkins\workspace\royale-compiler\compiler\target\generated-sources\jburg\org\apache\royale\compiler\internal\css\codegen
     [java] Using Language Adaptor : jburg.burg.emitlangs.EmitJava
     [java] Using i-node adapter jburg.burg.inode.DefaultAdapter
     [java] Picked up JAVA_TOOL_OPTIONS: -Dfile.encoding=UTF-8 -Xmx512m
     [java] Adding @SuppressWarnings({"rawtypes", "unchecked", "unused"}) to class: C:\Program
Files (x86)\Jenkins\workspace\royale-compiler\compiler\target\generated-sources\jburg\org\apache\royale\compiler\internal\css\codegen\CSSEmitter.java

jburg:

eclipse:

src.depend:

compile:
    [javac] Compiling 1545 source files to C:\Program Files (x86)\Jenkins\workspace\royale-compiler\compiler\target\classes
    [javac] warning: [options] bootstrap class path not set in conjunction with -source 1.5
    [javac] warning: [options] source value 1.5 is obsolete and will be removed in a future
release
    [javac] warning: [options] target value 1.5 is obsolete and will be removed in a future
release
    [javac] warning: [options] To suppress warnings about obsolete options, use -Xlint:-options.
    [javac] error: error reading C:\Program Files (x86)\Jenkins\workspace\royale-compiler\compiler\target\generated-sources\jburg\org\apache\royale\compiler\internal\as\codegen\CmcEmitter.java;
C:\Program Files (x86)\Jenkins\workspace\royale-compiler\compiler\target\generated-sources\jburg\org\apache\royale\compiler\internal\as\codegen\CmcEmitter.java
(The system cannot find the path specified)
    [javac] error: error reading C:\Program Files (x86)\Jenkins\workspace\royale-compiler\compiler\target\generated-sources\jburg\org\apache\royale\compiler\internal\css\codegen\CSSEmitter.java;
C:\Program Files (x86)\Jenkins\workspace\royale-compiler\compiler\target\generated-sources\jburg\org\apache\royale\compiler\internal\css\codegen\CSSEmitter.java
(The system cannot find the path specified)
    [javac] error: error reading C:\Program Files (x86)\Jenkins\workspace\royale-compiler\compiler\target\generated-sources\jflex\org\apache\royale\compiler\internal\parsing\as\RawASDocTokenizer.java;
C:\Program Files (x86)\Jenkins\workspace\royale-compiler\compiler\target\generated-sources\jflex\org\apache\royale\compiler\internal\parsing\as\RawASDocTokenizer.java
(The system cannot find the path specified)
    [javac] error: error reading C:\Program Files (x86)\Jenkins\workspace\royale-compiler\compiler\target\generated-sources\jflex\org\apache\royale\compiler\internal\parsing\as\RawASTokenizer.java;
C:\Program Files (x86)\Jenkins\workspace\royale-compiler\compiler\target\generated-sources\jflex\org\apache\royale\compiler\internal\parsing\as\RawASTokenizer.java
(The system cannot find the path specified)
    [javac] error: error reading C:\Program Files (x86)\Jenkins\workspace\royale-compiler\compiler\target\generated-sources\jflex\org\apache\royale\compiler\internal\parsing\mxml\RawMXMLTokenizer.java;
C:\Program Files (x86)\Jenkins\workspace\royale-compiler\compiler\target\generated-sources\jflex\org\apache\royale\compiler\internal\parsing\mxml\RawMXMLTokenizer.java
(The system cannot find the path specified)
    [javac] error: error reading C:\Program Files (x86)\Jenkins\workspace\royale-compiler\compiler\target\generated-sources\antlr\org\apache\royale\compiler\internal\parsing\as\ASParser.java;
C:\Program Files (x86)\Jenkins\workspace\royale-compiler\compiler\target\generated-sources\antlr\org\apache\royale\compiler\internal\parsing\as\ASParser.java
(The system cannot find the path specified)
    [javac] error: error reading C:\Program Files (x86)\Jenkins\workspace\royale-compiler\compiler\target\generated-sources\antlr\org\apache\royale\compiler\internal\parsing\as\ASTokenTypes.java;
C:\Program Files (x86)\Jenkins\workspace\royale-compiler\compiler\target\generated-sources\antlr\org\apache\royale\compiler\internal\parsing\as\ASTokenTypes.java
(The system cannot find the path specified)
    [javac] error: error reading C:\Program Files (x86)\Jenkins\workspace\royale-compiler\compiler\target\generated-sources\antlr\org\apache\royale\compiler\internal\parsing\as\MetadataParser.java;
C:\Program Files (x86)\Jenkins\workspace\royale-compiler\compiler\target\generated-sources\antlr\org\apache\royale\compiler\internal\parsing\as\MetadataParser.java
(The system cannot find the path specified)
    [javac] error: error reading C:\Program Files (x86)\Jenkins\workspace\royale-compiler\compiler\target\generated-sources\antlr\org\apache\royale\compiler\internal\parsing\as\MetadataTokenTypes.java;
C:\Program Files (x86)\Jenkins\workspace\royale-compiler\compiler\target\generated-sources\antlr\org\apache\royale\compiler\internal\parsing\as\MetadataTokenTypes.java
(The system cannot find the path specified)
    [javac] error: error reading C:\Program Files (x86)\Jenkins\workspace\royale-compiler\compiler\target\generated-sources\antlr3\org\apache\royale\compiler\internal\css\CSSLexer.java;
C:\Program Files (x86)\Jenkins\workspace\royale-compiler\compiler\target\generated-sources\antlr3\org\apache\royale\compiler\internal\css\CSSLexer.java
(The system cannot find the path specified)
    [javac] error: error reading C:\Program Files (x86)\Jenkins\workspace\royale-compiler\compiler\target\generated-sources\antlr3\org\apache\royale\compiler\internal\css\CSSParser.java;
C:\Program Files (x86)\Jenkins\workspace\royale-compiler\compiler\target\generated-sources\antlr3\org\apache\royale\compiler\internal\css\CSSParser.java
(The system cannot find the path specified)
    [javac] error: error reading C:\Program Files (x86)\Jenkins\workspace\royale-compiler\compiler\target\generated-sources\antlr3\org\apache\royale\compiler\internal\css\CSSTree.java;
C:\Program Files (x86)\Jenkins\workspace\royale-compiler\compiler\target\generated-sources\antlr3\org\apache\royale\compiler\internal\css\CSSTree.java
(The system cannot find the path specified)
    [javac] error: error reading C:\Program Files (x86)\Jenkins\workspace\royale-compiler\compiler\target\generated-sources\unknowntreehandler\org\apache\royale\compiler\internal\as\codegen\UnknownTreeHandlerPatterns.java;
C:\Program Files (x86)\Jenkins\workspace\royale-compiler\compiler\target\generated-sources\unknowntreehandler\org\apache\royale\compiler\internal\as\codegen\UnknownTreeHandlerPatterns.java
(The system cannot find the path specified)
    [javac] 13 errors
    [javac] 4 warnings

BUILD FAILED
<http://apacheroyaleci.westus2.cloudapp.azure.com:8080/job/royale-asjs_jsonly/ws/build.xml>:2014:
The following error occurred while executing this line:
C:\Program Files (x86)\Jenkins\workspace\royale-compiler\build.xml:68: The following error
occurred while executing this line:
C:\Program Files (x86)\Jenkins\workspace\royale-compiler\compiler\build.xml:486: Compile failed;
see the compiler error output for details.

Total time: 57 minutes 9 seconds
Picked up JAVA_TOOL_OPTIONS: -Dfile.encoding=UTF-8 -Xmx512m
Build step 'Invoke Ant' marked build as failure
Archiving artifacts

Mime
View raw message