royale-dev mailing list archives

Site index · List index
Message view « Date » · « Thread »
Top « Date » · « Thread »
From apacheroyal...@gmail.com
Subject Build failed in Jenkins: royale-asjs_jsonly #1615
Date Wed, 26 Sep 2018 04:47:57 GMT
See <http://apacheroyaleci.westus2.cloudapp.azure.com:8080/job/royale-asjs_jsonly/1615/display/redirect>

------------------------------------------
[...truncated 1.84 MB...]
    [mxmlc] <http://apacheroyaleci.westus2.cloudapp.azure.com:8080/job/royale-asjs_jsonly/ws/mustella/tests/basicTests/bin/js-debug/org/apache/royale/html/beads/ContainerView.js>
removing require: org.apache.royale.core.IViewport
    [mxmlc] <http://apacheroyaleci.westus2.cloudapp.azure.com:8080/job/royale-asjs_jsonly/ws/mustella/tests/basicTests/bin/js-debug/org/apache/royale/html/beads/ContainerView.js>
removing require: org.apache.royale.utils.loadBeadFromValuesManager
    [mxmlc] Dependencies calculated for 'org.apache.royale.html.beads.ContainerView'
    [mxmlc] org.apache.royale.html.beads.ContainerView depends on org.apache.royale.html.beads.GroupView
    [mxmlc] <http://apacheroyaleci.westus2.cloudapp.azure.com:8080/job/royale-asjs_jsonly/ws/mustella/tests/basicTests/bin/js-debug/org/apache/royale/html/beads/GroupView.js>
removing require: org.apache.royale.core.ILayoutChild
    [mxmlc] <http://apacheroyaleci.westus2.cloudapp.azure.com:8080/job/royale-asjs_jsonly/ws/mustella/tests/basicTests/bin/js-debug/org/apache/royale/html/beads/GroupView.js>
removing require: org.apache.royale.core.ILayoutView
    [mxmlc] <http://apacheroyaleci.westus2.cloudapp.azure.com:8080/job/royale-asjs_jsonly/ws/mustella/tests/basicTests/bin/js-debug/org/apache/royale/html/beads/GroupView.js>
removing require: org.apache.royale.core.IStrand
    [mxmlc] <http://apacheroyaleci.westus2.cloudapp.azure.com:8080/job/royale-asjs_jsonly/ws/mustella/tests/basicTests/bin/js-debug/org/apache/royale/html/beads/GroupView.js>
removing require: org.apache.royale.core.IUIBase
    [mxmlc] <http://apacheroyaleci.westus2.cloudapp.azure.com:8080/job/royale-asjs_jsonly/ws/mustella/tests/basicTests/bin/js-debug/org/apache/royale/html/beads/GroupView.js>
removing require: org.apache.royale.events.Event
    [mxmlc] <http://apacheroyaleci.westus2.cloudapp.azure.com:8080/job/royale-asjs_jsonly/ws/mustella/tests/basicTests/bin/js-debug/org/apache/royale/html/beads/GroupView.js>
removing require: org.apache.royale.utils.Language
    [mxmlc] Dependencies calculated for 'org.apache.royale.html.beads.GroupView'
    [mxmlc] org.apache.royale.html.beads.GroupView depends on org.apache.royale.core.BeadViewBase
    [mxmlc] <http://apacheroyaleci.westus2.cloudapp.azure.com:8080/job/royale-asjs_jsonly/ws/mustella/tests/basicTests/bin/js-debug/org/apache/royale/core/BeadViewBase.js>
removing require: org.apache.royale.core.IStrand
    [mxmlc] <http://apacheroyaleci.westus2.cloudapp.azure.com:8080/job/royale-asjs_jsonly/ws/mustella/tests/basicTests/bin/js-debug/org/apache/royale/core/BeadViewBase.js>
removing require: org.apache.royale.core.IUIBase
    [mxmlc] Dependencies calculated for 'org.apache.royale.core.BeadViewBase'
    [mxmlc] org.apache.royale.core.BeadViewBase depends on org.apache.royale.events.EventDispatcher
    [mxmlc] org.apache.royale.core.BeadViewBase depends on org.apache.royale.core.IBeadView
    [mxmlc] org.apache.royale.html.beads.GroupView depends on org.apache.royale.core.IBeadView
    [mxmlc] org.apache.royale.html.beads.GroupView depends on org.apache.royale.core.ILayoutHost
    [mxmlc] <http://apacheroyaleci.westus2.cloudapp.azure.com:8080/job/royale-asjs_jsonly/ws/mustella/tests/basicTests/bin/js-debug/org/apache/royale/core/IViewport.js>
removing require: org.apache.royale.core.IUIBase
    [mxmlc] <http://apacheroyaleci.westus2.cloudapp.azure.com:8080/job/royale-asjs_jsonly/ws/mustella/tests/basicTests/bin/js-debug/org/apache/royale/core/IViewport.js>
removing require: org.apache.royale.geom.Size
    [mxmlc] Dependencies calculated for 'org.apache.royale.core.IViewport'
    [mxmlc] org.apache.royale.core.IViewport depends on org.apache.royale.core.IBead
    [mxmlc] Dependencies calculated for 'org.apache.royale.geom.Size'
    [mxmlc] <http://apacheroyaleci.westus2.cloudapp.azure.com:8080/job/royale-asjs_jsonly/ws/mustella/tests/basicTests/bin/js-debug/org/apache/royale/html/supportClasses/Viewport.js>
removing require: org.apache.royale.core.IContentView
    [mxmlc] <http://apacheroyaleci.westus2.cloudapp.azure.com:8080/job/royale-asjs_jsonly/ws/mustella/tests/basicTests/bin/js-debug/org/apache/royale/html/supportClasses/Viewport.js>
removing require: org.apache.royale.core.IStrand
    [mxmlc] <http://apacheroyaleci.westus2.cloudapp.azure.com:8080/job/royale-asjs_jsonly/ws/mustella/tests/basicTests/bin/js-debug/org/apache/royale/html/supportClasses/Viewport.js>
removing require: org.apache.royale.core.IUIBase
    [mxmlc] <http://apacheroyaleci.westus2.cloudapp.azure.com:8080/job/royale-asjs_jsonly/ws/mustella/tests/basicTests/bin/js-debug/org/apache/royale/html/supportClasses/Viewport.js>
removing require: org.apache.royale.core.UIBase
    [mxmlc] <http://apacheroyaleci.westus2.cloudapp.azure.com:8080/job/royale-asjs_jsonly/ws/mustella/tests/basicTests/bin/js-debug/org/apache/royale/html/supportClasses/Viewport.js>
removing require: org.apache.royale.geom.Size
    [mxmlc] <http://apacheroyaleci.westus2.cloudapp.azure.com:8080/job/royale-asjs_jsonly/ws/mustella/tests/basicTests/bin/js-debug/org/apache/royale/html/supportClasses/Viewport.js>
removing require: org.apache.royale.utils.loadBeadFromValuesManager
    [mxmlc] Dependencies calculated for 'org.apache.royale.html.supportClasses.Viewport'
    [mxmlc] org.apache.royale.html.supportClasses.Viewport depends on org.apache.royale.events.EventDispatcher
    [mxmlc] org.apache.royale.html.supportClasses.Viewport depends on org.apache.royale.core.IBead
    [mxmlc] org.apache.royale.html.supportClasses.Viewport depends on org.apache.royale.core.IViewport
    [mxmlc] Dependencies calculated for 'org.apache.royale.core.IContentView'
    [mxmlc] org.apache.royale.core.IContentView depends on org.apache.royale.core.IParent
    [mxmlc] <http://apacheroyaleci.westus2.cloudapp.azure.com:8080/job/royale-asjs_jsonly/ws/mustella/tests/basicTests/bin/js-debug/org/apache/royale/html/beads/layouts/BasicLayout.js>
removing require: org.apache.royale.core.ILayoutView
    [mxmlc] <http://apacheroyaleci.westus2.cloudapp.azure.com:8080/job/royale-asjs_jsonly/ws/mustella/tests/basicTests/bin/js-debug/org/apache/royale/html/beads/layouts/BasicLayout.js>
removing require: org.apache.royale.core.UIBase
    [mxmlc] Dependencies calculated for 'org.apache.royale.html.beads.layouts.BasicLayout'
    [mxmlc] org.apache.royale.html.beads.layouts.BasicLayout depends on org.apache.royale.core.LayoutBase
    [mxmlc] org.apache.royale.html.beads.layouts.BasicLayout depends on org.apache.royale.core.IBeadLayout
    [mxmlc] <http://apacheroyaleci.westus2.cloudapp.azure.com:8080/job/royale-asjs_jsonly/ws/mustella/tests/basicTests/bin/js-debug/org/apache/royale/html/beads/models/ViewportModel.js>
removing require: org.apache.royale.core.IStrand
    [mxmlc] <http://apacheroyaleci.westus2.cloudapp.azure.com:8080/job/royale-asjs_jsonly/ws/mustella/tests/basicTests/bin/js-debug/org/apache/royale/html/beads/models/ViewportModel.js>
removing require: org.apache.royale.core.layout.EdgeData
    [mxmlc] Dependencies calculated for 'org.apache.royale.html.beads.models.ViewportModel'
    [mxmlc] org.apache.royale.html.beads.models.ViewportModel depends on org.apache.royale.events.EventDispatcher
    [mxmlc] org.apache.royale.html.beads.models.ViewportModel depends on org.apache.royale.core.IViewportModel
    [mxmlc] <http://apacheroyaleci.westus2.cloudapp.azure.com:8080/job/royale-asjs_jsonly/ws/mustella/tests/basicTests/bin/js-debug/org/apache/royale/core/IViewportModel.js>
removing require: org.apache.royale.core.layout.EdgeData
    [mxmlc] Dependencies calculated for 'org.apache.royale.core.IViewportModel'
    [mxmlc] org.apache.royale.core.IViewportModel depends on org.apache.royale.core.IBead
    [mxmlc] <http://apacheroyaleci.westus2.cloudapp.azure.com:8080/job/royale-asjs_jsonly/ws/mustella/tests/basicTests/bin/js-debug/org/apache/royale/core/SimpleStatesImpl.js>
removing require: org.apache.royale.core.IChild
    [mxmlc] <http://apacheroyaleci.westus2.cloudapp.azure.com:8080/job/royale-asjs_jsonly/ws/mustella/tests/basicTests/bin/js-debug/org/apache/royale/core/SimpleStatesImpl.js>
removing require: org.apache.royale.core.IContainer
    [mxmlc] <http://apacheroyaleci.westus2.cloudapp.azure.com:8080/job/royale-asjs_jsonly/ws/mustella/tests/basicTests/bin/js-debug/org/apache/royale/core/SimpleStatesImpl.js>
removing require: org.apache.royale.core.IParent
    [mxmlc] <http://apacheroyaleci.westus2.cloudapp.azure.com:8080/job/royale-asjs_jsonly/ws/mustella/tests/basicTests/bin/js-debug/org/apache/royale/core/SimpleStatesImpl.js>
removing require: org.apache.royale.core.IStatesObject
    [mxmlc] <http://apacheroyaleci.westus2.cloudapp.azure.com:8080/job/royale-asjs_jsonly/ws/mustella/tests/basicTests/bin/js-debug/org/apache/royale/core/SimpleStatesImpl.js>
removing require: org.apache.royale.core.IStrand
    [mxmlc] <http://apacheroyaleci.westus2.cloudapp.azure.com:8080/job/royale-asjs_jsonly/ws/mustella/tests/basicTests/bin/js-debug/org/apache/royale/core/SimpleStatesImpl.js>
removing require: org.apache.royale.events.Event
    [mxmlc] <http://apacheroyaleci.westus2.cloudapp.azure.com:8080/job/royale-asjs_jsonly/ws/mustella/tests/basicTests/bin/js-debug/org/apache/royale/core/SimpleStatesImpl.js>
removing require: org.apache.royale.events.IEventDispatcher
    [mxmlc] <http://apacheroyaleci.westus2.cloudapp.azure.com:8080/job/royale-asjs_jsonly/ws/mustella/tests/basicTests/bin/js-debug/org/apache/royale/core/SimpleStatesImpl.js>
removing require: org.apache.royale.events.ValueChangeEvent
    [mxmlc] <http://apacheroyaleci.westus2.cloudapp.azure.com:8080/job/royale-asjs_jsonly/ws/mustella/tests/basicTests/bin/js-debug/org/apache/royale/core/SimpleStatesImpl.js>
removing require: org.apache.royale.states.AddItems
    [mxmlc] <http://apacheroyaleci.westus2.cloudapp.azure.com:8080/job/royale-asjs_jsonly/ws/mustella/tests/basicTests/bin/js-debug/org/apache/royale/core/SimpleStatesImpl.js>
removing require: org.apache.royale.states.SetEventHandler
    [mxmlc] <http://apacheroyaleci.westus2.cloudapp.azure.com:8080/job/royale-asjs_jsonly/ws/mustella/tests/basicTests/bin/js-debug/org/apache/royale/core/SimpleStatesImpl.js>
removing require: org.apache.royale.states.SetProperty
    [mxmlc] <http://apacheroyaleci.westus2.cloudapp.azure.com:8080/job/royale-asjs_jsonly/ws/mustella/tests/basicTests/bin/js-debug/org/apache/royale/core/SimpleStatesImpl.js>
removing require: org.apache.royale.states.State
    [mxmlc] <http://apacheroyaleci.westus2.cloudapp.azure.com:8080/job/royale-asjs_jsonly/ws/mustella/tests/basicTests/bin/js-debug/org/apache/royale/core/SimpleStatesImpl.js>
removing require: org.apache.royale.utils.MXMLDataInterpreter
    [mxmlc] <http://apacheroyaleci.westus2.cloudapp.azure.com:8080/job/royale-asjs_jsonly/ws/mustella/tests/basicTests/bin/js-debug/org/apache/royale/core/SimpleStatesImpl.js>
removing require: org.apache.royale.utils.Language
    [mxmlc] Dependencies calculated for 'org.apache.royale.core.SimpleStatesImpl'
    [mxmlc] org.apache.royale.core.SimpleStatesImpl depends on org.apache.royale.events.EventDispatcher
    [mxmlc] org.apache.royale.core.SimpleStatesImpl depends on org.apache.royale.core.IStatesImpl
    [mxmlc] org.apache.royale.core.SimpleStatesImpl depends on org.apache.royale.core.IBead
    [mxmlc] Dependencies calculated for 'org.apache.royale.states.SetEventHandler'
    [mxmlc] org.apache.royale.states.SetEventHandler depends on org.apache.royale.core.IDocument
    [mxmlc] Dependencies calculated for 'org.apache.royale.states.SetProperty'
    [mxmlc] org.apache.royale.states.SetProperty depends on org.apache.royale.core.IDocument
    [mxmlc] using source file: <http://apacheroyaleci.westus2.cloudapp.azure.com:8080/job/royale-asjs_jsonly/ws/mustella/tests/basicTests/bin/js-debug/org/apache/royale/core/IParent.js>
    [mxmlc] using source file: <http://apacheroyaleci.westus2.cloudapp.azure.com:8080/job/royale-asjs_jsonly/ws/mustella/tests/basicTests/bin/js-debug/org/apache/royale/core/IContentViewHost.js>
    [mxmlc] using source file: <http://apacheroyaleci.westus2.cloudapp.azure.com:8080/job/royale-asjs_jsonly/ws/mustella/tests/basicTests/bin/js-debug/org/apache/royale/core/IRenderedObject.js>
    [mxmlc] using source file: <http://apacheroyaleci.westus2.cloudapp.azure.com:8080/job/royale-asjs_jsonly/ws/mustella/tests/basicTests/bin/js-debug/org/apache/royale/utils/loadBeadFromValuesManager.js>
    [mxmlc] using source file: <http://apacheroyaleci.westus2.cloudapp.azure.com:8080/job/royale-asjs_jsonly/ws/mustella/tests/basicTests/bin/js-debug/org/apache/royale/core/IBead.js>
    [mxmlc] using source file: <http://apacheroyaleci.westus2.cloudapp.azure.com:8080/job/royale-asjs_jsonly/ws/mustella/tests/basicTests/bin/js-debug/org/apache/royale/core/IBeadView.js>
    [mxmlc] using source file: <http://apacheroyaleci.westus2.cloudapp.azure.com:8080/job/royale-asjs_jsonly/ws/mustella/tests/basicTests/bin/js-debug/org/apache/royale/core/ILayoutHost.js>
    [mxmlc] using source file: <http://apacheroyaleci.westus2.cloudapp.azure.com:8080/job/royale-asjs_jsonly/ws/mustella/tests/basicTests/bin/js-debug/org/apache/royale/events/IEventDispatcher.js>
    [mxmlc] using source file: <http://apacheroyaleci.westus2.cloudapp.azure.com:8080/job/royale-asjs_jsonly/ws/mustella/tests/basicTests/bin/js-debug/org/apache/royale/events/EventDispatcher.js>
    [mxmlc] using source file: <http://apacheroyaleci.westus2.cloudapp.azure.com:8080/job/royale-asjs_jsonly/ws/mustella/tests/basicTests/bin/js-debug/org/apache/royale/core/BeadViewBase.js>
    [mxmlc] using source file: <http://apacheroyaleci.westus2.cloudapp.azure.com:8080/job/royale-asjs_jsonly/ws/mustella/tests/basicTests/bin/js-debug/org/apache/royale/html/beads/GroupView.js>
    [mxmlc] using source file: <http://apacheroyaleci.westus2.cloudapp.azure.com:8080/job/royale-asjs_jsonly/ws/mustella/tests/basicTests/bin/js-debug/org/apache/royale/html/beads/ContainerView.js>
    [mxmlc] using source file: <http://apacheroyaleci.westus2.cloudapp.azure.com:8080/job/royale-asjs_jsonly/ws/mustella/tests/basicTests/bin/js-debug/org/apache/royale/core/IStrand.js>
    [mxmlc] using source file: <http://apacheroyaleci.westus2.cloudapp.azure.com:8080/job/royale-asjs_jsonly/ws/mustella/tests/basicTests/bin/js-debug/org/apache/royale/core/IStrandWithModel.js>
    [mxmlc] using source file: <http://apacheroyaleci.westus2.cloudapp.azure.com:8080/job/royale-asjs_jsonly/ws/mustella/tests/basicTests/bin/js-debug/org/apache/royale/core/IDocument.js>
    [mxmlc] using source file: <http://apacheroyaleci.westus2.cloudapp.azure.com:8080/job/royale-asjs_jsonly/ws/mustella/tests/basicTests/bin/js-debug/org/apache/royale/core/IBeadLayout.js>
    [mxmlc] using source file: <http://apacheroyaleci.westus2.cloudapp.azure.com:8080/job/royale-asjs_jsonly/ws/mustella/tests/basicTests/bin/js-debug/org/apache/royale/core/LayoutBase.js>
    [mxmlc] using source file: <http://apacheroyaleci.westus2.cloudapp.azure.com:8080/job/royale-asjs_jsonly/ws/mustella/tests/basicTests/bin/js-debug/org/apache/royale/html/beads/layouts/BasicLayout.js>
    [mxmlc] using source file: <http://apacheroyaleci.westus2.cloudapp.azure.com:8080/job/royale-asjs_jsonly/ws/mustella/tests/basicTests/bin/js-debug/org/apache/royale/core/ILayoutView.js>
    [mxmlc] using source file: <http://apacheroyaleci.westus2.cloudapp.azure.com:8080/job/royale-asjs_jsonly/ws/mustella/tests/basicTests/bin/js-debug/org/apache/royale/core/IBeadController.js>
    [mxmlc] using source file: <http://apacheroyaleci.westus2.cloudapp.azure.com:8080/job/royale-asjs_jsonly/ws/mustella/tests/basicTests/bin/js-debug/org/apache/royale/utils/MixinManager.js>
    [mxmlc] using source file: <http://apacheroyaleci.westus2.cloudapp.azure.com:8080/job/royale-asjs_jsonly/ws/mustella/tests/basicTests/bin/js-debug/org/apache/royale/core/IContainerBaseStrandChildrenHost.js>
    [mxmlc] using source file: <http://apacheroyaleci.westus2.cloudapp.azure.com:8080/job/royale-asjs_jsonly/ws/mustella/tests/basicTests/bin/js-debug/org/apache/royale/core/IStyleableObject.js>
    [mxmlc] using source file: <http://apacheroyaleci.westus2.cloudapp.azure.com:8080/job/royale-asjs_jsonly/ws/mustella/tests/basicTests/bin/js-debug/org/apache/royale/core/IChild.js>
    [mxmlc] using source file: <http://apacheroyaleci.westus2.cloudapp.azure.com:8080/job/royale-asjs_jsonly/ws/mustella/tests/basicTests/bin/js-debug/org/apache/royale/core/IUIBase.js>
    [mxmlc] using source file: <http://apacheroyaleci.westus2.cloudapp.azure.com:8080/job/royale-asjs_jsonly/ws/mustella/tests/basicTests/bin/js-debug/org/apache/royale/core/ILayoutChild.js>
    [mxmlc] using source file: <http://apacheroyaleci.westus2.cloudapp.azure.com:8080/job/royale-asjs_jsonly/ws/mustella/tests/basicTests/bin/js-debug/org/apache/royale/core/IId.js>
    [mxmlc] using source file: <http://apacheroyaleci.westus2.cloudapp.azure.com:8080/job/royale-asjs_jsonly/ws/mustella/tests/basicTests/bin/js-debug/org/apache/royale/core/IParentIUIBase.js>
    [mxmlc] using source file: <http://apacheroyaleci.westus2.cloudapp.azure.com:8080/job/royale-asjs_jsonly/ws/mustella/tests/basicTests/bin/js-debug/org/apache/royale/core/IStrandWithModelView.js>
    [mxmlc] using source file: <http://apacheroyaleci.westus2.cloudapp.azure.com:8080/job/royale-asjs_jsonly/ws/mustella/tests/basicTests/bin/js-debug/org/apache/royale/core/IRoyaleElement.js>
    [mxmlc] using source file: <http://apacheroyaleci.westus2.cloudapp.azure.com:8080/job/royale-asjs_jsonly/ws/mustella/tests/basicTests/bin/js-debug/org/apache/royale/core/HTMLElementWrapper.js>
    [mxmlc] using source file: <http://apacheroyaleci.westus2.cloudapp.azure.com:8080/job/royale-asjs_jsonly/ws/mustella/tests/basicTests/bin/js-debug/org/apache/royale/core/UIBase.js>
    [mxmlc] using source file: <http://apacheroyaleci.westus2.cloudapp.azure.com:8080/job/royale-asjs_jsonly/ws/mustella/tests/basicTests/bin/js-debug/org/apache/royale/core/IStatesObject.js>
    [mxmlc] using source file: <http://apacheroyaleci.westus2.cloudapp.azure.com:8080/job/royale-asjs_jsonly/ws/mustella/tests/basicTests/bin/js-debug/org/apache/royale/core/ILayoutParent.js>
    [mxmlc] using source file: <http://apacheroyaleci.westus2.cloudapp.azure.com:8080/job/royale-asjs_jsonly/ws/mustella/tests/basicTests/bin/js-debug/org/apache/royale/core/IContainer.js>
    [mxmlc] using source file: <http://apacheroyaleci.westus2.cloudapp.azure.com:8080/job/royale-asjs_jsonly/ws/mustella/tests/basicTests/bin/js-debug/org/apache/royale/core/GroupBase.js>
    [mxmlc] using source file: <http://apacheroyaleci.westus2.cloudapp.azure.com:8080/job/royale-asjs_jsonly/ws/mustella/tests/basicTests/bin/js-debug/org/apache/royale/core/ContainerBase.js>
    [mxmlc] using source file: <http://apacheroyaleci.westus2.cloudapp.azure.com:8080/job/royale-asjs_jsonly/ws/mustella/tests/basicTests/bin/js-debug/org/apache/royale/events/IBrowserEvent.js>
    [mxmlc] using source file: <http://apacheroyaleci.westus2.cloudapp.azure.com:8080/job/royale-asjs_jsonly/ws/mustella/tests/basicTests/bin/js-debug/org/apache/royale/events/IRoyaleEvent.js>
    [mxmlc] using source file: <http://apacheroyaleci.westus2.cloudapp.azure.com:8080/job/royale-asjs_jsonly/ws/mustella/tests/basicTests/bin/js-debug/org/apache/royale/events/Event.js>
    [mxmlc] using source file: <http://apacheroyaleci.westus2.cloudapp.azure.com:8080/job/royale-asjs_jsonly/ws/mustella/tests/basicTests/bin/js-debug/org/apache/royale/events/MouseEvent.js>
    [mxmlc] using source file: <http://apacheroyaleci.westus2.cloudapp.azure.com:8080/job/royale-asjs_jsonly/ws/mustella/tests/basicTests/bin/js-debug/org/apache/royale/html/ButtonBase.js>
    [mxmlc] using source file: <http://apacheroyaleci.westus2.cloudapp.azure.com:8080/job/royale-asjs_jsonly/ws/mustella/tests/basicTests/bin/js-debug/org/apache/royale/html/Button.js>
    [mxmlc] using source file: <http://apacheroyaleci.westus2.cloudapp.azure.com:8080/job/royale-asjs_jsonly/ws/mustella/tests/basicTests/bin/js-debug/org/apache/royale/html/TextButton.js>
    [mxmlc] using source file: <http://apacheroyaleci.westus2.cloudapp.azure.com:8080/job/royale-asjs_jsonly/ws/mustella/tests/basicTests/bin/js-debug/org/apache/royale/html/CheckBox.js>
    [mxmlc] using source file: <http://apacheroyaleci.westus2.cloudapp.azure.com:8080/job/royale-asjs_jsonly/ws/mustella/tests/basicTests/bin/js-debug/org/apache/royale/core/IPopUpHost.js>
    [mxmlc] using source file: <http://apacheroyaleci.westus2.cloudapp.azure.com:8080/job/royale-asjs_jsonly/ws/mustella/tests/basicTests/bin/js-debug/org/apache/royale/core/IApplicationView.js>
    [mxmlc] using source file: <http://apacheroyaleci.westus2.cloudapp.azure.com:8080/job/royale-asjs_jsonly/ws/mustella/tests/basicTests/bin/js-debug/org/apache/royale/core/ViewBase.js>
    [mxmlc] using source file: <http://apacheroyaleci.westus2.cloudapp.azure.com:8080/job/royale-asjs_jsonly/ws/mustella/tests/basicTests/bin/js-debug/org/apache/royale/core/layout/EdgeData.js>
    [mxmlc] using source file: <http://apacheroyaleci.westus2.cloudapp.azure.com:8080/job/royale-asjs_jsonly/ws/mustella/tests/basicTests/bin/js-debug/org/apache/royale/html/util/addElementToWrapper.js>
    [mxmlc] using source file: <http://apacheroyaleci.westus2.cloudapp.azure.com:8080/job/royale-asjs_jsonly/ws/mustella/tests/basicTests/bin/js-debug/org/apache/royale/core/IValuesImpl.js>
    [mxmlc] using source file: <http://apacheroyaleci.westus2.cloudapp.azure.com:8080/job/royale-asjs_jsonly/ws/mustella/tests/basicTests/bin/js-debug/org/apache/royale/utils/Language.js>
    [mxmlc] using source file: <http://apacheroyaleci.westus2.cloudapp.azure.com:8080/job/royale-asjs_jsonly/ws/mustella/tests/basicTests/bin/js-debug/org/apache/royale/core/IMeasurementBead.js>
    [mxmlc] using source file: <http://apacheroyaleci.westus2.cloudapp.azure.com:8080/job/royale-asjs_jsonly/ws/mustella/tests/basicTests/bin/js-debug/UnitTester.js>
    [mxmlc] using source file: <http://apacheroyaleci.westus2.cloudapp.azure.com:8080/job/royale-asjs_jsonly/ws/mustella/tests/basicTests/bin/js-debug/org/apache/royale/core/IFlexInfo.js>
    [mxmlc] using source file: <http://apacheroyaleci.westus2.cloudapp.azure.com:8080/job/royale-asjs_jsonly/ws/mustella/tests/basicTests/bin/js-debug/org/apache/royale/core/IContentView.js>
    [mxmlc] using source file: <http://apacheroyaleci.westus2.cloudapp.azure.com:8080/job/royale-asjs_jsonly/ws/mustella/tests/basicTests/bin/js-debug/org/apache/royale/core/WrappedHTMLElement.js>
    [mxmlc] using source file: <http://apacheroyaleci.westus2.cloudapp.azure.com:8080/job/royale-asjs_jsonly/ws/mustella/tests/basicTests/bin/js-debug/org/apache/royale/core/layout/MarginData.js>
    [mxmlc] using source file: <http://apacheroyaleci.westus2.cloudapp.azure.com:8080/job/royale-asjs_jsonly/ws/mustella/tests/basicTests/bin/js-debug/org/apache/royale/core/ApplicationBase.js>
    [mxmlc] using source file: <http://apacheroyaleci.westus2.cloudapp.azure.com:8080/job/royale-asjs_jsonly/ws/mustella/tests/basicTests/bin/js-debug/org/apache/royale/utils/Timer.js>
    [mxmlc] using source file: <http://apacheroyaleci.westus2.cloudapp.azure.com:8080/job/royale-asjs_jsonly/ws/mustella/tests/basicTests/bin/js-debug/org/apache/royale/utils/StringUtil.js>
    [mxmlc] using source file: <http://apacheroyaleci.westus2.cloudapp.azure.com:8080/job/royale-asjs_jsonly/ws/mustella/tests/basicTests/bin/js-debug/org/apache/royale/html/supportClasses/CheckBoxIcon.js>
    [mxmlc] using source file: <http://apacheroyaleci.westus2.cloudapp.azure.com:8080/job/royale-asjs_jsonly/ws/mustella/tests/basicTests/bin/js-debug/org/apache/royale/html/Label.js>
    [mxmlc] using source file: <http://apacheroyaleci.westus2.cloudapp.azure.com:8080/job/royale-asjs_jsonly/ws/mustella/tests/basicTests/bin/js-debug/org/apache/royale/core/IBorderPaddingMarginValuesImpl.js>
    [mxmlc] using source file: <http://apacheroyaleci.westus2.cloudapp.azure.com:8080/job/royale-asjs_jsonly/ws/mustella/tests/basicTests/bin/js-debug/org/apache/royale/core/ICSSImpl.js>
    [mxmlc] using source file: <http://apacheroyaleci.westus2.cloudapp.azure.com:8080/job/royale-asjs_jsonly/ws/mustella/tests/basicTests/bin/js-debug/org/apache/royale/core/SimpleCSSValuesImpl.js>
    [mxmlc] using source file: <http://apacheroyaleci.westus2.cloudapp.azure.com:8080/job/royale-asjs_jsonly/ws/mustella/tests/basicTests/bin/js-debug/org/apache/royale/events/BrowserEvent.js>
    [mxmlc] using source file: <http://apacheroyaleci.westus2.cloudapp.azure.com:8080/job/royale-asjs_jsonly/ws/mustella/tests/basicTests/bin/js-debug/org/apache/royale/utils/PointUtils.js>
    [mxmlc] using source file: <http://apacheroyaleci.westus2.cloudapp.azure.com:8080/job/royale-asjs_jsonly/ws/mustella/tests/basicTests/bin/js-debug/org/apache/royale/core/layout/LayoutData.js>
    [mxmlc] using source file: <http://apacheroyaleci.westus2.cloudapp.azure.com:8080/job/royale-asjs_jsonly/ws/mustella/tests/basicTests/bin/js-debug/org/apache/royale/core/IViewport.js>
    [mxmlc] using source file: <http://apacheroyaleci.westus2.cloudapp.azure.com:8080/job/royale-asjs_jsonly/ws/mustella/tests/basicTests/bin/js-debug/org/apache/royale/html/supportClasses/Viewport.js>
    [mxmlc] using source file: <http://apacheroyaleci.westus2.cloudapp.azure.com:8080/job/royale-asjs_jsonly/ws/mustella/tests/basicTests/bin/js-debug/org/apache/royale/core/IBeadModel.js>
    [mxmlc] using source file: <http://apacheroyaleci.westus2.cloudapp.azure.com:8080/job/royale-asjs_jsonly/ws/mustella/tests/basicTests/bin/js-debug/org/apache/royale/core/IMXMLDocument.js>
    [mxmlc] using source file: <http://apacheroyaleci.westus2.cloudapp.azure.com:8080/job/royale-asjs_jsonly/ws/mustella/tests/basicTests/bin/js-debug/org/apache/royale/core/View.js>
    [mxmlc] using source file: <http://apacheroyaleci.westus2.cloudapp.azure.com:8080/job/royale-asjs_jsonly/ws/mustella/tests/basicTests/bin/js-debug/BasicTests.js>
    [mxmlc] using source file: <http://apacheroyaleci.westus2.cloudapp.azure.com:8080/job/royale-asjs_jsonly/ws/mustella/tests/basicTests/bin/js-debug/org/apache/royale/html/beads/layouts/VerticalLayout.js>
    [mxmlc] using source file: <http://apacheroyaleci.westus2.cloudapp.azure.com:8080/job/royale-asjs_jsonly/ws/mustella/tests/basicTests/bin/js-debug/org/apache/royale/core/IViewportModel.js>
    [mxmlc] using source file: <http://apacheroyaleci.westus2.cloudapp.azure.com:8080/job/royale-asjs_jsonly/ws/mustella/tests/basicTests/bin/js-debug/org/apache/royale/html/beads/models/ViewportModel.js>
    [mxmlc] using source file: <http://apacheroyaleci.westus2.cloudapp.azure.com:8080/job/royale-asjs_jsonly/ws/mustella/tests/basicTests/bin/js-debug/org/apache/royale/core/ContainerBaseStrandChildren.js>
    [mxmlc] using source file: <http://apacheroyaleci.westus2.cloudapp.azure.com:8080/job/royale-asjs_jsonly/ws/mustella/tests/basicTests/bin/js-debug/org/apache/royale/events/ValueChangeEvent.js>
    [mxmlc] using source file: <http://apacheroyaleci.westus2.cloudapp.azure.com:8080/job/royale-asjs_jsonly/ws/mustella/tests/basicTests/bin/js-debug/org/apache/royale/events/utils/MouseEventConverter.js>
    [mxmlc] using source file: <http://apacheroyaleci.westus2.cloudapp.azure.com:8080/job/royale-asjs_jsonly/ws/mustella/tests/basicTests/bin/js-debug/org/apache/royale/core/CSSFontFaceBead.js>
    [mxmlc] using source file: <http://apacheroyaleci.westus2.cloudapp.azure.com:8080/job/royale-asjs_jsonly/ws/mustella/tests/basicTests/bin/js-debug/org/apache/royale/utils/CSSUtils.js>
    [mxmlc] using source file: <http://apacheroyaleci.westus2.cloudapp.azure.com:8080/job/royale-asjs_jsonly/ws/mustella/tests/basicTests/bin/js-debug/org/apache/royale/html/Container.js>
    [mxmlc] using source file: <http://apacheroyaleci.westus2.cloudapp.azure.com:8080/job/royale-asjs_jsonly/ws/mustella/tests/basicTests/bin/js-debug/shim/VBox.js>
    [mxmlc] using source file: <http://apacheroyaleci.westus2.cloudapp.azure.com:8080/job/royale-asjs_jsonly/ws/mustella/tests/basicTests/bin/js-debug/halo/views/ButtonTests.js>
    [mxmlc] using source file: <http://apacheroyaleci.westus2.cloudapp.azure.com:8080/job/royale-asjs_jsonly/ws/mustella/tests/basicTests/bin/js-debug/org/apache/royale/core/IStatesImpl.js>
    [mxmlc] using source file: <http://apacheroyaleci.westus2.cloudapp.azure.com:8080/job/royale-asjs_jsonly/ws/mustella/tests/basicTests/bin/js-debug/org/apache/royale/core/ValuesManager.js>
    [mxmlc] using source file: <http://apacheroyaleci.westus2.cloudapp.azure.com:8080/job/royale-asjs_jsonly/ws/mustella/tests/basicTests/bin/js-debug/org/apache/royale/events/utils/KeyboardEventConverter.js>
    [mxmlc] using source file: <http://apacheroyaleci.westus2.cloudapp.azure.com:8080/job/royale-asjs_jsonly/ws/mustella/tests/basicTests/bin/js-debug/org/apache/royale/core/IInitialViewApplication.js>
    [mxmlc] using source file: <http://apacheroyaleci.westus2.cloudapp.azure.com:8080/job/royale-asjs_jsonly/ws/mustella/tests/basicTests/bin/js-debug/org/apache/royale/core/Application.js>
    [mxmlc] using source file: <http://apacheroyaleci.westus2.cloudapp.azure.com:8080/job/royale-asjs_jsonly/ws/mustella/tests/basicTests/bin/js-debug/org/apache/royale/states/SetProperty.js>
    [mxmlc] using source file: <http://apacheroyaleci.westus2.cloudapp.azure.com:8080/job/royale-asjs_jsonly/ws/mustella/tests/basicTests/bin/js-debug/org/apache/royale/core/SimpleStatesImpl.js>
    [mxmlc] using source file: <http://apacheroyaleci.westus2.cloudapp.azure.com:8080/job/royale-asjs_jsonly/ws/mustella/tests/basicTests/bin/js-debug/org/apache/royale/events/ValueEvent.js>
    [mxmlc] using source file: <http://apacheroyaleci.westus2.cloudapp.azure.com:8080/job/royale-asjs_jsonly/ws/mustella/tests/basicTests/bin/js-debug/halo/views/CheckBoxTests.js>
    [mxmlc] using source file: <http://apacheroyaleci.westus2.cloudapp.azure.com:8080/job/royale-asjs_jsonly/ws/mustella/tests/basicTests/bin/js-debug/org/apache/royale/utils/MXMLDataInterpreter.js>
    [mxmlc] using source file: <http://apacheroyaleci.westus2.cloudapp.azure.com:8080/job/royale-asjs_jsonly/ws/mustella/tests/basicTests/bin/js-debug/org/apache/royale/states/SetEventHandler.js>
    [mxmlc] using source file: <http://apacheroyaleci.westus2.cloudapp.azure.com:8080/job/royale-asjs_jsonly/ws/mustella/tests/basicTests/bin/js-debug/org/apache/royale/states/AddItems.js>
    [mxmlc] using source file: <http://apacheroyaleci.westus2.cloudapp.azure.com:8080/job/royale-asjs_jsonly/ws/mustella/tests/basicTests/bin/js-debug/org/apache/royale/events/KeyboardEvent.js>
    [mxmlc] using source file: <http://apacheroyaleci.westus2.cloudapp.azure.com:8080/job/royale-asjs_jsonly/ws/mustella/tests/basicTests/bin/js-debug/halo/scripts/ButtonTestScript.js>
    [mxmlc] using source file: <http://apacheroyaleci.westus2.cloudapp.azure.com:8080/job/royale-asjs_jsonly/ws/mustella/tests/basicTests/bin/js-debug/halo/scripts/CheckBoxTestScript.js>
    [mxmlc] using source file: <http://apacheroyaleci.westus2.cloudapp.azure.com:8080/job/royale-asjs_jsonly/ws/mustella/tests/basicTests/bin/js-debug/org/apache/royale/utils/OSUtils.js>
    [mxmlc] using source file: <http://apacheroyaleci.westus2.cloudapp.azure.com:8080/job/royale-asjs_jsonly/ws/mustella/tests/basicTests/bin/js-debug/org/apache/royale/utils/StringTrimmer.js>
    [mxmlc] using source file: <http://apacheroyaleci.westus2.cloudapp.azure.com:8080/job/royale-asjs_jsonly/ws/mustella/tests/basicTests/bin/js-debug/DispatchMouseClickEvent.js>
    [mxmlc] using source file: <http://apacheroyaleci.westus2.cloudapp.azure.com:8080/job/royale-asjs_jsonly/ws/mustella/tests/basicTests/bin/js-debug/DispatchMouseEvent.js>
    [mxmlc] using source file: <http://apacheroyaleci.westus2.cloudapp.azure.com:8080/job/royale-asjs_jsonly/ws/mustella/tests/basicTests/bin/js-debug/org/apache/royale/core/styles/BorderStyles.js>
    [mxmlc] using source file: <http://apacheroyaleci.westus2.cloudapp.azure.com:8080/job/royale-asjs_jsonly/ws/mustella/tests/basicTests/bin/js-debug/TestCase.js>
    [mxmlc] using source file: <http://apacheroyaleci.westus2.cloudapp.azure.com:8080/job/royale-asjs_jsonly/ws/mustella/tests/basicTests/bin/js-debug/org/apache/royale/events/utils/EventUtils.js>
    [mxmlc] using source file: <http://apacheroyaleci.westus2.cloudapp.azure.com:8080/job/royale-asjs_jsonly/ws/mustella/tests/basicTests/bin/js-debug/org/apache/royale/states/ItemAndDescriptor.js>
    [mxmlc] using source file: <http://apacheroyaleci.westus2.cloudapp.azure.com:8080/job/royale-asjs_jsonly/ws/mustella/tests/basicTests/bin/js-debug/org/apache/royale/geom/Point.js>
    [mxmlc] using source file: <http://apacheroyaleci.westus2.cloudapp.azure.com:8080/job/royale-asjs_jsonly/ws/mustella/tests/basicTests/bin/js-debug/SendFormattedResultsToLog.js>
    [mxmlc] using source file: <http://apacheroyaleci.westus2.cloudapp.azure.com:8080/job/royale-asjs_jsonly/ws/mustella/tests/basicTests/bin/js-debug/org/apache/royale/events/getTargetWrapper.js>
    [mxmlc] using source file: <http://apacheroyaleci.westus2.cloudapp.azure.com:8080/job/royale-asjs_jsonly/ws/mustella/tests/basicTests/bin/js-debug/org/apache/royale/events/ElementEvents.js>
    [mxmlc] using source file: <http://apacheroyaleci.westus2.cloudapp.azure.com:8080/job/royale-asjs_jsonly/ws/mustella/tests/basicTests/bin/js-debug/RoyaleContext.js>
    [mxmlc] using source file: <http://apacheroyaleci.westus2.cloudapp.azure.com:8080/job/royale-asjs_jsonly/ws/mustella/tests/basicTests/bin/js-debug/org/apache/royale/geom/Size.js>
    [mxmlc] using source file: <http://apacheroyaleci.westus2.cloudapp.azure.com:8080/job/royale-asjs_jsonly/ws/mustella/tests/basicTests/bin/js-debug/AssertPropertyValue.js>
    [mxmlc] using source file: <http://apacheroyaleci.westus2.cloudapp.azure.com:8080/job/royale-asjs_jsonly/ws/mustella/tests/basicTests/bin/js-debug/org/apache/royale/states/State.js>
    [mxmlc] using source file: <http://apacheroyaleci.westus2.cloudapp.azure.com:8080/job/royale-asjs_jsonly/ws/mustella/tests/basicTests/bin/js-debug/org/apache/royale/utils/StringPadder.js>
    [mxmlc] using source file: <http://apacheroyaleci.westus2.cloudapp.azure.com:8080/job/royale-asjs_jsonly/ws/mustella/tests/basicTests/bin/js-debug/org/apache/royale/events/utils/KeyConverter.js>
    [mxmlc] using source file: <http://apacheroyaleci.westus2.cloudapp.azure.com:8080/job/royale-asjs_jsonly/ws/mustella/tests/basicTests/bin/js-debug/ExitWhenDone.js>
    [mxmlc] using source file: <http://apacheroyaleci.westus2.cloudapp.azure.com:8080/job/royale-asjs_jsonly/ws/mustella/tests/basicTests/bin/js-debug/SetProperty.js>
    [mxmlc] using source file: <http://apacheroyaleci.westus2.cloudapp.azure.com:8080/job/royale-asjs_jsonly/ws/mustella/tests/basicTests/bin/js-debug/BasicTestsApp.js>
    [mxmlc] The project 'BasicTestsApp' has been successfully compiled and optimized.
    [mxmlc] 8.315572 seconds
    [mxmlc] Picked up JAVA_TOOL_OPTIONS: -Dfile.encoding=UTF-8 -Xmx512m

basictests-run-js:
     [echo] url=file://<http://apacheroyaleci.westus2.cloudapp.azure.com:8080/job/royale-asjs_jsonly/ws/mustella/tests/basicTests/bin/js-debug/index.html>
     [echo] script=<http://apacheroyaleci.westus2.cloudapp.azure.com:8080/job/royale-asjs_jsonly/ws/mustella/tests/basicTests/halo/scripts/ButtonTestScript.mxml>
     [echo] script=<http://apacheroyaleci.westus2.cloudapp.azure.com:8080/job/royale-asjs_jsonly/ws/mustella/tests/basicTests/halo/scripts/CheckBoxTestScript.mxml>
     [java] file://<http://apacheroyaleci.westus2.cloudapp.azure.com:8080/job/royale-asjs_jsonly/ws/mustella/tests/basicTests/bin/js-debug/index.html>
     [java] running script <http://apacheroyaleci.westus2.cloudapp.azure.com:8080/job/royale-asjs_jsonly/ws/mustella/tests/basicTests/halo/scripts/ButtonTestScript.mxml>
     [java] test case count: 2
     [java] target is undefined
     [java] Command duration or timeout: 19 milliseconds
     [java] Build info: version: '2.53.1', revision: 'a36b8b1', time: '2016-06-30 17:32:46'
     [java] System info: host: 'ApacheRoyaleCI', ip: '10.0.0.4', os.name: 'Windows Server
2016', os.arch: 'amd64', os.version: '10.0', java.version: '1.8.0_152'
     [java] Driver info: org.openqa.selenium.firefox.FirefoxDriver
     [java] Capabilities [{applicationCacheEnabled=true, rotatable=false, handlesAlerts=true,
databaseEnabled=true, version=47.0.2, platform=WINDOWS, nativeEvents=false, acceptSslCerts=true,
webStorageEnabled=true, locationContextEnabled=true, browserName=firefox, takesScreenshot=true,
javascriptEnabled=true, cssSelectorsEnabled=true}]
     [java] Session ID: 13d3fc85-f14e-4e37-af9b-0bae8f902e57
     [java] org.openqa.selenium.WebDriverException: target is undefined
     [java] Command duration or timeout: 19 milliseconds
     [java] Build info: version: '2.53.1', revision: 'a36b8b1', time: '2016-06-30 17:32:46'
     [java] System info: host: 'ApacheRoyaleCI', ip: '10.0.0.4', os.name: 'Windows Server
2016', os.arch: 'amd64', os.version: '10.0', java.version: '1.8.0_152'
     [java] Driver info: org.openqa.selenium.firefox.FirefoxDriver
     [java] Capabilities [{applicationCacheEnabled=true, rotatable=false, handlesAlerts=true,
databaseEnabled=true, version=47.0.2, platform=WINDOWS, nativeEvents=false, acceptSslCerts=true,
webStorageEnabled=true, locationContextEnabled=true, browserName=firefox, takesScreenshot=true,
javascriptEnabled=true, cssSelectorsEnabled=true}]
     [java] Session ID: 13d3fc85-f14e-4e37-af9b-0bae8f902e57
     [java] 	at sun.reflect.NativeConstructorAccessorImpl.newInstance0(Native Method)
     [java] 	at sun.reflect.NativeConstructorAccessorImpl.newInstance(NativeConstructorAccessorImpl.java:62)
     [java] 	at sun.reflect.DelegatingConstructorAccessorImpl.newInstance(DelegatingConstructorAccessorImpl.java:45)
     [java] 	at java.lang.reflect.Constructor.newInstance(Constructor.java:423)
     [java] 	at org.openqa.selenium.remote.ErrorHandler.createThrowable(ErrorHandler.java:206)
     [java] 	at org.openqa.selenium.remote.ErrorHandler.throwIfResponseFailed(ErrorHandler.java:158)
     [java] 	at org.openqa.selenium.remote.RemoteWebDriver.execute(RemoteWebDriver.java:678)
     [java] 	at org.openqa.selenium.remote.RemoteWebDriver.executeScript(RemoteWebDriver.java:577)
     [java] 	at marmotinni.AssertPropertyValue.doStep(Unknown Source)
     [java] 	at marmotinni.TestStep.execute(Unknown Source)
     [java] 	at marmotinni.TestCase.runSteps(Unknown Source)
     [java] 	at marmotinni.TestCase.runBody(Unknown Source)
     [java] 	at marmotinni.TestCase.runSetup(Unknown Source)
     [java] 	at marmotinni.TestCase.runTest(Unknown Source)
     [java] 	at marmotinni.MarmotinniRunner.runTest(Unknown Source)
     [java] 	at marmotinni.MarmotinniRunner.main(Unknown Source)
     [java] Caused by: org.openqa.selenium.WebDriverException: target is undefined
     [java] Build info: version: '2.53.1', revision: 'a36b8b1', time: '2016-06-30 17:32:46'
     [java] System info: host: 'ApacheRoyaleCI', ip: '10.0.0.4', os.name: 'Windows Server
2016', os.arch: 'amd64', os.version: '10.0', java.version: '1.8.0_152'
     [java] Driver info: driver.version: unknown
     [java] 	at <anonymous class>.anonymous(file:///C:/Program%20Files%20(x86)/Jenkins/workspace/royale-asjs_jsonly/mustella/tests/basicTests/bin/js-debug/index.html
line 69 > Function:1)
     [java] 	at <anonymous class>.handleEvaluateEvent(file:///C:/Program%20Files%20(x86)/Jenkins/workspace/royale-asjs_jsonly/mustella/tests/basicTests/bin/js-debug/index.html:69)
     [java] Picked up JAVA_TOOL_OPTIONS: -Dfile.encoding=UTF-8 -Xmx512m

BUILD FAILED
<http://apacheroyaleci.westus2.cloudapp.azure.com:8080/job/royale-asjs_jsonly/ws/build.xml>:1244:
Java returned: 1

Total time: 40 minutes 41 seconds
Picked up JAVA_TOOL_OPTIONS: -Dfile.encoding=UTF-8 -Xmx512m
Build step 'Invoke Ant' marked build as failure
Archiving artifacts


Mime
View raw message