royale-dev mailing list archives

Site index · List index
Message view « Date » · « Thread »
Top « Date » · « Thread »
From apacheroyal...@gmail.com
Subject Build failed in Jenkins: royale-asjs_jsonly #834
Date Tue, 22 May 2018 17:50:01 GMT
See <http://apacheroyaleci.westus2.cloudapp.azure.com:8080/job/royale-asjs_jsonly/834/display/redirect?page=changes>

Changes:

[carlosrovira] remove "return null" that can never be reach

[carlosrovira] add missing Bindable "dataProviderChanged" to allow reassign completely

[carlosrovira] add Bindable "dataProviderChanged" and example. We must notice that a

------------------------------------------
[...truncated 952.97 KB...]
     [java] May 22, 2018 5:49:53 PM com.google.javascript.jscomp.LoggerErrorManager println
     [java] WARNING: [https]:24: WARNING - accessing name require in externs has no effect.
Perhaps you forgot to add a var keyword?
     [java] var tls = require('tls');
     [java]           ^^^^^^^
     [java] 
     [java] May 22, 2018 5:49:53 PM com.google.javascript.jscomp.LoggerErrorManager println
     [java] WARNING: [https]:84: WARNING - name module is not defined in the externs.
     [java] module.exports = https;
     [java] ^^^^^^
     [java] 
     [java] May 22, 2018 5:49:53 PM com.google.javascript.jscomp.LoggerErrorManager println
     [java] WARNING: [net]:23: WARNING - accessing name require in externs has no effect.
Perhaps you forgot to add a var keyword?
     [java] var events = require('events');
     [java]              ^^^^^^^
     [java] 
     [java] May 22, 2018 5:49:53 PM com.google.javascript.jscomp.LoggerErrorManager println
     [java] WARNING: [net]:219: WARNING - name module is not defined in the externs.
     [java] module.exports = net;
     [java] ^^^^^^
     [java] 
     [java] May 22, 2018 5:49:53 PM com.google.javascript.jscomp.LoggerErrorManager println
     [java] WARNING: [os]:112: WARNING - name module is not defined in the externs.
     [java] module.exports = os;
     [java] ^^^^^^
     [java] 
     [java] May 22, 2018 5:49:53 PM com.google.javascript.jscomp.LoggerErrorManager println
     [java] WARNING: [path]:97: WARNING - name module is not defined in the externs.
     [java] module.exports = path;
     [java] ^^^^^^
     [java] 
     [java] May 22, 2018 5:49:53 PM com.google.javascript.jscomp.LoggerErrorManager println
     [java] WARNING: [punycode]:74: WARNING - name module is not defined in the externs.
     [java] module.exports = punycode;
     [java] ^^^^^^
     [java] 
     [java] May 22, 2018 5:49:53 PM com.google.javascript.jscomp.LoggerErrorManager println
     [java] WARNING: [querystring]:66: WARNING - name module is not defined in the externs.
     [java] module.exports = querystring;
     [java] ^^^^^^
     [java] 
     [java] May 22, 2018 5:49:53 PM com.google.javascript.jscomp.LoggerErrorManager println
     [java] WARNING: [readline]:22: WARNING - accessing name require in externs has no effect.
Perhaps you forgot to add a var keyword?
     [java] var events = require('events');
     [java]              ^^^^^^^
     [java] 
     [java] May 22, 2018 5:49:53 PM com.google.javascript.jscomp.LoggerErrorManager println
     [java] WARNING: [readline]:23: WARNING - accessing name require in externs has no effect.
Perhaps you forgot to add a var keyword?
     [java] var stream = require('stream');
     [java]              ^^^^^^^
     [java] 
     [java] May 22, 2018 5:49:53 PM com.google.javascript.jscomp.LoggerErrorManager println
     [java] WARNING: [readline]:84: WARNING - name module is not defined in the externs.
     [java] module.exports = readline;
     [java] ^^^^^^
     [java] 
     [java] May 22, 2018 5:49:53 PM com.google.javascript.jscomp.LoggerErrorManager println
     [java] WARNING: [repl]:23: WARNING - accessing name require in externs has no effect.
Perhaps you forgot to add a var keyword?
     [java] var events = require('events');
     [java]              ^^^^^^^
     [java] 
     [java] May 22, 2018 5:49:53 PM com.google.javascript.jscomp.LoggerErrorManager println
     [java] WARNING: [repl]:24: WARNING - accessing name require in externs has no effect.
Perhaps you forgot to add a var keyword?
     [java] var stream = require('stream');
     [java]              ^^^^^^^
     [java] 
     [java] May 22, 2018 5:49:53 PM com.google.javascript.jscomp.LoggerErrorManager println
     [java] WARNING: [repl]:48: WARNING - name module is not defined in the externs.
     [java] module.exports = repl;
     [java] ^^^^^^
     [java] 
     [java] May 22, 2018 5:49:53 PM com.google.javascript.jscomp.LoggerErrorManager println
     [java] WARNING: [stream]:23: WARNING - accessing name require in externs has no effect.
Perhaps you forgot to add a var keyword?
     [java] var events = require('events');
     [java]              ^^^^^^^
     [java] 
     [java] May 22, 2018 5:49:53 PM com.google.javascript.jscomp.LoggerErrorManager println
     [java] WARNING: [stream]:254: WARNING - name module is not defined in the externs.
     [java] module.exports = stream;
     [java] ^^^^^^
     [java] 
     [java] May 22, 2018 5:49:53 PM com.google.javascript.jscomp.LoggerErrorManager println
     [java] WARNING: [string_decoder]:52: WARNING - name module is not defined in the externs.
     [java] module.exports = StringDecoder;
     [java] ^^^^^^
     [java] 
     [java] May 22, 2018 5:49:53 PM com.google.javascript.jscomp.LoggerErrorManager println
     [java] WARNING: [tls]:23: WARNING - accessing name require in externs has no effect.
Perhaps you forgot to add a var keyword?
     [java] var crypto = require('crypto');
     [java]              ^^^^^^^
     [java] 
     [java] May 22, 2018 5:49:53 PM com.google.javascript.jscomp.LoggerErrorManager println
     [java] WARNING: [tls]:24: WARNING - accessing name require in externs has no effect.
Perhaps you forgot to add a var keyword?
     [java] var events = require('events');
     [java]              ^^^^^^^
     [java] 
     [java] May 22, 2018 5:49:53 PM com.google.javascript.jscomp.LoggerErrorManager println
     [java] WARNING: [tls]:25: WARNING - accessing name require in externs has no effect.
Perhaps you forgot to add a var keyword?
     [java] var net = require('net');
     [java]           ^^^^^^^
     [java] 
     [java] May 22, 2018 5:49:53 PM com.google.javascript.jscomp.LoggerErrorManager println
     [java] WARNING: [tls]:26: WARNING - accessing name require in externs has no effect.
Perhaps you forgot to add a var keyword?
     [java] var stream = require('stream');
     [java]              ^^^^^^^
     [java] 
     [java] May 22, 2018 5:49:53 PM com.google.javascript.jscomp.LoggerErrorManager println
     [java] WARNING: [tls]:148: WARNING - name module is not defined in the externs.
     [java] module.exports = tls;
     [java] ^^^^^^
     [java] 
     [java] May 22, 2018 5:49:53 PM com.google.javascript.jscomp.LoggerErrorManager println
     [java] WARNING: [tty]:23: WARNING - accessing name require in externs has no effect.
Perhaps you forgot to add a var keyword?
     [java] var net = require('net');
     [java]           ^^^^^^^
     [java] 
     [java] May 22, 2018 5:49:53 PM com.google.javascript.jscomp.LoggerErrorManager println
     [java] WARNING: [tty]:75: WARNING - name module is not defined in the externs.
     [java] module.exports = tty;
     [java] ^^^^^^
     [java] 
     [java] May 22, 2018 5:49:53 PM com.google.javascript.jscomp.LoggerErrorManager println
     [java] WARNING: [url]:57: WARNING - name module is not defined in the externs.
     [java] module.exports = url;
     [java] ^^^^^^
     [java] 
     [java] May 22, 2018 5:49:53 PM com.google.javascript.jscomp.LoggerErrorManager println
     [java] WARNING: [util]:112: WARNING - name module is not defined in the externs.
     [java] module.exports = util;
     [java] ^^^^^^
     [java] 
     [java] May 22, 2018 5:49:53 PM com.google.javascript.jscomp.LoggerErrorManager println
     [java] WARNING: [vm]:86: WARNING - name module is not defined in the externs.
     [java] module.exports = vm;
     [java] ^^^^^^
     [java] 
     [java] May 22, 2018 5:49:53 PM com.google.javascript.jscomp.LoggerErrorManager println
     [java] WARNING: [zlib]:23: WARNING - accessing name require in externs has no effect.
Perhaps you forgot to add a var keyword?
     [java] var stream = require('stream');
     [java]              ^^^^^^^
     [java] 
     [java] May 22, 2018 5:49:53 PM com.google.javascript.jscomp.LoggerErrorManager println
     [java] WARNING: [zlib]:386: WARNING - name module is not defined in the externs.
     [java] module.exports = zlib;
     [java] ^^^^^^
     [java] 
     [java] May 22, 2018 5:49:53 PM com.google.javascript.jscomp.LoggerErrorManager printSummary
     [java] WARNING: 0 error(s), 51 warning(s)
     [java] 2.3307608 seconds
     [java] Picked up JAVA_TOOL_OPTIONS: -Dfile.encoding=UTF-8

postprocess:

compc:
     [java] Loading configuration: C:\Program Files (x86)\Jenkins\workspace\royale-typedefs\node\target\compile-as-config.xml
     [java] 
     [java] 155403 bytes written to C:\Program Files (x86)\Jenkins\workspace\royale-typedefs\node\target\node.swc
in 2.479 seconds
     [java] Picked up JAVA_TOOL_OPTIONS: -Dfile.encoding=UTF-8

main:

download:
      [get] Getting: https://raw.githubusercontent.com/google/closure-compiler/master/contrib/externs/ace-1.2.3.js
      [get] To: C:\Program Files (x86)\Jenkins\workspace\royale-typedefs\ace\target\downloads\ace-1.2.3.js

double-check-file:
     [echo] ${env.ROYALE_DOWNLOAD_CACHE}
     [echo] Need file: ${still_no_file}

get-from-cache-if-needed:

fail-if-not-found:

preprocess:

externc:
     [java] 1.2771425 seconds
     [java] Picked up JAVA_TOOL_OPTIONS: -Dfile.encoding=UTF-8

postprocess:

compc:
     [java] Loading configuration: C:\Program Files (x86)\Jenkins\workspace\royale-typedefs\ace\target\compile-as-config.xml
     [java] 
     [java] 101420 bytes written to C:\Program Files (x86)\Jenkins\workspace\royale-typedefs\ace\target\ace-1.2.3.swc
in 1.951 seconds
     [java] Picked up JAVA_TOOL_OPTIONS: -Dfile.encoding=UTF-8

main:

ask-about-downloading-repos:

block-main:

check-if-ide:

check-compiler-home:
     [echo] env.ROYALE_COMPILER_REPO is ${env.ROYALE_COMPILER_REPO}
     [echo] ROYALE_COMPILER_REPO is ${ROYALE_COMPILER_REPO}
     [echo] ROYALE_COMPILER_REPO is <http://apacheroyaleci.westus2.cloudapp.azure.com:8080/job/royale-asjs_jsonly/ws/../royale-compiler>

check-compile-env:
     [echo] OS: Windows Server 2016 / 10.0 / amd64
     [echo] VM: Java HotSpot(TM) 64-Bit Server VM / 25.152-b16
     [echo] Java: 1.8.0_152
     [echo] Ant: Apache Ant(TM) version 1.9.9 compiled on February 2 2017 Ant Java Version:
1.8

thirdparty-downloads:

thirdparty-downloads:

pixelbender-check:

pixelbender-download:
    [mkdir] Created dir: <http://apacheroyaleci.westus2.cloudapp.azure.com:8080/job/royale-asjs_jsonly/ws/in>

get_from_mirror:

download_using_mirror:
      [get] Getting: http://www.apache.org/dyn/mirrors/mirrors.cgi/flex/pixelbender/1.0/binaries/apache-flex-sdk-pixel-bender-1.0.0-bin.zip?asjson=true
      [get] To: <http://apacheroyaleci.westus2.cloudapp.azure.com:8080/job/royale-asjs_jsonly/ws/frameworks/mirror.json>
      [get] .

check_mirror_json:

use_mirror:
   [delete] Deleting: <http://apacheroyaleci.westus2.cloudapp.azure.com:8080/job/royale-asjs_jsonly/ws/frameworks/mirror.json>
     [echo] Using mirror: http://apache.mesi.com.ar/
      [get] Getting: http://apache.mesi.com.ar/flex/pixelbender/1.0/binaries/apache-flex-sdk-pixel-bender-1.0.0-bin.zip
      [get] To: <http://apacheroyaleci.westus2.cloudapp.azure.com:8080/job/royale-asjs_jsonly/ws/in/apache-flex-sdk-pixel-bender-1.0.0-bin.zip>
      [get] Error opening connection java.io.IOException: Server returned HTTP response code:
403 for URL: http://apache.mesi.com.ar/flex/pixelbender/1.0/binaries/apache-flex-sdk-pixel-bender-1.0.0-bin.zip
      [get] Error opening connection java.io.IOException: Server returned HTTP response code:
403 for URL: http://apache.mesi.com.ar/flex/pixelbender/1.0/binaries/apache-flex-sdk-pixel-bender-1.0.0-bin.zip
      [get] Error opening connection java.io.IOException: Server returned HTTP response code:
403 for URL: http://apache.mesi.com.ar/flex/pixelbender/1.0/binaries/apache-flex-sdk-pixel-bender-1.0.0-bin.zip
      [get] Can't get http://apache.mesi.com.ar/flex/pixelbender/1.0/binaries/apache-flex-sdk-pixel-bender-1.0.0-bin.zip
to <http://apacheroyaleci.westus2.cloudapp.azure.com:8080/job/royale-asjs_jsonly/ws/in/apache-flex-sdk-pixel-bender-1.0.0-bin.zip>

download_using_get:

double-check-file:
     [echo] Need file: ${still_no_file}

get-from-cache-if-needed:

BUILD FAILED
<http://apacheroyaleci.westus2.cloudapp.azure.com:8080/job/royale-asjs_jsonly/ws/build.xml>:193:
The following error occurred while executing this line:
<http://apacheroyaleci.westus2.cloudapp.azure.com:8080/job/royale-asjs_jsonly/ws/frameworks/build.xml>:106:
The following error occurred while executing this line:
<http://apacheroyaleci.westus2.cloudapp.azure.com:8080/job/royale-asjs_jsonly/ws/frameworks/downloads.xml>:73:
src '<http://apacheroyaleci.westus2.cloudapp.azure.com:8080/job/royale-asjs_jsonly/ws/in/apache-flex-sdk-pixel-bender-1.0.0-bin.zip'>
doesn't exist.

Total time: 9 minutes 6 seconds
Picked up JAVA_TOOL_OPTIONS: -Dfile.encoding=UTF-8
Build step 'Invoke Ant' marked build as failure
Archiving artifacts

Mime
View raw message