royale-dev mailing list archives

Site index · List index
Message view « Date » · « Thread »
Top « Date » · « Thread »
From apacheroyal...@gmail.com
Subject Build failed in Jenkins: royale-asjs_jsonly #782
Date Fri, 11 May 2018 02:53:52 GMT
See <http://apacheroyaleci.westus2.cloudapp.azure.com:8080/job/royale-asjs_jsonly/782/display/redirect>

------------------------------------------
[...truncated 1.80 MB...]
    [mxmlc] C:/Program Files (x86)/Jenkins/workspace/royale-asjs_jsonly/mustella/tests/basicTests/bin/js-debug/org/apache/royale/html/beads/layouts/DataGridLayout.js
    [mxmlc] C:/Program Files (x86)/Jenkins/workspace/royale-asjs_jsonly/mustella/tests/basicTests/bin/js-debug/org/apache/royale/core/IItemRendererProvider.js
    [mxmlc] C:/Program Files (x86)/Jenkins/workspace/royale-asjs_jsonly/mustella/tests/basicTests/bin/js-debug/org/apache/royale/core/IList.js
    [mxmlc] C:/Program Files (x86)/Jenkins/workspace/royale-asjs_jsonly/mustella/tests/basicTests/bin/js-debug/org/apache/royale/core/IListWithPresentationModel.js
    [mxmlc] C:/Program Files (x86)/Jenkins/workspace/royale-asjs_jsonly/mustella/tests/basicTests/bin/js-debug/org/apache/royale/core/ILayoutView.js
    [mxmlc] C:/Program Files (x86)/Jenkins/workspace/royale-asjs_jsonly/mustella/tests/basicTests/bin/js-debug/org/apache/royale/core/IStrand.js
    [mxmlc] C:/Program Files (x86)/Jenkins/workspace/royale-asjs_jsonly/mustella/tests/basicTests/bin/js-debug/org/apache/royale/core/IStrandWithModel.js
    [mxmlc] C:/Program Files (x86)/Jenkins/workspace/royale-asjs_jsonly/mustella/tests/basicTests/bin/js-debug/org/apache/royale/core/IStyleableObject.js
    [mxmlc] C:/Program Files (x86)/Jenkins/workspace/royale-asjs_jsonly/mustella/tests/basicTests/bin/js-debug/org/apache/royale/core/IChild.js
    [mxmlc] C:/Program Files (x86)/Jenkins/workspace/royale-asjs_jsonly/mustella/tests/basicTests/bin/js-debug/org/apache/royale/core/IUIBase.js
    [mxmlc] C:/Program Files (x86)/Jenkins/workspace/royale-asjs_jsonly/mustella/tests/basicTests/bin/js-debug/org/apache/royale/core/ILayoutChild.js
    [mxmlc] C:/Program Files (x86)/Jenkins/workspace/royale-asjs_jsonly/mustella/tests/basicTests/bin/js-debug/org/apache/royale/core/IParentIUIBase.js
    [mxmlc] C:/Program Files (x86)/Jenkins/workspace/royale-asjs_jsonly/mustella/tests/basicTests/bin/js-debug/org/apache/royale/core/IRoyaleElement.js
    [mxmlc] C:/Program Files (x86)/Jenkins/workspace/royale-asjs_jsonly/mustella/tests/basicTests/bin/js-debug/org/apache/royale/core/HTMLElementWrapper.js
    [mxmlc] C:/Program Files (x86)/Jenkins/workspace/royale-asjs_jsonly/mustella/tests/basicTests/bin/js-debug/org/apache/royale/core/UIBase.js
    [mxmlc] C:/Program Files (x86)/Jenkins/workspace/royale-asjs_jsonly/mustella/tests/basicTests/bin/js-debug/org/apache/royale/core/IStatesObject.js
    [mxmlc] C:/Program Files (x86)/Jenkins/workspace/royale-asjs_jsonly/mustella/tests/basicTests/bin/js-debug/org/apache/royale/core/ILayoutParent.js
    [mxmlc] C:/Program Files (x86)/Jenkins/workspace/royale-asjs_jsonly/mustella/tests/basicTests/bin/js-debug/org/apache/royale/core/IContainer.js
    [mxmlc] C:/Program Files (x86)/Jenkins/workspace/royale-asjs_jsonly/mustella/tests/basicTests/bin/js-debug/org/apache/royale/core/GroupBase.js
    [mxmlc] C:/Program Files (x86)/Jenkins/workspace/royale-asjs_jsonly/mustella/tests/basicTests/bin/js-debug/org/apache/royale/core/ContainerBase.js
    [mxmlc] C:/Program Files (x86)/Jenkins/workspace/royale-asjs_jsonly/mustella/tests/basicTests/bin/js-debug/org/apache/royale/core/IItemRendererParent.js
    [mxmlc] C:/Program Files (x86)/Jenkins/workspace/royale-asjs_jsonly/mustella/tests/basicTests/bin/js-debug/org/apache/royale/core/DataContainerBase.js
    [mxmlc] C:/Program Files (x86)/Jenkins/workspace/royale-asjs_jsonly/mustella/tests/basicTests/bin/js-debug/org/apache/royale/html/DataContainer.js
    [mxmlc] C:/Program Files (x86)/Jenkins/workspace/royale-asjs_jsonly/mustella/tests/basicTests/bin/js-debug/org/apache/royale/html/List.js
    [mxmlc] C:/Program Files (x86)/Jenkins/workspace/royale-asjs_jsonly/mustella/tests/basicTests/bin/js-debug/org/apache/royale/html/ButtonBar.js
    [mxmlc] C:/Program Files (x86)/Jenkins/workspace/royale-asjs_jsonly/mustella/tests/basicTests/bin/js-debug/org/apache/royale/core/IBeadModel.js
    [mxmlc] C:/Program Files (x86)/Jenkins/workspace/royale-asjs_jsonly/mustella/tests/basicTests/bin/js-debug/org/apache/royale/core/IRollOverModel.js
    [mxmlc] C:/Program Files (x86)/Jenkins/workspace/royale-asjs_jsonly/mustella/tests/basicTests/bin/js-debug/org/apache/royale/core/IDataProviderModel.js
    [mxmlc] C:/Program Files (x86)/Jenkins/workspace/royale-asjs_jsonly/mustella/tests/basicTests/bin/js-debug/org/apache/royale/core/ISelectionModel.js
    [mxmlc] C:/Program Files (x86)/Jenkins/workspace/royale-asjs_jsonly/mustella/tests/basicTests/bin/js-debug/org/apache/royale/html/beads/models/SingleSelectionCollectionViewModel.js
    [mxmlc] C:/Program Files (x86)/Jenkins/workspace/royale-asjs_jsonly/mustella/tests/basicTests/bin/js-debug/org/apache/royale/core/IDataGridModel.js
    [mxmlc] C:/Program Files (x86)/Jenkins/workspace/royale-asjs_jsonly/mustella/tests/basicTests/bin/js-debug/org/apache/royale/html/beads/models/DataGridCollectionViewModel.js
    [mxmlc] C:/Program Files (x86)/Jenkins/workspace/royale-asjs_jsonly/mustella/tests/basicTests/bin/js-debug/org/apache/royale/core/IViewport.js
    [mxmlc] C:/Program Files (x86)/Jenkins/workspace/royale-asjs_jsonly/mustella/tests/basicTests/bin/js-debug/org/apache/royale/core/IScrollingViewport.js
    [mxmlc] C:/Program Files (x86)/Jenkins/workspace/royale-asjs_jsonly/mustella/tests/basicTests/bin/js-debug/org/apache/royale/core/beads/views/ContainerView.js
    [mxmlc] C:/Program Files (x86)/Jenkins/workspace/royale-asjs_jsonly/mustella/tests/basicTests/bin/js-debug/org/apache/royale/core/IItemRenderer.js
    [mxmlc] C:/Program Files (x86)/Jenkins/workspace/royale-asjs_jsonly/mustella/tests/basicTests/bin/js-debug/org/apache/royale/core/ISelectableItemRenderer.js
    [mxmlc] C:/Program Files (x86)/Jenkins/workspace/royale-asjs_jsonly/mustella/tests/basicTests/bin/js-debug/org/apache/royale/core/IDocument.js
    [mxmlc] C:/Program Files (x86)/Jenkins/workspace/royale-asjs_jsonly/mustella/tests/basicTests/bin/js-debug/org/apache/royale/html/beads/layouts/BasicLayout.js
    [mxmlc] C:/Program Files (x86)/Jenkins/workspace/royale-asjs_jsonly/mustella/tests/basicTests/bin/js-debug/org/apache/royale/core/IChangePropagator.js
    [mxmlc] C:/Program Files (x86)/Jenkins/workspace/royale-asjs_jsonly/mustella/tests/basicTests/bin/js-debug/org/apache/royale/core/IBeadController.js
    [mxmlc] C:/Program Files (x86)/Jenkins/workspace/royale-asjs_jsonly/mustella/tests/basicTests/bin/js-debug/org/apache/royale/core/IListView.js
    [mxmlc] C:/Program Files (x86)/Jenkins/workspace/royale-asjs_jsonly/mustella/tests/basicTests/bin/js-debug/org/apache/royale/core/beads/views/DataContainerView.js
    [mxmlc] C:/Program Files (x86)/Jenkins/workspace/royale-asjs_jsonly/mustella/tests/basicTests/bin/js-debug/org/apache/royale/html/beads/ListView.js
    [mxmlc] C:/Program Files (x86)/Jenkins/workspace/royale-asjs_jsonly/mustella/tests/basicTests/bin/js-debug/org/apache/royale/utils/MixinManager.js
    [mxmlc] C:/Program Files (x86)/Jenkins/workspace/royale-asjs_jsonly/mustella/tests/basicTests/bin/js-debug/org/apache/royale/core/IFactory.js
    [mxmlc] C:/Program Files (x86)/Jenkins/workspace/royale-asjs_jsonly/mustella/tests/basicTests/bin/js-debug/org/apache/royale/core/ClassFactory.js
    [mxmlc] C:/Program Files (x86)/Jenkins/workspace/royale-asjs_jsonly/mustella/tests/basicTests/bin/js-debug/org/apache/royale/events/IBrowserEvent.js
    [mxmlc] C:/Program Files (x86)/Jenkins/workspace/royale-asjs_jsonly/mustella/tests/basicTests/bin/js-debug/org/apache/royale/events/MouseEvent.js
    [mxmlc] C:/Program Files (x86)/Jenkins/workspace/royale-asjs_jsonly/mustella/tests/basicTests/bin/js-debug/org/apache/royale/core/UIItemRendererBase.js
    [mxmlc] C:/Program Files (x86)/Jenkins/workspace/royale-asjs_jsonly/mustella/tests/basicTests/bin/js-debug/org/apache/royale/html/ButtonBase.js
    [mxmlc] C:/Program Files (x86)/Jenkins/workspace/royale-asjs_jsonly/mustella/tests/basicTests/bin/js-debug/org/apache/royale/html/Button.js
    [mxmlc] C:/Program Files (x86)/Jenkins/workspace/royale-asjs_jsonly/mustella/tests/basicTests/bin/js-debug/org/apache/royale/html/TextButton.js
    [mxmlc] C:/Program Files (x86)/Jenkins/workspace/royale-asjs_jsonly/mustella/tests/basicTests/bin/js-debug/org/apache/royale/core/beads/models/ArraySelectionModel.js
    [mxmlc] C:/Program Files (x86)/Jenkins/workspace/royale-asjs_jsonly/mustella/tests/basicTests/bin/js-debug/org/apache/royale/html/beads/models/ButtonBarModel.js
    [mxmlc] C:/Program Files (x86)/Jenkins/workspace/royale-asjs_jsonly/mustella/tests/basicTests/bin/js-debug/org/apache/royale/html/beads/layouts/HorizontalLayout.js
    [mxmlc] C:/Program Files (x86)/Jenkins/workspace/royale-asjs_jsonly/mustella/tests/basicTests/bin/js-debug/org/apache/royale/html/CheckBox.js
    [mxmlc] C:/Program Files (x86)/Jenkins/workspace/royale-asjs_jsonly/mustella/tests/basicTests/bin/js-debug/org/apache/royale/core/IPopUpHost.js
    [mxmlc] C:/Program Files (x86)/Jenkins/workspace/royale-asjs_jsonly/mustella/tests/basicTests/bin/js-debug/org/apache/royale/core/IApplicationView.js
    [mxmlc] C:/Program Files (x86)/Jenkins/workspace/royale-asjs_jsonly/mustella/tests/basicTests/bin/js-debug/org/apache/royale/core/ViewBase.js
    [mxmlc] C:/Program Files (x86)/Jenkins/workspace/royale-asjs_jsonly/mustella/tests/basicTests/bin/js-debug/org/apache/royale/core/layout/EdgeData.js
    [mxmlc] C:/Program Files (x86)/Jenkins/workspace/royale-asjs_jsonly/mustella/tests/basicTests/bin/js-debug/org/apache/royale/html/util/addElementToWrapper.js
    [mxmlc] C:/Program Files (x86)/Jenkins/workspace/royale-asjs_jsonly/mustella/tests/basicTests/bin/js-debug/org/apache/royale/collections/ICollection.js
    [mxmlc] C:/Program Files (x86)/Jenkins/workspace/royale-asjs_jsonly/mustella/tests/basicTests/bin/js-debug/org/apache/royale/core/IValuesImpl.js
    [mxmlc] C:/Program Files (x86)/Jenkins/workspace/royale-asjs_jsonly/mustella/tests/basicTests/bin/js-debug/org/apache/royale/html/beads/models/DataGridModel.js
    [mxmlc] C:/Program Files (x86)/Jenkins/workspace/royale-asjs_jsonly/mustella/tests/basicTests/bin/js-debug/org/apache/royale/html/beads/DataFieldProviderBead.js
    [mxmlc] C:/Program Files (x86)/Jenkins/workspace/royale-asjs_jsonly/mustella/tests/basicTests/bin/js-debug/org/apache/royale/utils/Language.js
    [mxmlc] C:/Program Files (x86)/Jenkins/workspace/royale-asjs_jsonly/mustella/tests/basicTests/bin/js-debug/org/apache/royale/core/IMeasurementBead.js
    [mxmlc] C:/Program Files (x86)/Jenkins/workspace/royale-asjs_jsonly/mustella/tests/basicTests/bin/js-debug/UnitTester.js
    [mxmlc] C:/Program Files (x86)/Jenkins/workspace/royale-asjs_jsonly/mustella/tests/basicTests/bin/js-debug/org/apache/royale/html/beads/layouts/ButtonBarLayout.js
    [mxmlc] C:/Program Files (x86)/Jenkins/workspace/royale-asjs_jsonly/mustella/tests/basicTests/bin/js-debug/org/apache/royale/core/IFlexInfo.js
    [mxmlc] C:/Program Files (x86)/Jenkins/workspace/royale-asjs_jsonly/mustella/tests/basicTests/bin/js-debug/org/apache/royale/core/IContentView.js
    [mxmlc] C:/Program Files (x86)/Jenkins/workspace/royale-asjs_jsonly/mustella/tests/basicTests/bin/js-debug/org/apache/royale/html/beads/controllers/ItemRendererMouseController.js
    [mxmlc] C:/Program Files (x86)/Jenkins/workspace/royale-asjs_jsonly/mustella/tests/basicTests/bin/js-debug/org/apache/royale/core/supportClasses/Viewport.js
    [mxmlc] C:/Program Files (x86)/Jenkins/workspace/royale-asjs_jsonly/mustella/tests/basicTests/bin/js-debug/org/apache/royale/html/beads/ITextItemRenderer.js
    [mxmlc] C:/Program Files (x86)/Jenkins/workspace/royale-asjs_jsonly/mustella/tests/basicTests/bin/js-debug/org/apache/royale/core/DataItemRenderer.js
    [mxmlc] C:/Program Files (x86)/Jenkins/workspace/royale-asjs_jsonly/mustella/tests/basicTests/bin/js-debug/org/apache/royale/html/supportClasses/StringItemRenderer.js
    [mxmlc] C:/Program Files (x86)/Jenkins/workspace/royale-asjs_jsonly/mustella/tests/basicTests/bin/js-debug/org/apache/royale/core/WrappedHTMLElement.js
    [mxmlc] C:/Program Files (x86)/Jenkins/workspace/royale-asjs_jsonly/mustella/tests/basicTests/bin/js-debug/org/apache/royale/core/layout/MarginData.js
    [mxmlc] C:/Program Files (x86)/Jenkins/workspace/royale-asjs_jsonly/mustella/tests/basicTests/bin/js-debug/org/apache/royale/core/ApplicationBase.js
    [mxmlc] C:/Program Files (x86)/Jenkins/workspace/royale-asjs_jsonly/mustella/tests/basicTests/bin/js-debug/org/apache/royale/html/beads/controllers/ListSingleSelectionMouseController.js
    [mxmlc] C:/Program Files (x86)/Jenkins/workspace/royale-asjs_jsonly/mustella/tests/basicTests/bin/js-debug/org/apache/royale/collections/ICollectionView.js
    [mxmlc] C:/Program Files (x86)/Jenkins/workspace/royale-asjs_jsonly/mustella/tests/basicTests/bin/js-debug/org/apache/royale/utils/Timer.js
    [mxmlc] C:/Program Files (x86)/Jenkins/workspace/royale-asjs_jsonly/mustella/tests/basicTests/bin/js-debug/org/apache/royale/utils/StringUtil.js
    [mxmlc] C:/Program Files (x86)/Jenkins/workspace/royale-asjs_jsonly/mustella/tests/basicTests/bin/js-debug/org/apache/royale/html/supportClasses/DataGridColumnList.js
    [mxmlc] C:/Program Files (x86)/Jenkins/workspace/royale-asjs_jsonly/mustella/tests/basicTests/bin/js-debug/org/apache/royale/html/supportClasses/CheckBoxIcon.js
    [mxmlc] C:/Program Files (x86)/Jenkins/workspace/royale-asjs_jsonly/mustella/tests/basicTests/bin/js-debug/org/apache/royale/html/supportClasses/TextButtonItemRenderer.js
    [mxmlc] C:/Program Files (x86)/Jenkins/workspace/royale-asjs_jsonly/mustella/tests/basicTests/bin/js-debug/org/apache/royale/core/IMXMLDocument.js
    [mxmlc] C:/Program Files (x86)/Jenkins/workspace/royale-asjs_jsonly/mustella/tests/basicTests/bin/js-debug/org/apache/royale/core/Container.js
    [mxmlc] C:/Program Files (x86)/Jenkins/workspace/royale-asjs_jsonly/mustella/tests/basicTests/bin/js-debug/org/apache/royale/core/IDataProviderItemRendererMapper.js
    [mxmlc] C:/Program Files (x86)/Jenkins/workspace/royale-asjs_jsonly/mustella/tests/basicTests/bin/js-debug/org/apache/royale/html/beads/TextItemRendererFactoryForArrayData.js
    [mxmlc] C:/Program Files (x86)/Jenkins/workspace/royale-asjs_jsonly/mustella/tests/basicTests/bin/js-debug/org/apache/royale/html/Label.js
    [mxmlc] C:/Program Files (x86)/Jenkins/workspace/royale-asjs_jsonly/mustella/tests/basicTests/bin/js-debug/org/apache/royale/core/IBorderPaddingMarginValuesImpl.js
    [mxmlc] C:/Program Files (x86)/Jenkins/workspace/royale-asjs_jsonly/mustella/tests/basicTests/bin/js-debug/org/apache/royale/core/ICSSImpl.js
    [mxmlc] C:/Program Files (x86)/Jenkins/workspace/royale-asjs_jsonly/mustella/tests/basicTests/bin/js-debug/org/apache/royale/core/SimpleCSSValuesImpl.js
    [mxmlc] C:/Program Files (x86)/Jenkins/workspace/royale-asjs_jsonly/mustella/tests/basicTests/bin/js-debug/org/apache/royale/events/ItemClickedEvent.js
    [mxmlc] C:/Program Files (x86)/Jenkins/workspace/royale-asjs_jsonly/mustella/tests/basicTests/bin/js-debug/org/apache/royale/html/supportClasses/ScrollingViewport.js
    [mxmlc] C:/Program Files (x86)/Jenkins/workspace/royale-asjs_jsonly/mustella/tests/basicTests/bin/js-debug/org/apache/royale/core/IItemRendererClassFactory.js
    [mxmlc] C:/Program Files (x86)/Jenkins/workspace/royale-asjs_jsonly/mustella/tests/basicTests/bin/js-debug/org/apache/royale/events/BrowserEvent.js
    [mxmlc] C:/Program Files (x86)/Jenkins/workspace/royale-asjs_jsonly/mustella/tests/basicTests/bin/js-debug/org/apache/royale/html/beads/models/DataProviderModel.js
    [mxmlc] C:/Program Files (x86)/Jenkins/workspace/royale-asjs_jsonly/mustella/tests/basicTests/bin/js-debug/org/apache/royale/utils/PointUtils.js
    [mxmlc] C:/Program Files (x86)/Jenkins/workspace/royale-asjs_jsonly/mustella/tests/basicTests/bin/js-debug/org/apache/royale/core/layout/LayoutData.js
    [mxmlc] C:/Program Files (x86)/Jenkins/workspace/royale-asjs_jsonly/mustella/tests/basicTests/bin/js-debug/org/apache/royale/html/beads/DataItemRendererFactoryForCollectionView.js
    [mxmlc] C:/Program Files (x86)/Jenkins/workspace/royale-asjs_jsonly/mustella/tests/basicTests/bin/js-debug/org/apache/royale/core/View.js
    [mxmlc] C:/Program Files (x86)/Jenkins/workspace/royale-asjs_jsonly/mustella/tests/basicTests/bin/js-debug/BasicTests.js
    [mxmlc] C:/Program Files (x86)/Jenkins/workspace/royale-asjs_jsonly/mustella/tests/basicTests/bin/js-debug/org/apache/royale/html/beads/layouts/VerticalLayout.js
    [mxmlc] C:/Program Files (x86)/Jenkins/workspace/royale-asjs_jsonly/mustella/tests/basicTests/bin/js-debug/org/apache/royale/core/ContainerBaseStrandChildren.js
    [mxmlc] C:/Program Files (x86)/Jenkins/workspace/royale-asjs_jsonly/mustella/tests/basicTests/bin/js-debug/org/apache/royale/html/supportClasses/IDataGridColumn.js
    [mxmlc] C:/Program Files (x86)/Jenkins/workspace/royale-asjs_jsonly/mustella/tests/basicTests/bin/js-debug/org/apache/royale/events/CollectionEvent.js
    [mxmlc] C:/Program Files (x86)/Jenkins/workspace/royale-asjs_jsonly/mustella/tests/basicTests/bin/js-debug/org/apache/royale/events/ValueChangeEvent.js
    [mxmlc] C:/Program Files (x86)/Jenkins/workspace/royale-asjs_jsonly/mustella/tests/basicTests/bin/js-debug/org/apache/royale/core/IViewportModel.js
    [mxmlc] C:/Program Files (x86)/Jenkins/workspace/royale-asjs_jsonly/mustella/tests/basicTests/bin/js-debug/org/apache/royale/events/utils/MouseEventConverter.js
    [mxmlc] C:/Program Files (x86)/Jenkins/workspace/royale-asjs_jsonly/mustella/tests/basicTests/bin/js-debug/org/apache/royale/core/CSSFontFaceBead.js
    [mxmlc] C:/Program Files (x86)/Jenkins/workspace/royale-asjs_jsonly/mustella/tests/basicTests/bin/js-debug/org/apache/royale/html/beads/DataItemRendererFactoryForArrayData.js
    [mxmlc] C:/Program Files (x86)/Jenkins/workspace/royale-asjs_jsonly/mustella/tests/basicTests/bin/js-debug/org/apache/royale/core/IListPresentationModel.js
    [mxmlc] C:/Program Files (x86)/Jenkins/workspace/royale-asjs_jsonly/mustella/tests/basicTests/bin/js-debug/org/apache/royale/html/beads/models/ListPresentationModel.js
    [mxmlc] C:/Program Files (x86)/Jenkins/workspace/royale-asjs_jsonly/mustella/tests/basicTests/bin/js-debug/org/apache/royale/utils/CSSUtils.js
    [mxmlc] C:/Program Files (x86)/Jenkins/workspace/royale-asjs_jsonly/mustella/tests/basicTests/bin/js-debug/org/apache/royale/html/beads/ButtonBarView.js
    [mxmlc] C:/Program Files (x86)/Jenkins/workspace/royale-asjs_jsonly/mustella/tests/basicTests/bin/js-debug/org/apache/royale/html/Container.js
    [mxmlc] C:/Program Files (x86)/Jenkins/workspace/royale-asjs_jsonly/mustella/tests/basicTests/bin/js-debug/shim/VBox.js
    [mxmlc] C:/Program Files (x86)/Jenkins/workspace/royale-asjs_jsonly/mustella/tests/basicTests/bin/js-debug/halo/views/ButtonTests.js
    [mxmlc] C:/Program Files (x86)/Jenkins/workspace/royale-asjs_jsonly/mustella/tests/basicTests/bin/js-debug/org/apache/royale/html/beads/DataGridColumnChangePropagator.js
    [mxmlc] C:/Program Files (x86)/Jenkins/workspace/royale-asjs_jsonly/mustella/tests/basicTests/bin/js-debug/org/apache/royale/core/IDataGridPresentationModel.js
    [mxmlc] C:/Program Files (x86)/Jenkins/workspace/royale-asjs_jsonly/mustella/tests/basicTests/bin/js-debug/org/apache/royale/core/IStatesImpl.js
    [mxmlc] C:/Program Files (x86)/Jenkins/workspace/royale-asjs_jsonly/mustella/tests/basicTests/bin/js-debug/org/apache/royale/core/ValuesManager.js
    [mxmlc] C:/Program Files (x86)/Jenkins/workspace/royale-asjs_jsonly/mustella/tests/basicTests/bin/js-debug/org/apache/royale/events/utils/KeyboardEventConverter.js
    [mxmlc] C:/Program Files (x86)/Jenkins/workspace/royale-asjs_jsonly/mustella/tests/basicTests/bin/js-debug/org/apache/royale/core/IInitialViewApplication.js
    [mxmlc] C:/Program Files (x86)/Jenkins/workspace/royale-asjs_jsonly/mustella/tests/basicTests/bin/js-debug/org/apache/royale/core/Application.js
    [mxmlc] C:/Program Files (x86)/Jenkins/workspace/royale-asjs_jsonly/mustella/tests/basicTests/bin/js-debug/org/apache/royale/states/SetProperty.js
    [mxmlc] C:/Program Files (x86)/Jenkins/workspace/royale-asjs_jsonly/mustella/tests/basicTests/bin/js-debug/org/apache/royale/html/DataGridButtonBar.js
    [mxmlc] C:/Program Files (x86)/Jenkins/workspace/royale-asjs_jsonly/mustella/tests/basicTests/bin/js-debug/org/apache/royale/core/SimpleStatesImpl.js
    [mxmlc] C:/Program Files (x86)/Jenkins/workspace/royale-asjs_jsonly/mustella/tests/basicTests/bin/js-debug/org/apache/royale/events/ValueEvent.js
    [mxmlc] C:/Program Files (x86)/Jenkins/workspace/royale-asjs_jsonly/mustella/tests/basicTests/bin/js-debug/org/apache/royale/events/ItemAddedEvent.js
    [mxmlc] C:/Program Files (x86)/Jenkins/workspace/royale-asjs_jsonly/mustella/tests/basicTests/bin/js-debug/halo/views/CheckBoxTests.js
    [mxmlc] C:/Program Files (x86)/Jenkins/workspace/royale-asjs_jsonly/mustella/tests/basicTests/bin/js-debug/org/apache/royale/utils/MXMLDataInterpreter.js
    [mxmlc] C:/Program Files (x86)/Jenkins/workspace/royale-asjs_jsonly/mustella/tests/basicTests/bin/js-debug/org/apache/royale/html/DataGrid.js
    [mxmlc] C:/Program Files (x86)/Jenkins/workspace/royale-asjs_jsonly/mustella/tests/basicTests/bin/js-debug/org/apache/royale/states/SetEventHandler.js
    [mxmlc] C:/Program Files (x86)/Jenkins/workspace/royale-asjs_jsonly/mustella/tests/basicTests/bin/js-debug/org/apache/royale/events/ItemRendererEvent.js
    [mxmlc] C:/Program Files (x86)/Jenkins/workspace/royale-asjs_jsonly/mustella/tests/basicTests/bin/js-debug/org/apache/royale/html/supportClasses/DataGridColumn.js
    [mxmlc] C:/Program Files (x86)/Jenkins/workspace/royale-asjs_jsonly/mustella/tests/basicTests/bin/js-debug/org/apache/royale/states/AddItems.js
    [mxmlc] C:/Program Files (x86)/Jenkins/workspace/royale-asjs_jsonly/mustella/tests/basicTests/bin/js-debug/org/apache/royale/html/beads/models/DataGridPresentationModel.js
    [mxmlc] C:/Program Files (x86)/Jenkins/workspace/royale-asjs_jsonly/mustella/tests/basicTests/bin/js-debug/org/apache/royale/core/Strand.js
    [mxmlc] C:/Program Files (x86)/Jenkins/workspace/royale-asjs_jsonly/mustella/tests/basicTests/bin/js-debug/org/apache/royale/events/KeyboardEvent.js
    [mxmlc] C:/Program Files (x86)/Jenkins/workspace/royale-asjs_jsonly/mustella/tests/basicTests/bin/js-debug/halo/scripts/ButtonTestScript.js
    [mxmlc] C:/Program Files (x86)/Jenkins/workspace/royale-asjs_jsonly/mustella/tests/basicTests/bin/js-debug/org/apache/royale/core/ItemRendererClassFactory.js
    [mxmlc] C:/Program Files (x86)/Jenkins/workspace/royale-asjs_jsonly/mustella/tests/basicTests/bin/js-debug/halo/scripts/CheckBoxTestScript.js
    [mxmlc] C:/Program Files (x86)/Jenkins/workspace/royale-asjs_jsonly/mustella/tests/basicTests/bin/js-debug/org/apache/royale/core/beads/models/ViewportModel.js
    [mxmlc] C:/Program Files (x86)/Jenkins/workspace/royale-asjs_jsonly/mustella/tests/basicTests/bin/js-debug/org/apache/royale/utils/OSUtils.js
    [mxmlc] C:/Program Files (x86)/Jenkins/workspace/royale-asjs_jsonly/mustella/tests/basicTests/bin/js-debug/org/apache/royale/utils/StringTrimmer.js
    [mxmlc] C:/Program Files (x86)/Jenkins/workspace/royale-asjs_jsonly/mustella/tests/basicTests/bin/js-debug/DispatchMouseClickEvent.js
    [mxmlc] C:/Program Files (x86)/Jenkins/workspace/royale-asjs_jsonly/mustella/tests/basicTests/bin/js-debug/DispatchMouseEvent.js
    [mxmlc] C:/Program Files (x86)/Jenkins/workspace/royale-asjs_jsonly/mustella/tests/basicTests/bin/js-debug/org/apache/royale/core/SimpleCSSStyles.js
    [mxmlc] C:/Program Files (x86)/Jenkins/workspace/royale-asjs_jsonly/mustella/tests/basicTests/bin/js-debug/org/apache/royale/core/SimpleCSSStylesWithFlex.js
    [mxmlc] C:/Program Files (x86)/Jenkins/workspace/royale-asjs_jsonly/mustella/tests/basicTests/bin/js-debug/org/apache/royale/core/styles/BorderStyles.js
    [mxmlc] C:/Program Files (x86)/Jenkins/workspace/royale-asjs_jsonly/mustella/tests/basicTests/bin/js-debug/TestCase.js
    [mxmlc] C:/Program Files (x86)/Jenkins/workspace/royale-asjs_jsonly/mustella/tests/basicTests/bin/js-debug/org/apache/royale/events/utils/EventUtils.js
    [mxmlc] C:/Program Files (x86)/Jenkins/workspace/royale-asjs_jsonly/mustella/tests/basicTests/bin/js-debug/org/apache/royale/states/ItemAndDescriptor.js
    [mxmlc] C:/Program Files (x86)/Jenkins/workspace/royale-asjs_jsonly/mustella/tests/basicTests/bin/js-debug/org/apache/royale/geom/Point.js
    [mxmlc] C:/Program Files (x86)/Jenkins/workspace/royale-asjs_jsonly/mustella/tests/basicTests/bin/js-debug/SendFormattedResultsToLog.js
    [mxmlc] C:/Program Files (x86)/Jenkins/workspace/royale-asjs_jsonly/mustella/tests/basicTests/bin/js-debug/org/apache/royale/events/getTargetWrapper.js
    [mxmlc] C:/Program Files (x86)/Jenkins/workspace/royale-asjs_jsonly/mustella/tests/basicTests/bin/js-debug/org/apache/royale/events/ElementEvents.js
    [mxmlc] C:/Program Files (x86)/Jenkins/workspace/royale-asjs_jsonly/mustella/tests/basicTests/bin/js-debug/RoyaleContext.js
    [mxmlc] C:/Program Files (x86)/Jenkins/workspace/royale-asjs_jsonly/mustella/tests/basicTests/bin/js-debug/org/apache/royale/geom/Size.js
    [mxmlc] C:/Program Files (x86)/Jenkins/workspace/royale-asjs_jsonly/mustella/tests/basicTests/bin/js-debug/AssertPropertyValue.js
    [mxmlc] C:/Program Files (x86)/Jenkins/workspace/royale-asjs_jsonly/mustella/tests/basicTests/bin/js-debug/org/apache/royale/states/State.js
    [mxmlc] C:/Program Files (x86)/Jenkins/workspace/royale-asjs_jsonly/mustella/tests/basicTests/bin/js-debug/org/apache/royale/utils/StringPadder.js
    [mxmlc] C:/Program Files (x86)/Jenkins/workspace/royale-asjs_jsonly/mustella/tests/basicTests/bin/js-debug/org/apache/royale/events/utils/KeyConverter.js
    [mxmlc] C:/Program Files (x86)/Jenkins/workspace/royale-asjs_jsonly/mustella/tests/basicTests/bin/js-debug/ExitWhenDone.js
    [mxmlc] C:/Program Files (x86)/Jenkins/workspace/royale-asjs_jsonly/mustella/tests/basicTests/bin/js-debug/SetProperty.js
    [mxmlc] C:/Program Files (x86)/Jenkins/workspace/royale-asjs_jsonly/mustella/tests/basicTests/bin/js-debug/BasicTestsApp.js
    [mxmlc] end of list of source files
    [mxmlc] May 11, 2018 2:53:44 AM com.google.javascript.jscomp.LoggerErrorManager printSummary
    [mxmlc] INFO: 0 error(s), 0 warning(s), 97.5% typed
    [mxmlc] The project 'BasicTestsApp' has been successfully compiled and optimized.
    [mxmlc] 28.2613579 seconds
    [mxmlc] Picked up JAVA_TOOL_OPTIONS: -Dfile.encoding=UTF-8

basictests-run-js:
     [echo] url=file://<http://apacheroyaleci.westus2.cloudapp.azure.com:8080/job/royale-asjs_jsonly/ws/mustella/tests/basicTests/bin/js-debug/index.html>
     [echo] script=<http://apacheroyaleci.westus2.cloudapp.azure.com:8080/job/royale-asjs_jsonly/ws/mustella/tests/basicTests/halo/scripts/ButtonTestScript.mxml>
     [echo] script=<http://apacheroyaleci.westus2.cloudapp.azure.com:8080/job/royale-asjs_jsonly/ws/mustella/tests/basicTests/halo/scripts/CheckBoxTestScript.mxml>
     [java] file://<http://apacheroyaleci.westus2.cloudapp.azure.com:8080/job/royale-asjs_jsonly/ws/mustella/tests/basicTests/bin/js-debug/index.html>
     [java] running script <http://apacheroyaleci.westus2.cloudapp.azure.com:8080/job/royale-asjs_jsonly/ws/mustella/tests/basicTests/halo/scripts/ButtonTestScript.mxml>
     [java] test case count: 2
     [java] org.openqa.selenium.WebDriverException: viewBead is null
     [java] Command duration or timeout: 41 milliseconds
     [java] Build info: version: '2.53.1', revision: 'a36b8b1', time: '2016-06-30 17:32:46'
     [java] System info: host: 'ApacheRoyaleCI', ip: '10.0.0.4', os.name: 'Windows Server
2016', os.arch: 'amd64', os.version: '10.0', java.version: '1.8.0_152'
     [java] Driver info: org.openqa.selenium.firefox.FirefoxDriver
     [java] Capabilities [{applicationCacheEnabled=true, rotatable=false, handlesAlerts=true,
databaseEnabled=true, version=47.0.2, platform=WINDOWS, nativeEvents=false, acceptSslCerts=true,
webStorageEnabled=true, locationContextEnabled=true, browserName=firefox, takesScreenshot=true,
javascriptEnabled=true, cssSelectorsEnabled=true}]
     [java] Session ID: 38178d68-05cd-4701-9e50-cccbf584a328
     [java] 	at sun.reflect.NativeConstructorAccessorImpl.newInstance0(Native Method)
     [java] 	at sun.reflect.NativeConstructorAccessorImpl.newInstance(NativeConstructorAccessorImpl.java:62)
     [java] 	at sun.reflect.DelegatingConstructorAccessorImpl.newInstance(DelegatingConstructorAccessorImpl.java:45)
     [java] 	at java.lang.reflect.Constructor.newInstance(Constructor.java:423)
     [java] 	at org.openqa.selenium.remote.ErrorHandler.createThrowable(ErrorHandler.java:206)
     [java] 	at org.openqa.selenium.remote.ErrorHandler.throwIfResponseFailed(ErrorHandler.java:158)
     [java] 	at org.openqa.selenium.remote.RemoteWebDriver.execute(RemoteWebDriver.java:678)
     [java] 	at org.openqa.selenium.remote.RemoteWebDriver.executeScript(RemoteWebDriver.java:577)
     [java] 	at marmotinni.SetProperty.doStep(Unknown Source)
     [java] 	at marmotinni.TestStep.execute(Unknown Source)
     [java] 	at marmotinni.TestCase.runSteps(Unknown Source)
     [java] 	at marmotinni.TestCase.runBody(Unknown Source)
     [java] 	at marmotinni.TestCase.runSetup(Unknown Source)
     [java] 	at marmotinni.TestCase.runTest(Unknown Source)
     [java] 	at marmotinni.MarmotinniRunner.runTest(Unknown Source)
     [java] 	at marmotinni.MarmotinniRunner.main(Unknown Source)
     [java] Caused by: org.openqa.selenium.WebDriverException: viewBead is null
     [java] Build info: version: '2.53.1', revision: 'a36b8b1', time: '2016-06-30 17:32:46'
     [java] System info: host: 'ApacheRoyaleCI', ip: '10.0.0.4', os.name: 'Windows Server
2016', os.arch: 'amd64', os.version: '10.0', java.version: '1.8.0_152'
     [java] Driver info: driver.version: unknown
     [java] 	at <anonymous class>.org.apache.royale.core.LayoutBase.prototype.performLayout(file:///C:/Program%20Files%20(x86)/Jenkins/workspace/royale-asjs_jsonly/mustella/tests/basicTests/bin/js-debug/org/apache/royale/core/LayoutBase.js:229)
     [java] 	at <anonymous class>.org.apache.royale.core.LayoutBase.prototype.handleInitComplete(file:///C:/Program%20Files%20(x86)/Jenkins/workspace/royale-asjs_jsonly/mustella/tests/basicTests/bin/js-debug/org/apache/royale/core/LayoutBase.js:151)
     [java] 	at <anonymous class>.goog.events.EventTarget.prototype.fireListeners(file:///C:/Program%20Files%20(x86)/Jenkins/workspace/royale-asjs_jsonly/mustella/tests/basicTests/bin/js-debug/library/closure/goog/events/eventtarget.js:284)
     [java] 	at <anonymous class>.goog.events.EventTarget.dispatchEventInternal_(file:///C:/Program%20Files%20(x86)/Jenkins/workspace/royale-asjs_jsonly/mustella/tests/basicTests/bin/js-debug/library/closure/goog/events/eventtarget.js:381)
     [java] 	at <anonymous class>.goog.events.EventTarget.prototype.dispatchEvent(file:///C:/Program%20Files%20(x86)/Jenkins/workspace/royale-asjs_jsonly/mustella/tests/basicTests/bin/js-debug/library/closure/goog/events/eventtarget.js:196)
     [java] 	at <anonymous class>.org.apache.royale.events.EventDispatcher.prototype.dispatchEvent(file:///C:/Program%20Files%20(x86)/Jenkins/workspace/royale-asjs_jsonly/mustella/tests/basicTests/bin/js-debug/org/apache/royale/events/EventDispatcher.js:71)
     [java] 	at <anonymous class>.org.apache.royale.core.HTMLElementWrapper.prototype.dispatchEvent(file:///C:/Program%20Files%20(x86)/Jenkins/workspace/royale-asjs_jsonly/mustella/tests/basicTests/bin/js-debug/org/apache/royale/core/HTMLElementWrapper.js:245)
     [java] 	at <anonymous class>.org.apache.royale.html.Container.prototype.addedToParent(file:///C:/Program%20Files%20(x86)/Jenkins/workspace/royale-asjs_jsonly/mustella/tests/basicTests/bin/js-debug/org/apache/royale/html/Container.js:78)
     [java] viewBead is null
     [java] Command duration or timeout: 41 milliseconds
     [java] Build info: version: '2.53.1', revision: 'a36b8b1', time: '2016-06-30 17:32:46'
     [java] System info: host: 'ApacheRoyaleCI', ip: '10.0.0.4', os.name: 'Windows Server
2016', os.arch: 'amd64', os.version: '10.0', java.version: '1.8.0_152'
     [java] Driver info: org.openqa.selenium.firefox.FirefoxDriver
     [java] Capabilities [{applicationCacheEnabled=true, rotatable=false, handlesAlerts=true,
databaseEnabled=true, version=47.0.2, platform=WINDOWS, nativeEvents=false, acceptSslCerts=true,
webStorageEnabled=true, locationContextEnabled=true, browserName=firefox, takesScreenshot=true,
javascriptEnabled=true, cssSelectorsEnabled=true}]
     [java] Session ID: 38178d68-05cd-4701-9e50-cccbf584a328
     [java] 	at <anonymous class>.org.apache.royale.core.UIBase.prototype.addElement(file:///C:/Program%20Files%20(x86)/Jenkins/workspace/royale-asjs_jsonly/mustella/tests/basicTests/bin/js-debug/org/apache/royale/core/UIBase.js:405)
     [java] 	at <anonymous class>.org.apache.royale.core.GroupBase.prototype.addElement(file:///C:/Program%20Files%20(x86)/Jenkins/workspace/royale-asjs_jsonly/mustella/tests/basicTests/bin/js-debug/org/apache/royale/core/GroupBase.js:165)
     [java] 	at <anonymous class>.org.apache.royale.core.UIBase.prototype.addElementAt(file:///C:/Program%20Files%20(x86)/Jenkins/workspace/royale-asjs_jsonly/mustella/tests/basicTests/bin/js-debug/org/apache/royale/core/UIBase.js:427)
     [java] 	at <anonymous class>.org.apache.royale.core.GroupBase.prototype.addElementAt(file:///C:/Program%20Files%20(x86)/Jenkins/workspace/royale-asjs_jsonly/mustella/tests/basicTests/bin/js-debug/org/apache/royale/core/GroupBase.js:178)
     [java] 	at <anonymous class>.org.apache.royale.core.SimpleStatesImpl.prototype.apply(file:///C:/Program%20Files%20(x86)/Jenkins/workspace/royale-asjs_jsonly/mustella/tests/basicTests/bin/js-debug/org/apache/royale/core/SimpleStatesImpl.js:198)
     [java] 	at <anonymous class>.org.apache.royale.core.SimpleStatesImpl.prototype.stateChangeHandler(file:///C:/Program%20Files%20(x86)/Jenkins/workspace/royale-asjs_jsonly/mustella/tests/basicTests/bin/js-debug/org/apache/royale/core/SimpleStatesImpl.js:95)
     [java] 	at <anonymous class>.goog.events.EventTarget.prototype.fireListeners(file:///C:/Program%20Files%20(x86)/Jenkins/workspace/royale-asjs_jsonly/mustella/tests/basicTests/bin/js-debug/library/closure/goog/events/eventtarget.js:284)
     [java] 	at <anonymous class>.goog.events.EventTarget.dispatchEventInternal_(file:///C:/Program%20Files%20(x86)/Jenkins/workspace/royale-asjs_jsonly/mustella/tests/basicTests/bin/js-debug/library/closure/goog/events/eventtarget.js:381)
     [java] 	at <anonymous class>.goog.events.EventTarget.prototype.dispatchEvent(file:///C:/Program%20Files%20(x86)/Jenkins/workspace/royale-asjs_jsonly/mustella/tests/basicTests/bin/js-debug/library/closure/goog/events/eventtarget.js:196)
     [java] 	at <anonymous class>.org.apache.royale.events.EventDispatcher.prototype.dispatchEvent(file:///C:/Program%20Files%20(x86)/Jenkins/workspace/royale-asjs_jsonly/mustella/tests/basicTests/bin/js-debug/org/apache/royale/events/EventDispatcher.js:71)
     [java] 	at <anonymous class>.org.apache.royale.core.HTMLElementWrapper.prototype.dispatchEvent(file:///C:/Program%20Files%20(x86)/Jenkins/workspace/royale-asjs_jsonly/mustella/tests/basicTests/bin/js-debug/org/apache/royale/core/HTMLElementWrapper.js:245)
     [java] 	at <anonymous class>.org.apache.royale.core.GroupBase.prototype.set__currentState(file:///C:/Program%20Files%20(x86)/Jenkins/workspace/royale-asjs_jsonly/mustella/tests/basicTests/bin/js-debug/org/apache/royale/core/GroupBase.js:226)
     [java] 	at <anonymous class>.anonymous(file:///C:/Program%20Files%20(x86)/Jenkins/workspace/royale-asjs_jsonly/mustella/tests/basicTests/bin/js-debug/index.html
line 69 > Function:1)
     [java] 	at <anonymous class>.handleEvaluateEvent(file:///C:/Program%20Files%20(x86)/Jenkins/workspace/royale-asjs_jsonly/mustella/tests/basicTests/bin/js-debug/index.html:69)
     [java] Picked up JAVA_TOOL_OPTIONS: -Dfile.encoding=UTF-8

BUILD FAILED
<http://apacheroyaleci.westus2.cloudapp.azure.com:8080/job/royale-asjs_jsonly/ws/build.xml>:1244:
Java returned: 1

Total time: 13 minutes 38 seconds
Picked up JAVA_TOOL_OPTIONS: -Dfile.encoding=UTF-8
Build step 'Invoke Ant' marked build as failure
Archiving artifacts


Mime
View raw message