river-dev mailing list archives

Site index · List index
Message view « Date » · « Thread »
Top « Date » · « Thread »
From Peter Firmstone <peter.firmst...@zeus.net.au>
Subject Testing Rio
Date Sat, 22 Apr 2017 10:57:33 GMT
The only changes made are to POM file dependencies, no changes to Rio code.

A compatiblity layer has been used for the com.sun.jini namespace.

I'm not entirely sure whether the test failures are a result of a poor 
network connection (mobile network), perhaps those more familiar with 
Rio will know.

Cheers,

Peter.

[INFO] 
------------------------------------------------------------------------
[INFO] Building Rio Distribution 5.2.3-SNAPSHOT
[INFO] 
------------------------------------------------------------------------
[INFO] 
------------------------------------------------------------------------
[INFO] Reactor Summary:
[INFO]
[INFO] Rio Project ........................................ SUCCESS [  
0.067 s]
[INFO] Module :: Rio Logging Support ...................... SUCCESS [  
0.653 s]
[INFO] Module :: Rio Platform ............................. SUCCESS [  
3.734 s]
[INFO] Module :: Rio service starters ..................... SUCCESS [  
0.097 s]
[INFO] Module :: Webster .................................. SUCCESS [  
0.097 s]
[INFO] Module :: Rio API .................................. SUCCESS [ 
22.014 s]
[INFO] Module :: Rio Proxy ................................ SUCCESS [  
0.036 s]
[INFO] Module :: Rio Library .............................. SUCCESS [  
3.806 s]
[INFO] Module :: Aether Resolver .......................... SUCCESS [  
0.386 s]
[INFO] Module :: Project Module Resolver .................. SUCCESS [  
0.583 s]
[INFO] Module :: Event Collector Service API .............. SUCCESS [  
0.329 s]
[INFO] Module :: Event Collector Service Proxy ............ SUCCESS [  
0.034 s]
[INFO] Module :: Cybernode Service API .................... SUCCESS [  
0.039 s]
[INFO] Module :: Cybernode Service Proxy .................. SUCCESS [  
0.056 s]
[INFO] Module :: Cybernode Service Implementation ......... SUCCESS [  
0.070 s]
[INFO] Module :: Monitor Service API ...................... SUCCESS [  
0.037 s]
[INFO] Module :: Rio Test Infrastructure .................. SUCCESS [  
1.825 s]
[INFO] Module :: Event Collector Service Implementation ... SUCCESS [  
0.057 s]
[INFO] Module :: Watch User Interface ..................... SUCCESS [  
0.041 s]
[INFO] Module :: Cybernode Service UI ..................... SUCCESS [  
0.035 s]
[INFO] Module :: Gnostic .................................. SUCCESS [  
0.003 s]
[INFO] Module :: Gnostic API .............................. SUCCESS [  
0.285 s]
[INFO] Module :: Gnostic Service Implementation ........... SUCCESS [ 
12.793 s]
[INFO] Module :: Monitor Service Proxy .................... SUCCESS [  
1.686 s]
[INFO] Module :: Monitor Service Implementation ........... SUCCESS [  
4.657 s]
[INFO] Module :: Rio Command Line Interface ............... SUCCESS [  
3.360 s]
[INFO] Module :: Rio Management User Interface ............ SUCCESS [ 
57.014 s]
[INFO] Rio Examples ....................................... SUCCESS [  
0.007 s]
[INFO] Example :: Calculator .............................. SUCCESS [  
0.003 s]
[INFO] Example :: Calculator API .......................... SUCCESS [  
1.139 s]
[INFO] Example :: Calculator Service Implementation ....... SUCCESS [ 
30.510 s]
[INFO] Example :: Events .................................. SUCCESS [  
0.001 s]
[INFO] Example :: Events API .............................. SUCCESS [  
0.866 s]
[INFO] Example :: Events Proxy ............................ SUCCESS [  
0.881 s]
[INFO] Example :: Events Service Implementation ........... SUCCESS [  
1.450 s]
[INFO] Example :: Events UI ............................... SUCCESS [  
1.032 s]
[INFO] Example :: Hospital ................................ SUCCESS [  
0.003 s]
[INFO] Example :: Hospital API ............................ SUCCESS [  
1.117 s]
[INFO] Example :: Hospital Rules .......................... SUCCESS [  
0.916 s]
[INFO] Example :: Hospital Service Implementation ......... SUCCESS [  
1.471 s]
[INFO] Example :: Hospital UI ............................. SUCCESS [  
3.736 s]
[INFO] Example :: SpringBean .............................. SUCCESS [  
0.003 s]
[INFO] Example :: SpringBean API .......................... SUCCESS [  
0.747 s]
[INFO] Example :: SpringBean Service Implementation ....... SUCCESS [  
8.693 s]
[INFO] Example :: Workflow ................................ SUCCESS [  
0.002 s]
[INFO] Example :: Workflow API ............................ SUCCESS [  
1.102 s]
[INFO] Example :: Workflow Service Implementation ......... SUCCESS [  
1.276 s]
[INFO] Example :: Tomcat .................................. SUCCESS [ 
54.039 s]
[INFO] Rio Distribution ................................... SUCCESS [  
0.003 s]
[INFO] 
------------------------------------------------------------------------
[INFO] BUILD SUCCESS
[INFO] 
------------------------------------------------------------------------
[INFO] Total time: 03:44 min
[INFO] Finished at: 2017-04-22T14:32:23+10:00
[INFO] Final Memory: 109M/247M
[INFO] 
------------------------------------------------------------------------

C:\Users\peter\Documents\NetBeansProjects\Rio>mvn -fn test
[INFO] Scanning for projects...
[INFO] 
------------------------------------------------------------------------
[INFO] Reactor Build Order:
[INFO]
[INFO] Rio Project
[INFO] Module :: Rio Logging Support
[INFO] Module :: Rio Platform
[INFO] Module :: Rio service starters
[INFO] Module :: Webster
[INFO] Module :: Rio API
[INFO] Module :: Rio Proxy
[INFO] Module :: Rio Library
[INFO] Module :: Aether Resolver
[INFO] Module :: Project Module Resolver
[INFO] Module :: Event Collector Service API
[INFO] Module :: Event Collector Service Proxy
[INFO] Module :: Cybernode Service API
[INFO] Module :: Cybernode Service Proxy
[INFO] Module :: Cybernode Service Implementation
[INFO] Module :: Monitor Service API
[INFO] Module :: Rio Test Infrastructure
[INFO] Module :: Event Collector Service Implementation
[INFO] Module :: Watch User Interface
[INFO] Module :: Cybernode Service UI
[INFO] Module :: Gnostic
[INFO] Module :: Gnostic API
[INFO] Module :: Gnostic Service Implementation
[INFO] Module :: Monitor Service Proxy
[INFO] Module :: Monitor Service Implementation
[INFO] Module :: Rio Command Line Interface
[INFO] Module :: Rio Management User Interface
[INFO] Rio Examples
[INFO] Example :: Calculator
[INFO] Example :: Calculator API
[INFO] Example :: Calculator Service Implementation
[INFO] Example :: Events
[INFO] Example :: Events API
[INFO] Example :: Events Proxy
[INFO] Example :: Events Service Implementation
[INFO] Example :: Events UI
[INFO] Example :: Hospital
[INFO] Example :: Hospital API
[INFO] Example :: Hospital Rules
[INFO] Example :: Hospital Service Implementation
[INFO] Example :: Hospital UI
[INFO] Example :: SpringBean
[INFO] Example :: SpringBean API
[INFO] Example :: SpringBean Service Implementation
[INFO] Example :: Workflow
[INFO] Example :: Workflow API
[INFO] Example :: Workflow Service Implementation
[INFO] Example :: Tomcat
[INFO] Rio Distribution
[INFO]
[INFO] 
------------------------------------------------------------------------
[INFO] Building Rio Project 5.2.3-SNAPSHOT
[INFO] 
------------------------------------------------------------------------
[INFO]
[INFO] 
------------------------------------------------------------------------
[INFO] Building Module :: Rio Logging Support 5.2.3-SNAPSHOT
[INFO] 
------------------------------------------------------------------------
[INFO]
[INFO] --- maven-resources-plugin:2.5:resources (default-resources) @ 
rio-logging-support ---
[debug] execute contextualize
[INFO] Using 'UTF-8' encoding to copy filtered resources.
[INFO] skip non existing resourceDirectory 
C:\Users\peter\Documents\NetBeansProjects\Rio\rio-logging-support\src\main\resources
[INFO]
[INFO] --- maven-compiler-plugin:2.3.2:compile (default-compile) @ 
rio-logging-support ---
[INFO] Nothing to compile - all classes are up to date
[INFO]
[INFO] --- maven-resources-plugin:2.5:testResources 
(default-testResources) @ rio-logging-support ---
[debug] execute contextualize
[INFO] Using 'UTF-8' encoding to copy filtered resources.
[INFO] skip non existing resourceDirectory 
C:\Users\peter\Documents\NetBeansProjects\Rio\rio-logging-support\src\test\resources
[INFO]
[INFO] --- maven-compiler-plugin:2.3.2:testCompile (default-testCompile) 
@ rio-logging-support ---
[INFO] No sources to compile
[INFO]
[INFO] --- maven-surefire-plugin:2.13:test (default-test) @ 
rio-logging-support ---
[INFO] No tests to run.
[INFO]
[INFO] 
------------------------------------------------------------------------
[INFO] Building Module :: Rio Platform 5.2.3-SNAPSHOT
[INFO] 
------------------------------------------------------------------------
[INFO]
[INFO] --- gmaven-plugin:1.4:generateStubs (default) @ rio-platform ---
[INFO] Generated 7 Java stubs
[INFO]
[INFO] --- maven-resources-plugin:2.5:resources (default-resources) @ 
rio-platform ---
[debug] execute contextualize
[INFO] Using 'UTF-8' encoding to copy filtered resources.
[INFO] Copying 2 resources
[INFO]
[INFO] --- maven-compiler-plugin:2.3.2:compile (default-compile) @ 
rio-platform ---
[INFO] Nothing to compile - all classes are up to date
[INFO]
[INFO] --- gmaven-plugin:1.4:compile (default) @ rio-platform ---
[INFO] Compiled 15 Groovy classes
[INFO]
[INFO] --- gmaven-plugin:1.4:generateTestStubs (default) @ rio-platform ---
[INFO] Generated 1 Java stub
[INFO]
[INFO] --- maven-resources-plugin:2.5:testResources 
(default-testResources) @ rio-platform ---
[debug] execute contextualize
[INFO] Using 'UTF-8' encoding to copy filtered resources.
[INFO] Copying 9 resources
[INFO]
[INFO] --- maven-compiler-plugin:2.3.2:testCompile (default-testCompile) 
@ rio-platform ---
[INFO] Nothing to compile - all classes are up to date
[INFO]
[INFO] --- gmaven-plugin:1.4:testCompile (default) @ rio-platform ---
[INFO] Compiled 1 Groovy class
[INFO]
[INFO] --- maven-surefire-plugin:2.13:test (default-test) @ rio-platform ---
[INFO] Surefire report directory: 
C:\Users\peter\Documents\NetBeansProjects\Rio\rio-platform\target\surefire-reports

-------------------------------------------------------
  T E S T S
-------------------------------------------------------
Running org.rioproject.config.ConfigTest
Tests run: 11, Failures: 0, Errors: 0, Skipped: 0, Time elapsed: 3.688 sec
Running org.rioproject.net.HostUtilTest
Tests run: 4, Failures: 0, Errors: 0, Skipped: 0, Time elapsed: 0.502 sec
Running org.rioproject.net.ITPortRangeServerSocketFactoryTest
10048 10083 10148 10303 10395 10234 10281 10316 10086 10290 10472 10370 
10361 10282 10274 10134 10126 10067 10362 10183 10063 10450 10484 10068 
10412 10463 1000
8 10135 10491 10003 10462 10368 10116 10461 10124 10094 10446 10154 
10075 10208 10231 10467 10340 10425 10358 10255 10099 10039 10464 10123 
10272 10018 10373 10
273 10043 10244 10061 10307 10498 10374 10287 10252 10090 10040 10125 
10310 10209 10187 10038 10011 10357 10030 10465 10091 10389 10198 10363 
10284 10000 10297
10413 10246 10092 10117 10157 10258 10475 10266 10437 10227 10466 10398 
10205 10210 10180 10001 10436 10232 10215 10035 10438 10375 10247 10098 
10431 10364 1049
4 10390 10127 10087 10401 10288 10414 10004 10277 10248 10356 10100 
10306 10394 10143 10468 10056 10031 10336 10359 10027 10069 10397 10365 
10477 10174 10062 10
212 10384 10371 10102 10495 10338 10376 10101 10005 10088 10217 10146 
10493 10480 10159 10182 10473 10478 10298 10163 10197 10399 10482 10192 
10329 10033 10051
10230 10064 10347 10410 10238 10367 10496 10082 10332 10049 10474 10050 
10052 10006 10497 10275 10267 10424 10065 10128 10181 10360 10403 10300 
10136 10055 1031
2 10476 10233 10309 10469 10176 10256 10416 10160 10470 10471 10235 
10380 10402 10459 10103 10179 10041 10381 10479 10311 10349 10021 10366 
10156 10299 10172 10
152 10109 10487 10199 10278 10243 10249 10415 10481 10166 10392 10104 
10257 10236 10070 10158 10346 10105 10268 10323 10200 10053 10028 10077 
10120 10483 10451
10485 10022 10259 10276 10400 10222 10317 10280 10034 10486 10426 10036 
10404 10457 10391 10189 10037 10260 10057 10054 10140 10184 10353 10499 
10007 10211 1041
7 10393 10345 10488 10489 10195 10032 10490 10386 10250 10085 10269 
10328 10372 10245 10046 10191 10155 10305 10058 10330 10264 10492 10265 
10500 10313 10169 10
348 10059 10042 10002 10408 10201 10289 10106 10409 10009 10455 10010 
10321 10324 10331 10012 10341 10130 10093 10418 10291 10066 10318 10071 
10237 10261 10216
10013 10221 10014 10072 10419 10251 10339 10283 10239 10196 10407 10015 
10423 10151 10073 10369 10396 10240 10342 10262 10076 10454 10060 10420 
10263 10270 1025
3 10084 10405 10016 10164 10095 10271 10107 10223 10241 10434 10377 
10019 10242 10149 10108 10017 10020 10079 10193 10023 10442 10150 10292 
10285 10279 10378 10
343 10344 10129 10024 10131 10096 10025 10078 10044 10439 10213 10319 
10406 10074 10350 10460 10351 10026 10301 10194 10161 10421 10411 10308 
10132 10422 10142
10352 10110 10427 10029 10322 10045 10111 10435 10429 10428 10325 10047 
10302 10218 10314 10354 10296 10379 10430 10112 10080 10081 10113 10133 
10206 10089 1009
7 10114 10432 10382 10433 10115 10162 10286 10383 10334 10118 10153 
10440 10168 10119 10449 10385 10137 10458 10121 10186 10387 10138 10139 
10441 10165 10254 10
122 10355 10141 10144 10145 10443 10147 10293 10444 10167 10456 10445 
10388 10447 10170 10202 10448 10214 10203 10294 10171 10452 10320 10173 
10175 10177 10204
10453 10295 10178 10185 10304 10228 10188 10190 10207 10219 10220 10224 
10335 10225 10226 10229 10315 10326 10327 10333 Tests run: 6, Failures: 
0, Errors: 0, Sk
ipped: 0, Time elapsed: 1.883 sec
Running org.rioproject.resolver.maven2.ArtifactCreationTest
Tests run: 6, Failures: 0, Errors: 0, Skipped: 0, Time elapsed: 0.004 sec
Running org.rioproject.resolver.maven2.ITSettingsParserTest

Settings file (src\test\conf\mirrored-settings.xml), Repositories (9), 
Mirrored (5)
-----------------------------------------------------------------------------------
(1) id:        fraz
     url:       http://external:8081/nexus/content/groups/public
     releases:  false
     snapshots: true

(2) id:        bar-not-mirrored
     url:       file://HARRY.POTTER/
     releases:  true
     snapshots: false

(3) id:        local-file-system-repo-not-mirrored
     url:       file://local.file.system/
     releases:  true
     snapshots: true

(4) id:        localhost-repo-not-mirrored
     url:       http://localhost:80801/repo/
     releases:  true
     snapshots: true

(5) id:        west
     url:       http://voldemort:8088/nexus/content/groups/public
     releases:  true
     snapshots: true

(6) id:        east
     url:       http://blutarsky:8088/nexus/content/groups/public
     releases:  true
     snapshots: true

(7) id:        north
     url:       http://blutarsky:8088/nexus/content/groups/public
     releases:  true
     snapshots: true

(8) id:        jane-not-mirrored
     url:       http://NOT.MIRRORED.COM/
     releases:  true
     snapshots: true

(9) id:        central
     url:       http://external:8081/nexus/content/groups/public
     releases:  true
     snapshots: false

Settings file (src\test\conf\jrsettings.xml), Repositories (4), Mirrored (0)
----------------------------------------------------------------------------
(1) id:        internal
     url:       http://rds.dev:8180/archiva/repository/internal/
     releases:  true
     snapshots: false

(2) id:        snapshots
     url:       http://rds.dev:8180/archiva/repository/snapshots/
     releases:  false
     snapshots: true

(3) id:        real_repository
     url:       http://build01.dev.real.com:9999/repository/
     releases:  true
     snapshots: true

(4) id:        central
     url:       http://repo1.maven.org/maven2/
     releases:  true
     snapshots: false

Settings file (C:\Users\peter\.m2\settings.xml), Repositories (3), 
Mirrored (0)
-------------------------------------------------------------------------------
(1) id:        rio
     url:       http://www.rio-project.org/maven2/
     releases:  true
     snapshots: true

(2) id:        jboss
     url:       
http://repository.jboss.org/nexus/content/groups/public-jboss/
     releases:  true
     snapshots: true

(3) id:        central
     url:       http://repo1.maven.org/maven2/
     releases:  true
     snapshots: false
Tests run: 3, Failures: 0, Errors: 0, Skipped: 0, Time elapsed: 0.317 sec
Running org.rioproject.resolver.ResolverConfigurationTest
Apr 22, 2017 5:53:02 PM org.slf4j.Logger$warn$2 call
WARNING: The resolver configuration file does not exist 
null\config\resolverConfig.groovy, will
hostName: medusa, address: 192.168.43.70
hostName: medusa, address: 192.168.43.70
Tests run: 4, Failures: 0, Errors: 0, Skipped: 0, Time elapsed: 0.434 sec
Running org.rioproject.url.artifact.ArtifactURLConfigurationTest
Tests run: 3, Failures: 0, Errors: 0, Skipped: 0, Time elapsed: 0.003 sec
Running org.rioproject.url.ProtocolRegistryServiceTest
Tests run: 1, Failures: 0, Errors: 0, Skipped: 0, Time elapsed: 0.003 sec

Results :

Tests run: 38, Failures: 0, Errors: 0, Skipped: 0

[INFO]
[INFO] 
------------------------------------------------------------------------
[INFO] Building Module :: Rio service starters 5.2.3-SNAPSHOT
[INFO] 
------------------------------------------------------------------------
[INFO]
[INFO] --- maven-resources-plugin:2.5:resources (default-resources) @ 
rio-start ---
[debug] execute contextualize
[INFO] Using 'UTF-8' encoding to copy filtered resources.
[INFO] skip non existing resourceDirectory 
C:\Users\peter\Documents\NetBeansProjects\Rio\rio-start\src\main\resources
[INFO]
[INFO] --- maven-compiler-plugin:2.3.2:compile (default-compile) @ 
rio-start ---
[INFO] Nothing to compile - all classes are up to date
[INFO]
[INFO] --- maven-resources-plugin:2.5:testResources 
(default-testResources) @ rio-start ---
[debug] execute contextualize
[INFO] Using 'UTF-8' encoding to copy filtered resources.
[INFO] Copying 1 resource
[INFO]
[INFO] --- maven-compiler-plugin:2.3.2:testCompile (default-testCompile) 
@ rio-start ---
[INFO] Nothing to compile - all classes are up to date
[INFO]
[INFO] --- maven-surefire-plugin:2.13:test (default-test) @ rio-start ---
[INFO] Surefire report directory: 
C:\Users\peter\Documents\NetBeansProjects\Rio\rio-start\target\surefire-reports

-------------------------------------------------------
  T E S T S
-------------------------------------------------------
Running org.rioproject.config.RioPropertiesTest
Apr 22, 2017 5:53:08 PM org.rioproject.config.RioProperties 
loadAndSetProperties
INFO: Loading properties from 
C:\Users\peter\Documents\NetBeansProjects\Rio\rio-start\src\test\resources\config\rio.env
Apr 22, 2017 5:53:08 PM org.rioproject.config.RioProperties 
loadAndSetProperties
INFO: Loading properties from 
C:\Users\peter\Documents\NetBeansProjects\Rio\rio-start\src\test\resources\config\rio.env
Tests run: 2, Failures: 0, Errors: 0, Skipped: 0, Time elapsed: 0.212 sec

Results :

Tests run: 2, Failures: 0, Errors: 0, Skipped: 0

[INFO]
[INFO] 
------------------------------------------------------------------------
[INFO] Building Module :: Webster 5.2.3-SNAPSHOT
[INFO] 
------------------------------------------------------------------------
[INFO]
[INFO] --- maven-resources-plugin:2.5:resources (default-resources) @ 
webster ---
[debug] execute contextualize
[INFO] Using 'UTF-8' encoding to copy filtered resources.
[INFO] Copying 1 resource
[INFO]
[INFO] --- maven-compiler-plugin:2.3.2:compile (default-compile) @ 
webster ---
[INFO] Nothing to compile - all classes are up to date
[INFO]
[INFO] --- maven-resources-plugin:2.5:testResources 
(default-testResources) @ webster ---
[debug] execute contextualize
[INFO] Using 'UTF-8' encoding to copy filtered resources.
[INFO] Copying 1 resource
[INFO]
[INFO] --- maven-compiler-plugin:2.3.2:testCompile (default-testCompile) 
@ webster ---
[INFO] Nothing to compile - all classes are up to date
[INFO]
[INFO] --- maven-surefire-plugin:2.13:test (default-test) @ webster ---
[INFO] Surefire report directory: 
C:\Users\peter\Documents\NetBeansProjects\Rio\rio-tools\webster\target\surefire-reports

-------------------------------------------------------
  T E S T S
-------------------------------------------------------
Running org.rioproject.tools.webster.WebsterUTest
Tests run: 7, Failures: 0, Errors: 0, Skipped: 0, Time elapsed: 3.524 sec

Results :

Tests run: 7, Failures: 0, Errors: 0, Skipped: 0

[INFO]
[INFO] 
------------------------------------------------------------------------
[INFO] Building Module :: Rio API 5.2.3-SNAPSHOT
[INFO] 
------------------------------------------------------------------------
[INFO]
[INFO] --- maven-resources-plugin:2.5:resources (default-resources) @ 
rio-api ---
[debug] execute contextualize
[INFO] Using 'UTF-8' encoding to copy filtered resources.
[INFO] Copying 0 resource
[INFO]
[INFO] --- maven-compiler-plugin:2.3.2:compile (default-compile) @ 
rio-api ---
[INFO] Nothing to compile - all classes are up to date
[INFO]
[INFO] --- maven-resources-plugin:2.5:testResources 
(default-testResources) @ rio-api ---
[debug] execute contextualize
[INFO] Using 'UTF-8' encoding to copy filtered resources.
[INFO] Copying 2 resources
[INFO]
[INFO] --- maven-compiler-plugin:2.3.2:testCompile (default-testCompile) 
@ rio-api ---
[INFO] Nothing to compile - all classes are up to date
[INFO]
[INFO] --- maven-surefire-plugin:2.13:test (default-test) @ rio-api ---
[INFO] Surefire report directory: 
C:\Users\peter\Documents\NetBeansProjects\Rio\rio-core\rio-api\target\surefire-reports

-------------------------------------------------------
  T E S T S
-------------------------------------------------------
Running org.rioproject.deploy.ServiceStatementTest
ServiceRecord count: 200
Tests run: 3, Failures: 0, Errors: 0, Skipped: 0, Time elapsed: 0.317 sec
Running org.rioproject.log.LoggerConfigTest
Tests run: 8, Failures: 0, Errors: 0, Skipped: 0, Time elapsed: 0.068 sec
Running org.rioproject.opstring.ServiceElementTest
Tests run: 1, Failures: 0, Errors: 0, Skipped: 0, Time elapsed: 0.005 sec
Running org.rioproject.opstring.UndeployOptionTest
Tests run: 2, Failures: 0, Errors: 0, Skipped: 0, Time elapsed: 0.007 sec
Running org.rioproject.system.capability.connectivity.TCPConnectivityTest
TCP/IP Connectivity: {IPv4 NICs=lo, wlan0, Address=10.0.1.1, IPv6 
NICs=lo, eth3, wlan0, net3, net3, wlan1, net6, Host Name=medusa, 
Name=Network}
Name: Network, {Address=127.0.0.1}, Exclude: false
Tests run: 4, Failures: 0, Errors: 0, Skipped: 0, Time elapsed: 1.34 sec
Running org.rioproject.version.VersionMatcherTest
===> 1<2? -1, M2<M3? -1, M3>M2? 1, SNAPSHOT vs M3? 6
Tests run: 7, Failures: 0, Errors: 0, Skipped: 0, Time elapsed: 0.034 sec
Running org.rioproject.version.VersionTest
Tests run: 7, Failures: 0, Errors: 0, Skipped: 0, Time elapsed: 0.001 sec
Running org.rioproject.watch.ThresholdEventLoadUTest
org.rioproject.watch.ThresholdEvent
         Calculable:      2013.04.10 02:56:44,603 - id: [foo], value: [1.0]
         Date:            Wed Apr 10 02:56:44 EST 2013
         Sequence Number: 0
         ThresholdType:   CLEARED
org.rioproject.watch.ThresholdEvent
         Calculable:      2013.04.10 02:56:44,603 - id: [foo], value: [1.0]
         Date:            Wed Apr 10 02:56:44 EST 2013
         Sequence Number: 0
         ThresholdType:   BREACHED

org.rioproject.watch.ThresholdEvent
         Calculable:      2017.04.22 17:53:15,301 - id: [foo], value: [1.0]
         Date:            Sat Apr 22 17:53:15 EST 2017
         Sequence Number: 0
         ThresholdType:   CLEARED
org.rioproject.watch.ThresholdEvent
         Calculable:      2017.04.22 17:53:15,301 - id: [foo], value: [1.0]
         Date:            Sat Apr 22 17:53:15 EST 2017
         Sequence Number: 0
         ThresholdType:   BREACHED

Tests run: 2, Failures: 0, Errors: 0, Skipped: 0, Time elapsed: 0.034 sec

Results :

Tests run: 34, Failures: 0, Errors: 0, Skipped: 0

[INFO]
[INFO] 
------------------------------------------------------------------------
[INFO] Building Module :: Rio Proxy 5.2.3-SNAPSHOT
[INFO] 
------------------------------------------------------------------------
[INFO]
[INFO] --- maven-resources-plugin:2.5:resources (default-resources) @ 
rio-proxy ---
[debug] execute contextualize
[INFO] Using 'UTF-8' encoding to copy filtered resources.
[INFO] skip non existing resourceDirectory 
C:\Users\peter\Documents\NetBeansProjects\Rio\rio-core\rio-proxy\src\main\resources
[INFO]
[INFO] --- maven-compiler-plugin:2.3.2:compile (default-compile) @ 
rio-proxy ---
[INFO] Nothing to compile - all classes are up to date
[INFO]
[INFO] --- maven-resources-plugin:2.5:testResources 
(default-testResources) @ rio-proxy ---
[debug] execute contextualize
[INFO] Using 'UTF-8' encoding to copy filtered resources.
[INFO] skip non existing resourceDirectory 
C:\Users\peter\Documents\NetBeansProjects\Rio\rio-core\rio-proxy\src\test\resources
[INFO]
[INFO] --- maven-compiler-plugin:2.3.2:testCompile (default-testCompile) 
@ rio-proxy ---
[INFO] No sources to compile
[INFO]
[INFO] --- maven-surefire-plugin:2.13:test (default-test) @ rio-proxy ---
[INFO] No tests to run.
[INFO]
[INFO] 
------------------------------------------------------------------------
[INFO] Building Module :: Rio Library 5.2.3-SNAPSHOT
[INFO] 
------------------------------------------------------------------------
[INFO]
[INFO] --- gmaven-plugin:1.4:generateStubs (default) @ rio-lib ---
[INFO] Generated 14 Java stubs
[INFO]
[INFO] --- maven-resources-plugin:2.5:resources (default-resources) @ 
rio-lib ---
[debug] execute contextualize
[INFO] Using 'UTF-8' encoding to copy filtered resources.
[INFO] Copying 5 resources
[INFO]
[INFO] --- maven-compiler-plugin:2.3.2:compile (default-compile) @ 
rio-lib ---
[INFO] Nothing to compile - all classes are up to date
[INFO]
[INFO] --- gmaven-plugin:1.4:compile (default) @ rio-lib ---
[INFO] Compiled 108 Groovy classes
[INFO]
[INFO] --- gmaven-plugin:1.4:generateTestStubs (default) @ rio-lib ---
[INFO] Generated 5 Java stubs
[INFO]
[INFO] --- maven-resources-plugin:2.5:testResources 
(default-testResources) @ rio-lib ---
[debug] execute contextualize
[INFO] Using 'UTF-8' encoding to copy filtered resources.
[INFO] Copying 42 resources
[INFO]
[INFO] --- maven-compiler-plugin:2.3.2:testCompile (default-testCompile) 
@ rio-lib ---
[INFO] Nothing to compile - all classes are up to date
[INFO]
[INFO] --- gmaven-plugin:1.4:testCompile (default) @ rio-lib ---
[INFO] Compiled 17 Groovy classes
[INFO]
[INFO] --- maven-surefire-plugin:2.13:test (default-test) @ rio-lib ---
[INFO] Surefire report directory: 
C:\Users\peter\Documents\NetBeansProjects\Rio\rio-core\rio-lib\target\surefire-reports

-------------------------------------------------------
  T E S T S
-------------------------------------------------------
Running org.rioproject.impl.associations.AssociationCollectionTest
Tests run: 7, Failures: 0, Errors: 0, Skipped: 0, Time elapsed: 0.363 sec
Running org.rioproject.impl.associations.AssociationInjectorTest
Tests run: 6, Failures: 0, Errors: 0, Skipped: 0, Time elapsed: 7.574 sec
Running org.rioproject.impl.associations.AssociationManagementSettingsTest
Tests run: 1, Failures: 0, Errors: 0, Skipped: 0, Time elapsed: 3.902 sec
Running org.rioproject.impl.associations.AssociationProxyUtilTest
Tests run: 2, Failures: 0, Errors: 0, Skipped: 0, Time elapsed: 0.547 sec
Running org.rioproject.impl.associations.VersionMatchFilterTest
Tests run: 7, Failures: 0, Errors: 0, Skipped: 0, Time elapsed: 0.015 sec
Running org.rioproject.impl.config.ConfigHelperTest
Tests run: 4, Failures: 0, Errors: 0, Skipped: 0, Time elapsed: 0.36 sec
Running org.rioproject.impl.costmodel.GenericCostModelTest
Testing org.rioproject.impl.costmodel.GenericCostModel

Generic Cost Model
Testing org.rioproject.impl.costmodel.GenericCostModel

Generic Cost Model
Tests run: 2, Failures: 0, Errors: 0, Skipped: 0, Time elapsed: 0.014 sec
Running org.rioproject.impl.event.BasicEventConsumerTest
Apr 22, 2017 5:53:36 PM org.slf4j.Logger$warn$0 call
WARNING: The resolver configuration file does not exist 
null\config\resolverConfig.groovy, will
Apr 22, 2017 5:53:36 PM org.rioproject.resolver.ResolverHelper 
getResolverJarFile
WARNING: The configured resolver jar file 
[C:\Users\peter\Documents\NetBeansProjects\Rio\rio-core\rio-lib\target\test-classes\phony.jar] 
does not exist, will at
tempt to load default resolver
Apr 22, 2017 5:53:36 PM org.rioproject.resolver.ResolverHelper 
getResolverJarFile
SEVERE: Unable to determine the location of Rio home, this must be set 
in order to load the default resolver-aether support
Waiting 5 seconds for lease to timeout...
Tests run: 7, Failures: 0, Errors: 0, Skipped: 0, Time elapsed: 8.575 sec
Running org.rioproject.impl.event.EventDescriptorFactoryTest
Tests run: 4, Failures: 0, Errors: 0, Skipped: 0, Time elapsed: 0.013 sec
Running org.rioproject.impl.exec.JVMProcessMonitorTest
Apr 22, 2017 5:53:43 PM 
org.rioproject.impl.exec.JVMProcessMonitor$MonitorReaper <init>
INFO: Using Attach API to produce list of processes
Apr 22, 2017 5:53:44 PM 
org.rioproject.impl.exec.JVMProcessMonitor$MonitorReaper run
WARNING: Service's PID [-1] no longer found, assume it is no longer 
present. Notify listener of failure
Apr 22, 2017 5:53:49 PM 
org.rioproject.impl.exec.JVMProcessMonitor$MonitorReaper <init>
INFO: Using Attach API to produce list of processes
Apr 22, 2017 5:53:49 PM 
org.rioproject.impl.exec.JVMProcessMonitor$MonitorReaper <init>
INFO: Using Attach API to produce list of processes
Apr 22, 2017 5:53:50 PM 
org.rioproject.impl.exec.JVMProcessMonitor$MonitorReaper run
WARNING: Service's PID [-1] no longer found, assume it is no longer 
present. Notify listener of failure
Tests run: 6, Failures: 0, Errors: 0, Skipped: 0, Time elapsed: 6.478 sec
Running org.rioproject.impl.jmx.JMXConnectionUtilTest
Apr 22, 2017 5:53:50 PM org.rioproject.impl.jmx.JMXConnectionUtil 
createJMXConnection
INFO: 
JMXServiceURL=service:jmx:rmi://192.168.43.70:1099/jndi/rmi://192.168.43.70:1099/jmxrmi
Tests run: 2, Failures: 0, Errors: 0, Skipped: 0, Time elapsed: 0.35 sec
Running org.rioproject.impl.loader.ClassBundleLoaderTest
Tests run: 1, Failures: 0, Errors: 0, Skipped: 0, Time elapsed: 0.006 sec
Running org.rioproject.impl.opstring.OARCheckTest
Removed 
C:\Users\peter\Documents\NetBeansProjects\Rio\rio-core\rio-lib\target\test-0.07936722082117897.oar
Removed 
C:\Users\peter\Documents\NetBeansProjects\Rio\rio-core\rio-lib\target\from-jar-url.oar
Removed 
C:\Users\peter\Documents\NetBeansProjects\Rio\rio-core\rio-lib\target\from-url.oar
Tests run: 7, Failures: 0, Errors: 0, Skipped: 0, Time elapsed: 2.154 sec
Running org.rioproject.impl.opstring.OARRepositoryLoadTest
Tests run: 3, Failures: 0, Errors: 0, Skipped: 0, Time elapsed: 0.074 sec
Running org.rioproject.impl.opstring.OpStringLoaderTest
Tests run: 1, Failures: 0, Errors: 0, Skipped: 0, Time elapsed: 0.081 sec
Running org.rioproject.impl.opstring.OpStringNameChangeTest
Tests run: 1, Failures: 0, Errors: 0, Skipped: 0, Time elapsed: 0.344 sec
Running org.rioproject.impl.opstring.OpStringParserTest
Tests run: 30, Failures: 0, Errors: 0, Skipped: 0, Time elapsed: 7.197 sec
Running org.rioproject.impl.opstring.RuleParseTest
Tests run: 3, Failures: 0, Errors: 0, Skipped: 0, Time elapsed: 0.771 sec
Running org.rioproject.impl.system.capability.PlatformCapabilityWriterTest
Apr 22, 2017 5:54:01 PM 
org.codehaus.groovy.runtime.callsite.PojoMetaMethodSite$PojoCachedMethodSiteNoUnwrap 
invoke
WARNING: Overwriting 
C:\Users\peter\Documents\NetBeansProjects\Rio\rio-core\rio-lib\target\platform-file\foo.groovy
Tests run: 1, Failures: 0, Errors: 0, Skipped: 0, Time elapsed: 0.338 sec
Running org.rioproject.impl.system.measurable.cpu.CPUTest
Tests run: 3, Failures: 0, Errors: 0, Skipped: 3, Time elapsed: 0.002 sec
Running org.rioproject.impl.system.measurable.disk.DiskSpaceTest
Tests run: 3, Failures: 0, Errors: 0, Skipped: 3, Time elapsed: 0.102 sec
Running org.rioproject.impl.system.measurable.memory.MemInfoMonitorTest
Free:   4317.60546875 MB
Active: 7684.0390625 MB
Total:  12001.64453125 MB
Used %: 0.64
Free %: 0.36
Tests run: 1, Failures: 0, Errors: 0, Skipped: 0, Time elapsed: 0.005 sec
Running org.rioproject.impl.system.measurable.memory.MemoryTest
Tests run: 3, Failures: 0, Errors: 0, Skipped: 3, Time elapsed: 0.002 sec
Running org.rioproject.impl.system.measurable.memory.pool.MemoryPoolTest
Tests run: 1, Failures: 0, Errors: 0, Skipped: 1, Time elapsed: 0.002 sec
Running org.rioproject.impl.system.SystemCapabilitiesTest
org.rioproject.impl.system.measurable.memory.Memory: Process Memory
org.rioproject.impl.system.measurable.cpu.CPU: CPU
org.rioproject.impl.system.measurable.cpu.CPU: CPU (Proc)
Apr 22, 2017 5:54:02 PM org.rioproject.config.PlatformLoader parsePlatform
WARNING: Platform directory [.\config\platform] not found
org.rioproject.system.capability.platform.ProcessorArchitecture: 
Processor Architecture: {Architecture=x86, Available=2, Name=Processor}
org.rioproject.system.capability.platform.OperatingSystem: Operating 
System: {Version=6.1, Name=Windows 7}
org.rioproject.system.capability.connectivity.TCPConnectivity: TCP/IP 
Connectivity: {IPv4 NICs=lo, wlan0, Address=192.168.43.70, IPv6 NICs=lo, 
eth3, wlan0, net3
, net3, wlan1, net6, Host Name=medusa, Name=Network}
org.rioproject.system.capability.platform.StorageCapability: Storage 
Capability: {Name=Disk}
org.rioproject.system.capability.platform.Memory: JVM Process Memory: 
{Name=Process Memory}
org.rioproject.system.capability.platform.SystemMemory: System Memory: 
{Name=System Memory}
org.rioproject.system.capability.software.J2SESupport: Java HotSpot(TM) 
Client VM: {Description=Java HotSpot(TM) Client VM, Version=1.8.0, 
Name=Java}
Tests run: 2, Failures: 0, Errors: 0, Skipped: 0, Time elapsed: 0.849 sec
Running org.rioproject.impl.watch.BoundedThresholdManagerTest
1 breached: 0.196
2 breached: 0.03
3 breached: 0.183
4 breached: 0.286
5 cleared:  0.587
6 breached: 0.587
7 cleared:  0.207
8 breached: 0.207
6.0
8.0
10.0
12.0
14.0
16.0
18.0
29.0
27.0
25.0
23.0
21.0
19.0
17.0
15.0
13.0
11.0
9.0
7.0
5.0
3.0
1.0
1 breached: 19.6
2 breached: 1.3
3 breached: 18.3
4 breached: 28.6
5 cleared:  58.7
6 breached: 58.7
7 cleared:  20.7
8 breached: 20.7

Tests run: 6, Failures: 0, Errors: 0, Skipped: 0, Time elapsed: 0.097 sec
Running org.rioproject.impl.watch.ConcurrentStopWatchTest
StopWatchRunner 59 completed
StopWatchRunner 58 completed
Tests run: 1, Failures: 0, Errors: 0, Skipped: 0, Time elapsed: 10.214 sec
Running org.rioproject.impl.watch.ThresholdEventTest
Apr 22, 2017 5:54:12 PM org.rioproject.impl.watch.ThresholdEventTest testId
INFO: ThresholdEvent.ID: 1000000000
Tests run: 9, Failures: 0, Errors: 0, Skipped: 0, Time elapsed: 0.005 sec
Running org.rioproject.impl.watch.WatchDataSourceRegistryTest
Tests run: 7, Failures: 0, Errors: 0, Skipped: 0, Time elapsed: 113.149 sec

Results :

Tests run: 131, Failures: 0, Errors: 0, Skipped: 10

[INFO]
[INFO] 
------------------------------------------------------------------------
[INFO] Building Module :: Aether Resolver 5.2.3-SNAPSHOT
[INFO] 
------------------------------------------------------------------------
[INFO]
[INFO] --- maven-resources-plugin:2.5:resources (default-resources) @ 
resolver-aether ---
[debug] execute contextualize
[INFO] Using 'UTF-8' encoding to copy filtered resources.
[INFO] Copying 1 resource
[INFO]
[INFO] --- maven-compiler-plugin:2.3.2:compile (default-compile) @ 
resolver-aether ---
[INFO] Nothing to compile - all classes are up to date
[INFO]
[INFO] --- maven-resources-plugin:2.5:testResources 
(default-testResources) @ resolver-aether ---
[debug] execute contextualize
[INFO] Using 'UTF-8' encoding to copy filtered resources.
[INFO] Copying 8 resources
[INFO]
[INFO] --- maven-compiler-plugin:2.3.2:testCompile (default-testCompile) 
@ resolver-aether ---
[INFO] Nothing to compile - all classes are up to date
[INFO]
[INFO] --- maven-surefire-plugin:2.13:test (default-test) @ 
resolver-aether ---
[INFO] Surefire report directory: 
C:\Users\peter\Documents\NetBeansProjects\Rio\rio-resolver\resolver-aether\target\surefire-reports

-------------------------------------------------------
  T E S T S
-------------------------------------------------------
Running org.rioproject.resolver.aether.AetherServiceTest
Downloaded: 
http://repository.jboss.org/nexus/content/groups/public-jboss/junit/junit/4.10/junit-4.10.pom 
(3 KB at 0.3 KB/sec)
Downloaded: 
http://repo1.maven.org/maven2/org/hamcrest/hamcrest-core/1.1/hamcrest-core-1.1.pom 
(481 B at 0.5 KB/sec)
Downloaded: 
http://repo1.maven.org/maven2/org/hamcrest/hamcrest-parent/1.1/hamcrest-parent-1.1.pom 
(6 KB at 5.6 KB/sec)
Downloaded: 
http://repo1.maven.org/maven2/org/hamcrest/hamcrest-core/1.1/hamcrest-core-1.1.jar 
(75 KB at 38.3 KB/sec)
Downloaded: 
http://repo1.maven.org/maven2/junit/junit/4.10/junit-4.10.jar (248 KB at 
106.6 KB/sec)
Tests run: 2, Failures: 0, Errors: 0, Skipped: 0, Time elapsed: 41.51 sec
Running org.rioproject.resolver.aether.ResolverRepositoryTest
Tests run: 1, Failures: 0, Errors: 0, Skipped: 0, Time elapsed: 0.024 sec
Running org.rioproject.resolver.aether.util.SettingsUtilTest
Tests run: 2, Failures: 0, Errors: 0, Skipped: 0, Time elapsed: 0.002 sec
Running org.rioproject.resolver.ITResolverConcurrencyTest
Create 100 threads
Downloaded: 
http://repo1.maven.org/maven2/org/apache/maven/maven-settings-builder/3.0.3/maven-settings-builder-3.0.3.pom 
(3 KB at 2.7 KB/sec)
Downloaded: 
http://repo1.maven.org/maven2/org/apache/maven/maven/3.0.3/maven-3.0.3.pom 
(23 KB at 20.4 KB/sec)
Downloaded: 
http://repo1.maven.org/maven2/org/apache/maven/maven-parent/15/maven-parent-15.pom 
(24 KB at 23.6 KB/sec)
Downloaded: 
http://repo1.maven.org/maven2/org/apache/apache/6/apache-6.pom (13 KB at 
13.8 KB/sec)
Downloaded: 
http://repo1.maven.org/maven2/org/codehaus/plexus/plexus-utils/2.0.6/plexus-utils-2.0.6.pom 
(3 KB at 3.3 KB/sec)
Downloaded: 
http://repo1.maven.org/maven2/org/codehaus/plexus/plexus/2.0.7/plexus-2.0.7.pom 
(17 KB at 16.6 KB/sec)
Downloaded: 
http://repo1.maven.org/maven2/org/codehaus/plexus/plexus-interpolation/1.14/plexus-interpolation-1.14.pom 
(910 B at 0.9 KB/sec)
Downloaded: 
http://repo1.maven.org/maven2/org/codehaus/plexus/plexus-components/1.1.18/plexus-components-1.1.18.pom 
(6 KB at 4.9 KB/sec)
Downloaded: 
http://repo1.maven.org/maven2/org/codehaus/plexus/plexus-component-annotations/1.5.5/plexus-component-annotations-1.5.5.pom 
(815 B at 0.9 KB/sec)
Downloaded: 
http://repo1.maven.org/maven2/org/codehaus/plexus/plexus-containers/1.5.5/plexus-containers-1.5.5.pom 
(5 KB at 4.6 KB/sec)
Downloaded: 
http://repo1.maven.org/maven2/org/apache/maven/maven-settings/3.0.3/maven-settings-3.0.3.pom 
(2 KB at 2.2 KB/sec)
Downloaded: 
http://repo1.maven.org/maven2/org/sonatype/plexus/plexus-sec-dispatcher/1.3/plexus-sec-dispatcher-1.3.pom 
(3 KB at 3.5 KB/sec)
Downloaded: 
http://repo1.maven.org/maven2/org/sonatype/spice/spice-parent/12/spice-parent-12.pom 
(7 KB at 7.6 KB/sec)
Downloaded: 
http://repo1.maven.org/maven2/org/sonatype/forge/forge-parent/4/forge-parent-4.pom 
(9 KB at 10.1 KB/sec)
Downloaded: 
http://repo1.maven.org/maven2/org/sonatype/plexus/plexus-cipher/1.4/plexus-cipher-1.4.pom 
(3 KB at 2.4 KB/sec)
Downloaded: 
http://repo1.maven.org/maven2/org/codehaus/plexus/plexus-component-annotations/1.5.5/plexus-component-annotations-1.5.5.jar 
(5 KB at 2.6 KB/sec)
Downloaded: 
http://repo1.maven.org/maven2/org/apache/maven/maven-settings-builder/3.0.3/maven-settings-builder-3.0.3.jar 
(41 KB at 23.2 KB/sec)
Downloaded: 
http://repo1.maven.org/maven2/org/codehaus/plexus/plexus-interpolation/1.14/plexus-interpolation-1.14.jar 
(60 KB at 30.6 KB/sec)
Downloaded: 
http://repo1.maven.org/maven2/org/apache/maven/maven-settings/3.0.3/maven-settings-3.0.3.jar 
(46 KB at 23.3 KB/sec)
Downloaded: 
http://repo1.maven.org/maven2/org/sonatype/plexus/plexus-cipher/1.4/plexus-cipher-1.4.jar 
(14 KB at 4.9 KB/sec)
Downloaded: 
http://repo1.maven.org/maven2/org/codehaus/plexus/plexus-utils/2.0.6/plexus-utils-2.0.6.jar 
(219 KB at 81.4 KB/sec)
Downloaded: 
http://repo1.maven.org/maven2/org/sonatype/plexus/plexus-sec-dispatcher/1.3/plexus-sec-dispatcher-1.3.jar 
(28 KB at 10.3 KB/sec)
Complete, took 16799 millis
Create 100 threads
Complete, took 186 millis
Tests run: 2, Failures: 0, Errors: 0, Skipped: 0, Time elapsed: 17.009 sec
Running org.rioproject.resolver.ITResolverTest
Downloaded: 
http://www.rio-project.org/maven2/net/jini/jsk-lib/2.1/jsk-lib-2.1.pom 
(455 B at 0.5 KB/sec)
Downloaded: 
http://www.rio-project.org/maven2/net/jini/jsk-platform/2.1/jsk-platform-2.1.pom 
(255 B at 0.3 KB/sec)
Downloaded: 
http://www.rio-project.org/maven2/net/jini/jsk-lib/2.1/jsk-lib-2.1.jar 
(286 KB at 193.5 KB/sec)
Downloaded: 
http://www.rio-project.org/maven2/com/sun/jini/outrigger-dl/2.1/outrigger-dl-2.1.pom 
(476 B at 0.5 KB/sec)
Downloaded: 
http://www.rio-project.org/maven2/net/jini/jsk-dl/2.1/jsk-dl-2.1.pom 
(194 B at 0.2 KB/sec)
Downloaded: 
http://www.rio-project.org/maven2/com/sun/jini/outrigger-dl/2.1/outrigger-dl-2.1.jar 
(56 KB at 40.0 KB/sec)
Downloaded: 
http://www.rio-project.org/maven2/net/jini/jsk-dl/2.1/jsk-dl-2.1.jar (63 
KB at 44.8 KB/sec)
classpath (com.sun.jini:outrigger-dl:jar:2.1): 
[ansProjects\Rio\rio-resolver\resolver-aether\target\test-repo\com\sun\jini\outrigger-dl\2.1\outrigger-dl-2.1.jar
, 
ansProjects\Rio\rio-resolver\resolver-aether\target\test-repo\net\jini\jsk-dl\2.1\jsk-dl-2.1.jar]
Tests run: 3, Failures: 0, Errors: 1, Skipped: 0, Time elapsed: 
1,813.191 sec <<< FAILURE!
testGroovyResolution(org.rioproject.resolver.ITResolverTest)  Time 
elapsed: 1,806.765 sec <<< ERROR!
org.rioproject.resolver.ResolverException: Error locating 
org.codehaus.groovy:groovy-all:1.6.2: Could not transfer artifact 
org.codehaus.groovy:groovy-all:jar:1
.6.2 from/to jboss 
(http://repository.jboss.org/nexus/content/groups/public-jboss/): Read 
timed out
         at 
org.rioproject.resolver.aether.AetherResolver.getLocation(AetherResolver.java:150)
         at 
org.rioproject.resolver.ITResolverTest.testGroovyResolution(ITResolverTest.java:87)

Running org.rioproject.resolver.ITResolverUsingRioDepsTest
=======================
Rio Version: 4.2
=======================
Created 
C:\Users\peter\Documents\NetBeansProjects\Rio\rio-resolver\resolver-aether\target\test-repo\org\rioproject\examples\events\2.0
Created 
C:\Users\peter\Documents\NetBeansProjects\Rio\rio-resolver\resolver-aether\target\test-repo\org\rioproject\examples\events\events-api\2.0
Downloaded: 
http://www.rio-project.org/maven2/org/rioproject/rio/4.2/rio-4.2.pom (12 
KB at 14.6 KB/sec)
Downloaded: 
http://www.rio-project.org/maven2/org/rioproject/main/4.2/main-4.2.pom 
(14 KB at 14.4 KB/sec)
Downloaded: 
http://www.rio-project.org/maven2/org/rioproject/boot/4.2/boot-4.2.pom 
(4 KB at 4.5 KB/sec)
[WARNING] Checksum validation failed, expected 
4e29f367505031e7d61b2e50fb9df23d6807f40b but is 
9f36e895fe399c2e29279eb604963b821de8508d for http://www.rio-proje
ct.org/maven2/net/jini/start/2.1/start-2.1.pom
[WARNING] Checksum validation failed, expected 
4e29f367505031e7d61b2e50fb9df23d6807f40b but is 
9f36e895fe399c2e29279eb604963b821de8508d for http://www.rio-proje
ct.org/maven2/net/jini/start/2.1/start-2.1.pom
Downloaded: 
http://www.rio-project.org/maven2/net/jini/start/2.1/start-2.1.pom (248 
B at 0.2 KB/sec)
Downloaded: 
http://www.rio-project.org/maven2/net/jini/jsk-platform/2.1/jsk-platform-2.1.pom 
(255 B at 0.3 KB/sec)
Downloaded: 
http://repository.jboss.org/nexus/content/groups/public-jboss/org/codehaus/groovy/groovy-all/1.7.0/groovy-all-1.7.0.pom 
(25 KB at 25.8 KB/sec)
Downloaded: 
http://repository.jboss.org/nexus/content/groups/public-jboss/jline/jline/0.9.94/jline-0.9.94.pom 
(7 KB at 11.4 KB/sec)
Downloaded: 
http://repository.jboss.org/nexus/content/groups/public-jboss/org/apache/commons/commons-compress/1.0/commons-compress-1.0.pom 
(8 KB at 11.4 KB/sec)

Downloaded: 
http://repository.jboss.org/nexus/content/groups/public-jboss/org/apache/commons/commons-parent/11/commons-parent-11.pom 
(25 KB at 33.0 KB/sec)
Downloaded: 
http://repository.jboss.org/nexus/content/groups/public-jboss/org/apache/apache/4/apache-4.pom 
(5 KB at 8.4 KB/sec)
Downloaded: 
http://www.rio-project.org/maven2/net/jini/jsk-lib/2.1/jsk-lib-2.1.pom 
(455 B at 0.6 KB/sec)
Downloaded: 
http://repository.jboss.org/nexus/content/groups/public-jboss/cglib/cglib-nodep/2.2/cglib-nodep-2.2.pom 
(807 B at 1.5 KB/sec)
EXCLUDE:
events-api-2.0.jar

=======================
Rio Version: 4.2
=======================
Created 
C:\Users\peter\Documents\NetBeansProjects\Rio\rio-resolver\resolver-aether\target\test-repo\org\rioproject\examples\events\2.0
Created 
C:\Users\peter\Documents\NetBeansProjects\Rio\rio-resolver\resolver-aether\target\test-repo\org\rioproject\examples\events\events-api\2.0
EXCLUDE:
events-api-2.0.jar

=======================
Rio Version: 4.2
=======================
Created 
C:\Users\peter\Documents\NetBeansProjects\Rio\rio-resolver\resolver-aether\target\test-repo\org\rioproject\examples\events\2.0
Created 
C:\Users\peter\Documents\NetBeansProjects\Rio\rio-resolver\resolver-aether\target\test-repo\org\rioproject\examples\events\events-api\2.0
Downloaded: 
http://www.rio-project.org/maven2/net/jini/start/2.1/start-2.1.jar (62 
KB at 47.6 KB/sec)
Downloaded: 
http://www.rio-project.org/maven2/org/rioproject/boot/4.2/boot-4.2.jar 
(152 KB at 90.2 KB/sec)
Downloaded: 
http://www.rio-project.org/maven2/net/jini/jsk-lib/2.1/jsk-lib-2.1.jar 
(286 KB at 152.8 KB/sec)
Downloaded: 
http://www.rio-project.org/maven2/net/jini/jsk-platform/2.1/jsk-platform-2.1.jar 
(972 KB at 264.8 KB/sec)
Downloaded: 
http://www.rio-project.org/maven2/org/rioproject/rio/4.2/rio-4.2.jar 
(1333 KB at 338.1 KB/sec)
Downloaded: 
http://repository.jboss.org/nexus/content/groups/public-jboss/jline/jline/0.9.94/jline-0.9.94.jar 
(86 KB at 79.6 KB/sec)
Downloaded: 
http://repository.jboss.org/nexus/content/groups/public-jboss/org/apache/commons/commons-compress/1.0/commons-compress-1.0.jar 
(141 KB at 95.8 KB/se
c)
Downloaded: 
http://repository.jboss.org/nexus/content/groups/public-jboss/cglib/cglib-nodep/2.2/cglib-nodep-2.2.jar 
(315 KB at 134.7 KB/sec)
Downloaded: 
http://repo.maven.apache.org/maven2/org/codehaus/groovy/groovy-all/1.7.0/groovy-all-1.7.0.jar 
(4973 KB at 98.6 KB/sec)
INCLUDE:
events-api-2.0.jar
rio-4.2.jar
boot-4.2.jar
start-2.1.jar
commons-compress-1.0.jar
jsk-lib-2.1.jar
jsk-dl-2.1.jar
jsk-platform-2.1.jar
groovy-all-1.7.0.jar
jline-0.9.94.jar
cglib-nodep-2.2.jar

Tests run: 3, Failures: 0, Errors: 0, Skipped: 0, Time elapsed: 
1,870.525 sec

Results :

Tests in error:
   ITResolverTest.testGroovyResolution:87 » Resolver Error locating 
org.codehaus....

Tests run: 13, Failures: 0, Errors: 1, Skipped: 0

[INFO]
[INFO] 
------------------------------------------------------------------------
[INFO] Building Module :: Project Module Resolver 5.2.3-SNAPSHOT
[INFO] 
------------------------------------------------------------------------
[INFO]
[INFO] --- gmaven-plugin:1.4:generateStubs (default) @ resolver-project ---
[INFO] Generated 4 Java stubs
[INFO]
[INFO] --- maven-resources-plugin:2.5:resources (default-resources) @ 
resolver-project ---
[debug] execute contextualize
[INFO] Using 'UTF-8' encoding to copy filtered resources.
[INFO] Copying 1 resource
[INFO]
[INFO] --- maven-compiler-plugin:2.3.2:compile (default-compile) @ 
resolver-project ---
[INFO] Nothing to compile - all classes are up to date
[INFO]
[INFO] --- gmaven-plugin:1.4:compile (default) @ resolver-project ---
[INFO] Compiled 4 Groovy classes
[INFO]
[INFO] --- gmaven-plugin:1.4:generateTestStubs (default) @ 
resolver-project ---
[INFO] No sources found for Java stub generation
[INFO]
[INFO] --- maven-resources-plugin:2.5:testResources 
(default-testResources) @ resolver-project ---
[debug] execute contextualize
[INFO] Using 'UTF-8' encoding to copy filtered resources.
[INFO] Copying 5 resources
[INFO]
[INFO] --- maven-compiler-plugin:2.3.2:testCompile (default-testCompile) 
@ resolver-project ---
[INFO] Nothing to compile - all classes are up to date
[INFO]
[INFO] --- gmaven-plugin:1.4:testCompile (default) @ resolver-project ---
[INFO] No sources found to compile
[INFO]
[INFO] --- maven-surefire-plugin:2.13:test (default-test) @ 
resolver-project ---
[INFO] Surefire report directory: 
C:\Users\peter\Documents\NetBeansProjects\Rio\rio-resolver\resolver-project\target\surefire-reports

-------------------------------------------------------
  T E S T S
-------------------------------------------------------
Running org.rioproject.resolver.ResolverParseParentTest
Installed org.rioproject.resolver.test:project:pom:2.0 to 
C:\Users\peter\Documents\NetBeansProjects\Rio\rio-resolver\resolver-project\target\test-repo\org\riopr
oject\resolver\test\project\2.0\project-2.0.pom
Apr 22, 2017 6:58:38 PM 
org.rioproject.resolver.aether.util.ConsoleRepositoryListener 
metadataInstalled
INFO: Installed org.rioproject.resolver.test:project/maven-metadata.xml 
to 
C:\Users\peter\Documents\NetBeansProjects\Rio\rio-resolver\resolver-project\target\te
st-repo\org\rioproject\resolver\test\project\maven-metadata-local.xml
Installed org.rioproject.resolver.test.project:project-api:jar:2.0 to 
C:\Users\peter\Documents\NetBeansProjects\Rio\rio-resolver\resolver-project\target\test-re
po\org\rioproject\resolver\test\project\project-api\2.0\project-api-2.0.jar
Installed org.rioproject.resolver.test.project:project-api:pom:2.0 to 
C:\Users\peter\Documents\NetBeansProjects\Rio\rio-resolver\resolver-project\target\test-re
po\org\rioproject\resolver\test\project\project-api\2.0\project-api-2.0.pom
Apr 22, 2017 6:58:38 PM 
org.rioproject.resolver.aether.util.ConsoleRepositoryListener 
metadataInstalled
INFO: Installed 
org.rioproject.resolver.test.project:project-api/maven-metadata.xml to 
C:\Users\peter\Documents\NetBeansProjects\Rio\rio-resolver\resolver-proje
ct\target\test-repo\org\rioproject\resolver\test\project\project-api\maven-metadata-local.xml
Installed org.rioproject.resolver.test.project:project-service:jar:2.0 
to 
C:\Users\peter\Documents\NetBeansProjects\Rio\rio-resolver\resolver-project\target\tes
t-repo\org\rioproject\resolver\test\project\project-service\2.0\project-service-2.0.jar
Installed org.rioproject.resolver.test.project:project-service:pom:2.0 
to 
C:\Users\peter\Documents\NetBeansProjects\Rio\rio-resolver\resolver-project\target\tes
t-repo\org\rioproject\resolver\test\project\project-service\2.0\project-service-2.0.pom
Apr 22, 2017 6:58:38 PM 
org.rioproject.resolver.aether.util.ConsoleRepositoryListener 
metadataInstalled
INFO: Installed 
org.rioproject.resolver.test.project:project-service/maven-metadata.xml 
to C:\Users\peter\Documents\NetBeansProjects\Rio\rio-resolver\resolver-p
roject\target\test-repo\org\rioproject\resolver\test\project\project-service\maven-metadata-local.xml
Removed 
C:\Users\peter\Documents\NetBeansProjects\Rio\rio-resolver\resolver-project\target\test-repo\org\rioproject\resolver\test\project\2.0\project-2.0.pom
Removed 
C:\Users\peter\Documents\NetBeansProjects\Rio\rio-resolver\resolver-project\target\test-repo\org\rioproject\resolver\test\project\2.0\_remote.repositori
es
Removed 
C:\Users\peter\Documents\NetBeansProjects\Rio\rio-resolver\resolver-project\target\test-repo\org\rioproject\resolver\test\project\2.0
Removed 
C:\Users\peter\Documents\NetBeansProjects\Rio\rio-resolver\resolver-project\target\test-repo\org\rioproject\resolver\test\project\maven-metadata-local.x
ml
Removed 
C:\Users\peter\Documents\NetBeansProjects\Rio\rio-resolver\resolver-project\target\test-repo\org\rioproject\resolver\test\project\project-api\2.0\projec
t-api-2.0.jar
Removed 
C:\Users\peter\Documents\NetBeansProjects\Rio\rio-resolver\resolver-project\target\test-repo\org\rioproject\resolver\test\project\project-api\2.0\projec
t-api-2.0.pom
Removed 
C:\Users\peter\Documents\NetBeansProjects\Rio\rio-resolver\resolver-project\target\test-repo\org\rioproject\resolver\test\project\project-api\2.0\_remot
e.repositories
Removed 
C:\Users\peter\Documents\NetBeansProjects\Rio\rio-resolver\resolver-project\target\test-repo\org\rioproject\resolver\test\project\project-api\2.0
Removed 
C:\Users\peter\Documents\NetBeansProjects\Rio\rio-resolver\resolver-project\target\test-repo\org\rioproject\resolver\test\project\project-api\maven-meta
data-local.xml
Removed 
C:\Users\peter\Documents\NetBeansProjects\Rio\rio-resolver\resolver-project\target\test-repo\org\rioproject\resolver\test\project\project-api
Removed 
C:\Users\peter\Documents\NetBeansProjects\Rio\rio-resolver\resolver-project\target\test-repo\org\rioproject\resolver\test\project\project-service\2.0\pr
oject-service-2.0.jar
Removed 
C:\Users\peter\Documents\NetBeansProjects\Rio\rio-resolver\resolver-project\target\test-repo\org\rioproject\resolver\test\project\project-service\2.0\pr
oject-service-2.0.pom
Removed 
C:\Users\peter\Documents\NetBeansProjects\Rio\rio-resolver\resolver-project\target\test-repo\org\rioproject\resolver\test\project\project-service\2.0\_r
emote.repositories
Removed 
C:\Users\peter\Documents\NetBeansProjects\Rio\rio-resolver\resolver-project\target\test-repo\org\rioproject\resolver\test\project\project-service\2.0
Removed 
C:\Users\peter\Documents\NetBeansProjects\Rio\rio-resolver\resolver-project\target\test-repo\org\rioproject\resolver\test\project\project-service\maven-
metadata-local.xml
Removed 
C:\Users\peter\Documents\NetBeansProjects\Rio\rio-resolver\resolver-project\target\test-repo\org\rioproject\resolver\test\project\project-service
Removed 
C:\Users\peter\Documents\NetBeansProjects\Rio\rio-resolver\resolver-project\target\test-repo\org\rioproject\resolver\test\project
Removed 
C:\Users\peter\Documents\NetBeansProjects\Rio\rio-resolver\resolver-project\target\test-repo\org\rioproject\resolver\test
Tests run: 1, Failures: 0, Errors: 1, Skipped: 0, Time elapsed: 3.841 
sec <<< FAILURE!
testVersionFromProjectParentVersion(org.rioproject.resolver.ResolverParseParentTest)  
Time elapsed: 3.639 sec <<< ERROR!
org.rioproject.resolver.ResolverException: While trying to resolve 
org.rioproject.resolver.test.project:project-service:2.0
         at 
org.rioproject.resolver.aether.AetherResolver$ResolvingRequestTask.call(AetherResolver.java:432)
         at 
org.rioproject.resolver.aether.AetherResolver$ResolvingRequestTask.call(AetherResolver.java:348)
         at java.util.concurrent.FutureTask.run(FutureTask.java:266)
         at 
java.util.concurrent.ThreadPoolExecutor.runWorker(ThreadPoolExecutor.java:1142)
         at 
java.util.concurrent.ThreadPoolExecutor$Worker.run(ThreadPoolExecutor.java:617)
         at java.lang.Thread.run(Thread.java:744)

Running org.rioproject.resolver.ResolverTestDependenciesTest
Installed org.rioproject.resolver.test:project:pom:2.0 to 
C:\Users\peter\Documents\NetBeansProjects\Rio\rio-resolver\resolver-project\target\test-repo\org\riopr
oject\resolver\test\project\2.0\project-2.0.pom
Apr 22, 2017 6:58:39 PM 
org.rioproject.resolver.aether.util.ConsoleRepositoryListener 
metadataInstalled
INFO: Installed org.rioproject.resolver.test:project/maven-metadata.xml 
to 
C:\Users\peter\Documents\NetBeansProjects\Rio\rio-resolver\resolver-project\target\te
st-repo\org\rioproject\resolver\test\project\maven-metadata-local.xml
Installed org.rioproject.resolver.test.project:project-api:jar:2.0 to 
C:\Users\peter\Documents\NetBeansProjects\Rio\rio-resolver\resolver-project\target\test-re
po\org\rioproject\resolver\test\project\project-api\2.0\project-api-2.0.jar
Installed org.rioproject.resolver.test.project:project-api:pom:2.0 to 
C:\Users\peter\Documents\NetBeansProjects\Rio\rio-resolver\resolver-project\target\test-re
po\org\rioproject\resolver\test\project\project-api\2.0\project-api-2.0.pom
Apr 22, 2017 6:58:39 PM 
org.rioproject.resolver.aether.util.ConsoleRepositoryListener 
metadataInstalled
INFO: Installed 
org.rioproject.resolver.test.project:project-api/maven-metadata.xml to 
C:\Users\peter\Documents\NetBeansProjects\Rio\rio-resolver\resolver-proje
ct\target\test-repo\org\rioproject\resolver\test\project\project-api\maven-metadata-local.xml
Installed org.rioproject.resolver.test.project:project-service:jar:2.0 
to 
C:\Users\peter\Documents\NetBeansProjects\Rio\rio-resolver\resolver-project\target\tes
t-repo\org\rioproject\resolver\test\project\project-service\2.0\project-service-2.0.jar
Installed org.rioproject.resolver.test.project:project-service:pom:2.0 
to 
C:\Users\peter\Documents\NetBeansProjects\Rio\rio-resolver\resolver-project\target\tes
t-repo\org\rioproject\resolver\test\project\project-service\2.0\project-service-2.0.pom
Apr 22, 2017 6:58:39 PM 
org.rioproject.resolver.aether.util.ConsoleRepositoryListener 
metadataInstalled
INFO: Installed 
org.rioproject.resolver.test.project:project-service/maven-metadata.xml 
to C:\Users\peter\Documents\NetBeansProjects\Rio\rio-resolver\resolver-p
roject\target\test-repo\org\rioproject\resolver\test\project\project-service\maven-metadata-local.xml
Removed 
C:\Users\peter\Documents\NetBeansProjects\Rio\rio-resolver\resolver-project\target\test-repo\org\rioproject\resolver\test\project\2.0\project-2.0.pom
Removed 
C:\Users\peter\Documents\NetBeansProjects\Rio\rio-resolver\resolver-project\target\test-repo\org\rioproject\resolver\test\project\2.0\_remote.repositori
es
Removed 
C:\Users\peter\Documents\NetBeansProjects\Rio\rio-resolver\resolver-project\target\test-repo\org\rioproject\resolver\test\project\2.0
Removed 
C:\Users\peter\Documents\NetBeansProjects\Rio\rio-resolver\resolver-project\target\test-repo\org\rioproject\resolver\test\project\maven-metadata-local.x
ml
Removed 
C:\Users\peter\Documents\NetBeansProjects\Rio\rio-resolver\resolver-project\target\test-repo\org\rioproject\resolver\test\project\project-api\2.0\projec
t-api-2.0.jar
Removed 
C:\Users\peter\Documents\NetBeansProjects\Rio\rio-resolver\resolver-project\target\test-repo\org\rioproject\resolver\test\project\project-api\2.0\projec
t-api-2.0.pom
Removed 
C:\Users\peter\Documents\NetBeansProjects\Rio\rio-resolver\resolver-project\target\test-repo\org\rioproject\resolver\test\project\project-api\2.0\_remot
e.repositories
Removed 
C:\Users\peter\Documents\NetBeansProjects\Rio\rio-resolver\resolver-project\target\test-repo\org\rioproject\resolver\test\project\project-api\2.0
Removed 
C:\Users\peter\Documents\NetBeansProjects\Rio\rio-resolver\resolver-project\target\test-repo\org\rioproject\resolver\test\project\project-api\maven-meta
data-local.xml
Removed 
C:\Users\peter\Documents\NetBeansProjects\Rio\rio-resolver\resolver-project\target\test-repo\org\rioproject\resolver\test\project\project-api
Removed 
C:\Users\peter\Documents\NetBeansProjects\Rio\rio-resolver\resolver-project\target\test-repo\org\rioproject\resolver\test\project\project-service\2.0\pr
oject-service-2.0.jar
Removed 
C:\Users\peter\Documents\NetBeansProjects\Rio\rio-resolver\resolver-project\target\test-repo\org\rioproject\resolver\test\project\project-service\2.0\pr
oject-service-2.0.pom
Removed 
C:\Users\peter\Documents\NetBeansProjects\Rio\rio-resolver\resolver-project\target\test-repo\org\rioproject\resolver\test\project\project-service\2.0\_r
emote.repositories
Removed 
C:\Users\peter\Documents\NetBeansProjects\Rio\rio-resolver\resolver-project\target\test-repo\org\rioproject\resolver\test\project\project-service\2.0
Removed 
C:\Users\peter\Documents\NetBeansProjects\Rio\rio-resolver\resolver-project\target\test-repo\org\rioproject\resolver\test\project\project-service\maven-
metadata-local.xml
Removed 
C:\Users\peter\Documents\NetBeansProjects\Rio\rio-resolver\resolver-project\target\test-repo\org\rioproject\resolver\test\project\project-service
Removed 
C:\Users\peter\Documents\NetBeansProjects\Rio\rio-resolver\resolver-project\target\test-repo\org\rioproject\resolver\test\project
Removed 
C:\Users\peter\Documents\NetBeansProjects\Rio\rio-resolver\resolver-project\target\test-repo\org\rioproject\resolver\test
Installed org.rioproject.resolver.test:project:pom:2.0 to 
C:\Users\peter\Documents\NetBeansProjects\Rio\rio-resolver\resolver-project\target\test-repo\org\riopr
oject\resolver\test\project\2.0\project-2.0.pom
Apr 22, 2017 6:58:39 PM 
org.rioproject.resolver.aether.util.ConsoleRepositoryListener 
metadataInstalled
INFO: Installed org.rioproject.resolver.test:project/maven-metadata.xml 
to 
C:\Users\peter\Documents\NetBeansProjects\Rio\rio-resolver\resolver-project\target\te
st-repo\org\rioproject\resolver\test\project\maven-metadata-local.xml
Installed org.rioproject.resolver.test.project:project-api:jar:2.0 to 
C:\Users\peter\Documents\NetBeansProjects\Rio\rio-resolver\resolver-project\target\test-re
po\org\rioproject\resolver\test\project\project-api\2.0\project-api-2.0.jar
Installed org.rioproject.resolver.test.project:project-api:pom:2.0 to 
C:\Users\peter\Documents\NetBeansProjects\Rio\rio-resolver\resolver-project\target\test-re
po\org\rioproject\resolver\test\project\project-api\2.0\project-api-2.0.pom
Apr 22, 2017 6:58:39 PM 
org.rioproject.resolver.aether.util.ConsoleRepositoryListener 
metadataInstalled
INFO: Installed 
org.rioproject.resolver.test.project:project-api/maven-metadata.xml to 
C:\Users\peter\Documents\NetBeansProjects\Rio\rio-resolver\resolver-proje
ct\target\test-repo\org\rioproject\resolver\test\project\project-api\maven-metadata-local.xml
Installed org.rioproject.resolver.test.project:project-service:jar:2.0 
to 
C:\Users\peter\Documents\NetBeansProjects\Rio\rio-resolver\resolver-project\target\tes
t-repo\org\rioproject\resolver\test\project\project-service\2.0\project-service-2.0.jar
Installed org.rioproject.resolver.test.project:project-service:pom:2.0 
to 
C:\Users\peter\Documents\NetBeansProjects\Rio\rio-resolver\resolver-project\target\tes
t-repo\org\rioproject\resolver\test\project\project-service\2.0\project-service-2.0.pom
Apr 22, 2017 6:58:39 PM 
org.rioproject.resolver.aether.util.ConsoleRepositoryListener 
metadataInstalled
INFO: Installed 
org.rioproject.resolver.test.project:project-service/maven-metadata.xml 
to C:\Users\peter\Documents\NetBeansProjects\Rio\rio-resolver\resolver-p
roject\target\test-repo\org\rioproject\resolver\test\project\project-service\maven-metadata-local.xml
Tests run: 2, Failures: 0, Errors: 1, Skipped: 0, Time elapsed: 0.132 
sec <<< FAILURE!
resolveWithTestDependenciesIncluded(org.rioproject.resolver.ResolverTestDependenciesTest)  
Time elapsed: 0.05 sec <<< ERROR!
org.rioproject.resolver.ResolverException: While trying to resolve 
org.rioproject.resolver.test.project:project-service:2.0
         at 
org.rioproject.resolver.aether.AetherResolver$ResolvingRequestTask.call(AetherResolver.java:432)
         at 
org.rioproject.resolver.aether.AetherResolver$ResolvingRequestTask.call(AetherResolver.java:348)
         at java.util.concurrent.FutureTask.run(FutureTask.java:266)
         at 
java.util.concurrent.ThreadPoolExecutor.runWorker(ThreadPoolExecutor.java:1142)
         at 
java.util.concurrent.ThreadPoolExecutor$Worker.run(ThreadPoolExecutor.java:617)
         at java.lang.Thread.run(Thread.java:744)


Results :

Tests in error:
   ResolverParseParentTest.testVersionFromProjectParentVersion:33 » 
Resolver Whil...
   ResolverTestDependenciesTest.resolveWithTestDependenciesIncluded:48 » 
Resolver

Tests run: 3, Failures: 0, Errors: 2, Skipped: 0

[INFO]
[INFO] 
------------------------------------------------------------------------
[INFO] Building Module :: Event Collector Service API 5.2.3-SNAPSHOT
[INFO] 
------------------------------------------------------------------------
[INFO]
[INFO] --- maven-resources-plugin:2.5:resources (default-resources) @ 
event-collector-api ---
[debug] execute contextualize
[INFO] Using 'UTF-8' encoding to copy filtered resources.
[INFO] skip non existing resourceDirectory 
C:\Users\peter\Documents\NetBeansProjects\Rio\rio-services\event-collector\event-collector-api\src\main\resources
[INFO]
[INFO] --- maven-compiler-plugin:2.3.2:compile (default-compile) @ 
event-collector-api ---
[INFO] Nothing to compile - all classes are up to date
[INFO]
[INFO] --- maven-resources-plugin:2.5:testResources 
(default-testResources) @ event-collector-api ---
[debug] execute contextualize
[INFO] Using 'UTF-8' encoding to copy filtered resources.
[INFO] skip non existing resourceDirectory 
C:\Users\peter\Documents\NetBeansProjects\Rio\rio-services\event-collector\event-collector-api\src\test\resources
[INFO]
[INFO] --- maven-compiler-plugin:2.3.2:testCompile (default-testCompile) 
@ event-collector-api ---
[INFO] No sources to compile
[INFO]
[INFO] --- maven-surefire-plugin:2.13:test (default-test) @ 
event-collector-api ---
[INFO] No tests to run.
[INFO]
[INFO] 
------------------------------------------------------------------------
[INFO] Building Module :: Event Collector Service Proxy 5.2.3-SNAPSHOT
[INFO] 
------------------------------------------------------------------------
[INFO]
[INFO] --- maven-resources-plugin:2.5:resources (default-resources) @ 
event-collector-proxy ---
[debug] execute contextualize
[INFO] Using 'UTF-8' encoding to copy filtered resources.
[INFO] skip non existing resourceDirectory 
C:\Users\peter\Documents\NetBeansProjects\Rio\rio-services\event-collector\event-collector-proxy\src\main\resources
[INFO]
[INFO] --- maven-compiler-plugin:2.3.2:compile (default-compile) @ 
event-collector-proxy ---
[INFO] Nothing to compile - all classes are up to date
[INFO]
[INFO] --- maven-resources-plugin:2.5:testResources 
(default-testResources) @ event-collector-proxy ---
[debug] execute contextualize
[INFO] Using 'UTF-8' encoding to copy filtered resources.
[INFO] skip non existing resourceDirectory 
C:\Users\peter\Documents\NetBeansProjects\Rio\rio-services\event-collector\event-collector-proxy\src\test\resources
[INFO]
[INFO] --- maven-compiler-plugin:2.3.2:testCompile (default-testCompile) 
@ event-collector-proxy ---
[INFO] No sources to compile
[INFO]
[INFO] --- maven-surefire-plugin:2.13:test (default-test) @ 
event-collector-proxy ---
[INFO] No tests to run.
[INFO]
[INFO] 
------------------------------------------------------------------------
[INFO] Building Module :: Cybernode Service API 5.2.3-SNAPSHOT
[INFO] 
------------------------------------------------------------------------
[INFO]
[INFO] --- maven-resources-plugin:2.5:resources (default-resources) @ 
cybernode-api ---
[debug] execute contextualize
[INFO] Using 'UTF-8' encoding to copy filtered resources.
[INFO] skip non existing resourceDirectory 
C:\Users\peter\Documents\NetBeansProjects\Rio\rio-services\cybernode\cybernode-api\src\main\resources
[INFO]
[INFO] --- maven-compiler-plugin:2.3.2:compile (default-compile) @ 
cybernode-api ---
[INFO] Nothing to compile - all classes are up to date
[INFO]
[INFO] --- maven-resources-plugin:2.5:testResources 
(default-testResources) @ cybernode-api ---
[debug] execute contextualize
[INFO] Using 'UTF-8' encoding to copy filtered resources.
[INFO] skip non existing resourceDirectory 
C:\Users\peter\Documents\NetBeansProjects\Rio\rio-services\cybernode\cybernode-api\src\test\resources
[INFO]
[INFO] --- maven-compiler-plugin:2.3.2:testCompile (default-testCompile) 
@ cybernode-api ---
[INFO] No sources to compile
[INFO]
[INFO] --- maven-surefire-plugin:2.13:test (default-test) @ 
cybernode-api ---
[INFO] No tests to run.
[INFO]
[INFO] 
------------------------------------------------------------------------
[INFO] Building Module :: Cybernode Service Proxy 5.2.3-SNAPSHOT
[INFO] 
------------------------------------------------------------------------
[INFO]
[INFO] --- maven-resources-plugin:2.5:resources (default-resources) @ 
cybernode-proxy ---
[debug] execute contextualize
[INFO] Using 'UTF-8' encoding to copy filtered resources.
[INFO] Copying 1 resource
[INFO]
[INFO] --- maven-compiler-plugin:2.3.2:compile (default-compile) @ 
cybernode-proxy ---
[INFO] Nothing to compile - all classes are up to date
[INFO]
[INFO] --- maven-resources-plugin:2.5:testResources 
(default-testResources) @ cybernode-proxy ---
[debug] execute contextualize
[INFO] Using 'UTF-8' encoding to copy filtered resources.
[INFO] skip non existing resourceDirectory 
C:\Users\peter\Documents\NetBeansProjects\Rio\rio-services\cybernode\cybernode-proxy\src\test\resources
[INFO]
[INFO] --- maven-compiler-plugin:2.3.2:testCompile (default-testCompile) 
@ cybernode-proxy ---
[INFO] No sources to compile
[INFO]
[INFO] --- maven-surefire-plugin:2.13:test (default-test) @ 
cybernode-proxy ---
[INFO] No tests to run.
[INFO]
[INFO] 
------------------------------------------------------------------------
[INFO] Building Module :: Cybernode Service Implementation 5.2.3-SNAPSHOT
[INFO] 
------------------------------------------------------------------------
[INFO]
[INFO] --- maven-resources-plugin:2.5:resources (default-resources) @ 
cybernode-service ---
[debug] execute contextualize
[INFO] Using 'UTF-8' encoding to copy filtered resources.
[INFO] Copying 1 resource
[INFO]
[INFO] --- maven-compiler-plugin:2.3.2:compile (default-compile) @ 
cybernode-service ---
[INFO] Nothing to compile - all classes are up to date
[INFO]
[INFO] --- maven-resources-plugin:2.5:testResources 
(default-testResources) @ cybernode-service ---
[debug] execute contextualize
[INFO] Using 'UTF-8' encoding to copy filtered resources.
[INFO] skip non existing resourceDirectory 
C:\Users\peter\Documents\NetBeansProjects\Rio\rio-services\cybernode\cybernode-service\src\test\resources
[INFO]
[INFO] --- maven-compiler-plugin:2.3.2:testCompile (default-testCompile) 
@ cybernode-service ---
[INFO] Compiling 1 source file to 
C:\Users\peter\Documents\NetBeansProjects\Rio\rio-services\cybernode\cybernode-service\target\test-classes
[INFO]
[INFO] --- maven-surefire-plugin:2.13:test (default-test) @ 
cybernode-service ---
[INFO] Surefire report directory: 
C:\Users\peter\Documents\NetBeansProjects\Rio\rio-services\cybernode\cybernode-service\target\surefire-reports

-------------------------------------------------------
  T E S T S
-------------------------------------------------------
Running 
org.rioproject.cybernode.service.TransientServiceStatementManagerTest
Tests run: 4, Failures: 0, Errors: 0, Skipped: 0, Time elapsed: 0.605 sec

Results :

Tests run: 4, Failures: 0, Errors: 0, Skipped: 0

[INFO]
[INFO] 
------------------------------------------------------------------------
[INFO] Building Module :: Monitor Service API 5.2.3-SNAPSHOT
[INFO] 
------------------------------------------------------------------------
[INFO]
[INFO] --- maven-resources-plugin:2.5:resources (default-resources) @ 
monitor-api ---
[debug] execute contextualize
[INFO] Using 'UTF-8' encoding to copy filtered resources.
[INFO] skip non existing resourceDirectory 
C:\Users\peter\Documents\NetBeansProjects\Rio\rio-services\monitor\monitor-api\src\main\resources
[INFO]
[INFO] --- maven-compiler-plugin:2.3.2:compile (default-compile) @ 
monitor-api ---
[INFO] Nothing to compile - all classes are up to date
[INFO]
[INFO] --- maven-resources-plugin:2.5:testResources 
(default-testResources) @ monitor-api ---
[debug] execute contextualize
[INFO] Using 'UTF-8' encoding to copy filtered resources.
[INFO] skip non existing resourceDirectory 
C:\Users\peter\Documents\NetBeansProjects\Rio\rio-services\monitor\monitor-api\src\test\resources
[INFO]
[INFO] --- maven-compiler-plugin:2.3.2:testCompile (default-testCompile) 
@ monitor-api ---
[INFO] No sources to compile
[INFO]
[INFO] --- maven-surefire-plugin:2.13:test (default-test) @ monitor-api ---
[INFO] No tests to run.
[INFO]
[INFO] 
------------------------------------------------------------------------
[INFO] Building Module :: Rio Test Infrastructure 5.2.3-SNAPSHOT
[INFO] 
------------------------------------------------------------------------
Downloading: 
file:\C:\Users\Peter\Documents\repo/au/net/zeus/jgdms/jgdms-activation/3.0-SNAPSHOT/jgdms-activation-3.0-20170422.002213-1.jar
Downloading: 
file:\C:\Users\Peter\Documents\repo/au/net/zeus/jgdms/outrigger/outrigger-service/3.0-SNAPSHOT/outrigger-service-3.0-20170422.002802-1.jar
Downloading: 
file:\C:\Users\Peter\Documents\repo/au/net/zeus/jgdms/outrigger/outrigger-dl/3.0-SNAPSHOT/outrigger-dl-3.0-20170422.002655-1.jar
Downloaded: 
file:\C:\Users\Peter\Documents\repo/au/net/zeus/jgdms/outrigger/outrigger-dl/3.0-SNAPSHOT/outrigger-dl-3.0-20170422.002655-1.jar 
(48 KB at 245.7 KB/
sec)
Downloaded: 
file:\C:\Users\Peter\Documents\repo/au/net/zeus/jgdms/jgdms-activation/3.0-SNAPSHOT/jgdms-activation-3.0-20170422.002213-1.jar 
(35 KB at 169.0 KB/se
c)
Downloaded: 
file:\C:\Users\Peter\Documents\repo/au/net/zeus/jgdms/outrigger/outrigger-service/3.0-SNAPSHOT/outrigger-service-3.0-20170422.002802-1.jar 
(331 KB a
t 1307.8 KB/sec)
[INFO]
[INFO] --- gmaven-plugin:1.4:generateStubs (default) @ rio-test ---
[INFO] Generated 2 Java stubs
[INFO]
[INFO] --- maven-resources-plugin:2.5:resources (default-resources) @ 
rio-test ---
[debug] execute contextualize
[INFO] Using 'UTF-8' encoding to copy filtered resources.
[INFO] Copying 3 resources
[INFO]
[INFO] --- maven-compiler-plugin:2.3.2:compile (default-compile) @ 
rio-test ---
[INFO] Nothing to compile - all classes are up to date
[INFO]
[INFO] --- gmaven-plugin:1.4:compile (default) @ rio-test ---
[INFO] Compiled 4 Groovy classes
[INFO]
[INFO] --- gmaven-plugin:1.4:generateTestStubs (default) @ rio-test ---
[INFO] Generated 13 Java stubs
[INFO]
[INFO] --- maven-resources-plugin:2.5:testResources 
(default-testResources) @ rio-test ---
[debug] execute contextualize
[INFO] Using 'UTF-8' encoding to copy filtered resources.
[INFO] Copying 36 resources
[INFO]
[INFO] --- maven-compiler-plugin:2.3.2:testCompile (default-testCompile) 
@ rio-test ---
[INFO] Compiling 67 source files to 
C:\Users\peter\Documents\NetBeansProjects\Rio\rio-test\target\test-classes
[INFO]
[INFO] --- gmaven-plugin:1.4:testCompile (default) @ rio-test ---
[INFO] Compiled 13 Groovy classes
[INFO]
[INFO] --- maven-surefire-plugin:2.13:test (default-test) @ rio-test ---
[INFO] Tests are skipped.
[INFO]
[INFO] 
------------------------------------------------------------------------
[INFO] Building Module :: Event Collector Service Implementation 
5.2.3-SNAPSHOT
[INFO] 
------------------------------------------------------------------------
[INFO]
[INFO] --- maven-resources-plugin:2.5:resources (default-resources) @ 
event-collector-service ---
[debug] execute contextualize
[INFO] Using 'UTF-8' encoding to copy filtered resources.
[INFO] skip non existing resourceDirectory 
C:\Users\peter\Documents\NetBeansProjects\Rio\rio-services\event-collector\event-collector-service\src\main\resources

[INFO]
[INFO] --- maven-compiler-plugin:2.3.2:compile (default-compile) @ 
event-collector-service ---
[INFO] Nothing to compile - all classes are up to date
[INFO]
[INFO] --- maven-resources-plugin:2.5:testResources 
(default-testResources) @ event-collector-service ---
[debug] execute contextualize
[INFO] Using 'UTF-8' encoding to copy filtered resources.
[INFO] skip non existing resourceDirectory 
C:\Users\peter\Documents\NetBeansProjects\Rio\rio-services\event-collector\event-collector-service\src\test\resources

[INFO]
[INFO] --- maven-compiler-plugin:2.3.2:testCompile (default-testCompile) 
@ event-collector-service ---
[INFO] Compiling 5 source files to 
C:\Users\peter\Documents\NetBeansProjects\Rio\rio-services\event-collector\event-collector-service\target\test-classes
[INFO]
[INFO] --- maven-surefire-plugin:2.13:test (default-test) @ 
event-collector-service ---
[INFO] Surefire report directory: 
C:\Users\peter\Documents\NetBeansProjects\Rio\rio-services\event-collector\event-collector-service\target\surefire-reports

-------------------------------------------------------
  T E S T S
-------------------------------------------------------
Running org.rioproject.eventcollector.service.TransientEventManagerTest
[1] event date: 18:59:43,910
[2] event date: 18:59:43,911
[3] event date: 18:59:43,912
[4] event date: 18:59:43,913
[5] event date: 18:59:43,914
[6] event date: 18:59:43,915
[7] event date: 18:59:43,916
[8] event date: 18:59:43,917
[9] event date: 18:59:43,918
[10] event date: 18:59:43,919
[11] event date: 18:59:43,920
[12] event date: 18:59:43,921
[13] event date: 18:59:43,922
[14] event date: 18:59:43,923
[15] event date: 18:59:43,925
[16] event date: 18:59:43,927
[17] event date: 18:59:43,929
[18] event date: 18:59:43,931
[19] event date: 18:59:43,933
[20] event date: 18:59:43,935
[21] event date: 18:59:43,937
[22] event date: 18:59:43,939
[23] event date: 18:59:43,941
[24] event date: 18:59:43,942
[25] event date: 18:59:43,943
[26] event date: 18:59:43,944
[27] event date: 18:59:43,945
[28] event date: 18:59:43,946
[29] event date: 18:59:43,947
[30] event date: 18:59:43,948
[31] event date: 18:59:43,949
[32] event date: 18:59:43,950
[33] event date: 18:59:43,951
[34] event date: 18:59:43,952
[35] event date: 18:59:43,953
[36] event date: 18:59:43,954
[37] event date: 18:59:43,955
[38] event date: 18:59:43,956
[39] event date: 18:59:43,957
[40] event date: 18:59:43,958
[41] event date: 18:59:43,959
[42] event date: 18:59:43,964
[43] event date: 18:59:43,965
[44] event date: 18:59:43,966
[45] event date: 18:59:43,967
[46] event date: 18:59:43,968
[47] event date: 18:59:43,969
[48] event date: 18:59:43,970
[49] event date: 18:59:43,971
[50] event date: 18:59:43,977

Requested index from: 18:59:43,958

Tests run: 4, Failures: 0, Errors: 0, Skipped: 0, Time elapsed: 43.97 sec

Results :

Tests run: 4, Failures: 0, Errors: 0, Skipped: 0

[INFO]
[INFO] 
------------------------------------------------------------------------
[INFO] Building Module :: Watch User Interface 5.2.3-SNAPSHOT
[INFO] 
------------------------------------------------------------------------
[INFO]
[INFO] --- maven-resources-plugin:2.5:resources (default-resources) @ 
watch-ui ---
[debug] execute contextualize
[INFO] Using 'UTF-8' encoding to copy filtered resources.
[INFO] Copying 2 resources
[INFO]
[INFO] --- maven-compiler-plugin:2.3.2:compile (default-compile) @ 
watch-ui ---
[INFO] Nothing to compile - all classes are up to date
[INFO]
[INFO] --- maven-resources-plugin:2.5:testResources 
(default-testResources) @ watch-ui ---
[debug] execute contextualize
[INFO] Using 'UTF-8' encoding to copy filtered resources.
[INFO] skip non existing resourceDirectory 
C:\Users\peter\Documents\NetBeansProjects\Rio\rio-tools\watch-ui\src\test\resources
[INFO]
[INFO] --- maven-compiler-plugin:2.3.2:testCompile (default-testCompile) 
@ watch-ui ---
[INFO] Compiling 1 source file to 
C:\Users\peter\Documents\NetBeansProjects\Rio\rio-tools\watch-ui\target\test-classes
[INFO]
[INFO] --- maven-surefire-plugin:2.13:test (default-test) @ watch-ui ---
[INFO] Surefire report directory: 
C:\Users\peter\Documents\NetBeansProjects\Rio\rio-tools\watch-ui\target\surefire-reports

-------------------------------------------------------
  T E S T S
-------------------------------------------------------
Running org.rioproject.impl.watch.StatisticsTest
Tests run: 13, Failures: 0, Errors: 0, Skipped: 0, Time elapsed: 0.388 sec

Results :

Tests run: 13, Failures: 0, Errors: 0, Skipped: 0

[INFO]
[INFO] 
------------------------------------------------------------------------
[INFO] Building Module :: Cybernode Service UI 5.2.3-SNAPSHOT
[INFO] 
------------------------------------------------------------------------
[INFO]
[INFO] --- maven-resources-plugin:2.5:resources (default-resources) @ 
cybernode-ui ---
[debug] execute contextualize
[INFO] Using 'UTF-8' encoding to copy filtered resources.
[INFO] skip non existing resourceDirectory 
C:\Users\peter\Documents\NetBeansProjects\Rio\rio-services\cybernode\cybernode-ui\src\main\resources
[INFO]
[INFO] --- maven-compiler-plugin:2.3.2:compile (default-compile) @ 
cybernode-ui ---
[INFO] Nothing to compile - all classes are up to date
[INFO]
[INFO] --- maven-resources-plugin:2.5:testResources 
(default-testResources) @ cybernode-ui ---
[debug] execute contextualize
[INFO] Using 'UTF-8' encoding to copy filtered resources.
[INFO] skip non existing resourceDirectory 
C:\Users\peter\Documents\NetBeansProjects\Rio\rio-services\cybernode\cybernode-ui\src\test\resources
[INFO]
[INFO] --- maven-compiler-plugin:2.3.2:testCompile (default-testCompile) 
@ cybernode-ui ---
[INFO] No sources to compile
[INFO]
[INFO] --- maven-surefire-plugin:2.13:test (default-test) @ cybernode-ui ---
[INFO] No tests to run.
[INFO]
[INFO] 
------------------------------------------------------------------------
[INFO] Building Module :: Gnostic 5.2.3-SNAPSHOT
[INFO] 
------------------------------------------------------------------------
[INFO]
[INFO] 
------------------------------------------------------------------------
[INFO] Building Module :: Gnostic API 5.2.3-SNAPSHOT
[INFO] 
------------------------------------------------------------------------
[INFO]
[INFO] --- maven-resources-plugin:2.5:resources (default-resources) @ 
gnostic-api ---
[debug] execute contextualize
[INFO] Using 'UTF-8' encoding to copy filtered resources.
[INFO] skip non existing resourceDirectory 
C:\Users\peter\Documents\NetBeansProjects\Rio\rio-services\gnostic\gnostic-api\src\main\resources
[INFO]
[INFO] --- maven-compiler-plugin:2.3.2:compile (default-compile) @ 
gnostic-api ---
[INFO] Nothing to compile - all classes are up to date
[INFO]
[INFO] --- maven-resources-plugin:2.5:testResources 
(default-testResources) @ gnostic-api ---
[debug] execute contextualize
[INFO] Using 'UTF-8' encoding to copy filtered resources.
[INFO] skip non existing resourceDirectory 
C:\Users\peter\Documents\NetBeansProjects\Rio\rio-services\gnostic\gnostic-api\src\test\resources
[INFO]
[INFO] --- maven-compiler-plugin:2.3.2:testCompile (default-testCompile) 
@ gnostic-api ---
[INFO] No sources to compile
[INFO]
[INFO] --- maven-surefire-plugin:2.13:test (default-test) @ gnostic-api ---
[INFO] No tests to run.
[INFO]
[INFO] 
------------------------------------------------------------------------
[INFO] Building Module :: Gnostic Service Implementation 5.2.3-SNAPSHOT
[INFO] 
------------------------------------------------------------------------
[INFO]
[INFO] --- maven-resources-plugin:2.5:resources (default-resources) @ 
gnostic-service ---
[debug] execute contextualize
[INFO] Using 'UTF-8' encoding to copy filtered resources.
[INFO] Copying 1 resource
[INFO]
[INFO] --- maven-compiler-plugin:2.3.2:compile (default-compile) @ 
gnostic-service ---
[INFO] Nothing to compile - all classes are up to date
[INFO]
[INFO] --- maven-resources-plugin:2.5:testResources 
(default-testResources) @ gnostic-service ---
[debug] execute contextualize
[INFO] Using 'UTF-8' encoding to copy filtered resources.
[INFO] Copying 7 resources
[INFO]
[INFO] --- maven-compiler-plugin:2.3.2:testCompile (default-testCompile) 
@ gnostic-service ---
[INFO] Compiling 14 source files to 
C:\Users\peter\Documents\NetBeansProjects\Rio\rio-services\gnostic\gnostic-service\target\test-classes
[INFO]
[INFO] --- maven-surefire-plugin:2.13:test (default-test) @ 
gnostic-service ---
[INFO] Surefire report directory: 
C:\Users\peter\Documents\NetBeansProjects\Rio\rio-services\gnostic\gnostic-service\target\surefire-reports

-------------------------------------------------------
  T E S T S
-------------------------------------------------------
Running org.rioproject.gnostic.service.SLAWatchesRulesTest
OBJECT ASSERTED value:2017.04.22 19:00:01,150 - id: [CPU], system: 
[NaN], user: [NaN], total: [NaN], value: [0.8] factId: 1
ACTIVATION CREATED rule:if CPU is over 50% over the last minute log as 
severe in the console activationId:if CPU is over 50% over the last 
minute log as severe
in the console [2, 0] declarations: $cpu=0.8(2)
BEFORE ACTIVATION FIRED rule:if CPU is over 50% over the last minute log 
as severe in the console activationId:if CPU is over 50% over the last 
minute log as se
vere in the console [2, 0] declarations: $cpu=0.8(2)
Apr 22, 2017 7:00:01 PM 
org.rioproject.gnostic.Rule_if_CPU_is_over_50__over_the_last_minute_log_as_severe_in_the_console_2112955045be4760bc07cf5fb8ee2d33 
defaul
tConsequence
SEVERE:


CPU is racing (CPU avg is 0.8)!!!



AFTER ACTIVATION FIRED rule:if CPU is over 50% over the last minute log 
as severe in the console activationId:if CPU is over 50% over the last 
minute log as sev
ere in the console [2, 0] declarations: $cpu=0.8(2)
OBJECT ASSERTED value:2017.04.22 19:00:01,621 - id: [CPU], system: 
[NaN], user: [NaN], total: [NaN], value: [0.4] factId: 1
Tests run: 3, Failures: 0, Errors: 0, Skipped: 0, Time elapsed: 9.586 sec

Results :

Tests run: 3, Failures: 0, Errors: 0, Skipped: 0

[INFO]
[INFO] 
------------------------------------------------------------------------
[INFO] Building Module :: Monitor Service Proxy 5.2.3-SNAPSHOT
[INFO] 
------------------------------------------------------------------------
[INFO]
[INFO] --- maven-resources-plugin:2.5:resources (default-resources) @ 
monitor-proxy ---
[debug] execute contextualize
[INFO] Using 'UTF-8' encoding to copy filtered resources.
[INFO] Copying 1 resource
[INFO]
[INFO] --- maven-compiler-plugin:2.3.2:compile (default-compile) @ 
monitor-proxy ---
[INFO] Nothing to compile - all classes are up to date
[INFO]
[INFO] --- maven-resources-plugin:2.5:testResources 
(default-testResources) @ monitor-proxy ---
[debug] execute contextualize
[INFO] Using 'UTF-8' encoding to copy filtered resources.
[INFO] skip non existing resourceDirectory 
C:\Users\peter\Documents\NetBeansProjects\Rio\rio-services\monitor\monitor-proxy\src\test\resources
[INFO]
[INFO] --- maven-compiler-plugin:2.3.2:testCompile (default-testCompile) 
@ monitor-proxy ---
[INFO] No sources to compile
[INFO]
[INFO] --- maven-surefire-plugin:2.13:test (default-test) @ 
monitor-proxy ---
[INFO] No tests to run.
[INFO]
[INFO] 
------------------------------------------------------------------------
[INFO] Building Module :: Monitor Service Implementation 5.2.3-SNAPSHOT
[INFO] 
------------------------------------------------------------------------
Downloading: 
file:\C:\Users\Peter\Documents\repo/au/net/zeus/jgdms/reggie/reggie-service/3.0-SNAPSHOT/reggie-service-3.0-20170422.002904-1.jar
Downloading: 
file:\C:\Users\Peter\Documents\repo/au/net/zeus/jgdms/reggie/reggie-dl/3.0-SNAPSHOT/reggie-dl-3.0-20170422.002846-1.jar
Downloaded: 
file:\C:\Users\Peter\Documents\repo/au/net/zeus/jgdms/reggie/reggie-dl/3.0-SNAPSHOT/reggie-dl-3.0-20170422.002846-1.jar 
(72 KB at 134.4 KB/sec)
Downloaded: 
file:\C:\Users\Peter\Documents\repo/au/net/zeus/jgdms/reggie/reggie-service/3.0-SNAPSHOT/reggie-service-3.0-20170422.002904-1.jar 
(108 KB at 168.5 K
B/sec)
[INFO]
[INFO] --- maven-resources-plugin:2.5:resources (default-resources) @ 
monitor-service ---
[debug] execute contextualize
[INFO] Using 'UTF-8' encoding to copy filtered resources.
[INFO] Copying 1 resource
[INFO]
[INFO] --- maven-compiler-plugin:2.3.2:compile (default-compile) @ 
monitor-service ---
[INFO] Nothing to compile - all classes are up to date
[INFO]
[INFO] --- maven-resources-plugin:2.5:testResources 
(default-testResources) @ monitor-service ---
[debug] execute contextualize
[INFO] Using 'UTF-8' encoding to copy filtered resources.
[INFO] skip non existing resourceDirectory 
C:\Users\peter\Documents\NetBeansProjects\Rio\rio-services\monitor\monitor-service\src\test\resources
[INFO]
[INFO] --- maven-compiler-plugin:2.3.2:testCompile (default-testCompile) 
@ monitor-service ---
[INFO] Compiling 7 source files to 
C:\Users\peter\Documents\NetBeansProjects\Rio\rio-services\monitor\monitor-service\target\test-classes
[INFO] -------------------------------------------------------------
[ERROR] COMPILATION ERROR :
[INFO] -------------------------------------------------------------
[ERROR] 
\Users\peter\Documents\NetBeansProjects\Rio\rio-services\monitor\monitor-service\src\test\java\org\rioproject\monitor\service\DeploymentVerifierTest.jav
a:[18,30] error: package org.apache.river.reggie does not exist
[ERROR] 
\Users\peter\Documents\NetBeansProjects\Rio\rio-services\monitor\monitor-service\src\test\java\org\rioproject\monitor\service\DeploymentVerifierTest.jav
a:[197,32] error: cannot find symbol
[INFO] 2 errors
[INFO] -------------------------------------------------------------
[INFO]
[INFO] 
------------------------------------------------------------------------
[INFO] Building Module :: Rio Command Line Interface 5.2.3-SNAPSHOT
[INFO] 
------------------------------------------------------------------------
[INFO]
[INFO] --- maven-resources-plugin:2.5:resources (default-resources) @ 
rio-cli ---
[debug] execute contextualize
[INFO] Using 'UTF-8' encoding to copy filtered resources.
[INFO] skip non existing resourceDirectory 
C:\Users\peter\Documents\NetBeansProjects\Rio\rio-tools\rio-cli\src\main\resources
[INFO]
[INFO] --- maven-compiler-plugin:2.3.2:compile (default-compile) @ 
rio-cli ---
[INFO] Nothing to compile - all classes are up to date
[INFO]
[INFO] --- maven-resources-plugin:2.5:testResources 
(default-testResources) @ rio-cli ---
[debug] execute contextualize
[INFO] Using 'UTF-8' encoding to copy filtered resources.
[INFO] skip non existing resourceDirectory 
C:\Users\peter\Documents\NetBeansProjects\Rio\rio-tools\rio-cli\src\test\resources
[INFO]
[INFO] --- maven-compiler-plugin:2.3.2:testCompile (default-testCompile) 
@ rio-cli ---
[INFO] No sources to compile
[INFO]
[INFO] --- maven-surefire-plugin:2.13:test (default-test) @ rio-cli ---
[INFO] No tests to run.
[INFO]
[INFO] 
------------------------------------------------------------------------
[INFO] Building Module :: Rio Management User Interface 5.2.3-SNAPSHOT
[INFO] 
------------------------------------------------------------------------
[INFO]
[INFO] --- maven-resources-plugin:2.5:resources (default-resources) @ 
rio-ui ---
[debug] execute contextualize
[INFO] Using 'UTF-8' encoding to copy filtered resources.
[INFO] Copying 18 resources
[INFO]
[INFO] --- maven-compiler-plugin:2.3.2:compile (default-compile) @ 
rio-ui ---
[INFO] Nothing to compile - all classes are up to date
[INFO]
[INFO] --- maven-resources-plugin:2.5:testResources 
(default-testResources) @ rio-ui ---
[debug] execute contextualize
[INFO] Using 'UTF-8' encoding to copy filtered resources.
[INFO] skip non existing resourceDirectory 
C:\Users\peter\Documents\NetBeansProjects\Rio\rio-tools\rio-ui\src\test\resources
[INFO]
[INFO] --- maven-compiler-plugin:2.3.2:testCompile (default-testCompile) 
@ rio-ui ---
[INFO] No sources to compile
[INFO]
[INFO] --- maven-surefire-plugin:2.13:test (default-test) @ rio-ui ---
[INFO] No tests to run.
[INFO]
[INFO] 
------------------------------------------------------------------------
[INFO] Building Rio Examples 2.3.5-SNAPSHOT
[INFO] 
------------------------------------------------------------------------
[INFO]
[INFO] 
------------------------------------------------------------------------
[INFO] Building Example :: Calculator 2.3.5-SNAPSHOT
[INFO] 
------------------------------------------------------------------------
[INFO]
[INFO] 
------------------------------------------------------------------------
[INFO] Building Example :: Calculator API 2.3.5-SNAPSHOT
[INFO] 
------------------------------------------------------------------------
[INFO]
[INFO] --- maven-resources-plugin:2.6:resources (default-resources) @ 
calculator-api ---
[WARNING] Using platform encoding (Cp1252 actually) to copy filtered 
resources, i.e. build is platform dependent!
[INFO] skip non existing resourceDirectory 
C:\Users\peter\Documents\NetBeansProjects\Rio\examples\calculator\calculator-api\src\main\resources
[INFO]
[INFO] --- maven-compiler-plugin:2.3.2:compile (default-compile) @ 
calculator-api ---
[INFO] Nothing to compile - all classes are up to date
[INFO]
[INFO] --- maven-resources-plugin:2.6:testResources 
(default-testResources) @ calculator-api ---
[WARNING] Using platform encoding (Cp1252 actually) to copy filtered 
resources, i.e. build is platform dependent!
[INFO] skip non existing resourceDirectory 
C:\Users\peter\Documents\NetBeansProjects\Rio\examples\calculator\calculator-api\src\test\resources
[INFO]
[INFO] --- maven-compiler-plugin:2.3.2:testCompile (default-testCompile) 
@ calculator-api ---
[INFO] No sources to compile
[INFO]
[INFO] --- maven-surefire-plugin:2.13:test (default-test) @ 
calculator-api ---
[INFO] No tests to run.
[INFO]
[INFO] 
------------------------------------------------------------------------
[INFO] Building Example :: Calculator Service Implementation 2.3.5-SNAPSHOT
[INFO] 
------------------------------------------------------------------------
[INFO]
[INFO] --- maven-resources-plugin:2.6:resources (default-resources) @ 
calculator-service ---
[WARNING] Using platform encoding (Cp1252 actually) to copy filtered 
resources, i.e. build is platform dependent!
[INFO] skip non existing resourceDirectory 
C:\Users\peter\Documents\NetBeansProjects\Rio\examples\calculator\calculator-service\src\main\resources
[INFO]
[INFO] --- maven-compiler-plugin:2.3.2:compile (default-compile) @ 
calculator-service ---
[INFO] Nothing to compile - all classes are up to date
[INFO]
[INFO] --- maven-resources-plugin:2.6:testResources 
(default-testResources) @ calculator-service ---
[WARNING] Using platform encoding (Cp1252 actually) to copy filtered 
resources, i.e. build is platform dependent!
[INFO] skip non existing resourceDirectory 
C:\Users\peter\Documents\NetBeansProjects\Rio\examples\calculator\calculator-service\src\test\resources
[INFO]
[INFO] --- maven-compiler-plugin:2.3.2:testCompile (default-testCompile) 
@ calculator-service ---
[INFO] Compiling 4 source files to 
C:\Users\peter\Documents\NetBeansProjects\Rio\examples\calculator\calculator-service\target\test-classes
[INFO]
[INFO] --- maven-surefire-plugin:2.13:test (default-test) @ 
calculator-service ---
[INFO]
[INFO] 
------------------------------------------------------------------------
[INFO] Building Example :: Events 2.3.5-SNAPSHOT
[INFO] 
------------------------------------------------------------------------
[INFO]
[INFO] 
------------------------------------------------------------------------
[INFO] Building Example :: Events API 2.3.5-SNAPSHOT
[INFO] 
------------------------------------------------------------------------
[INFO]
[INFO] --- maven-resources-plugin:2.6:resources (default-resources) @ 
events-api ---
[WARNING] Using platform encoding (Cp1252 actually) to copy filtered 
resources, i.e. build is platform dependent!
[INFO] skip non existing resourceDirectory 
C:\Users\peter\Documents\NetBeansProjects\Rio\examples\events\events-api\src\main\resources
[INFO]
[INFO] --- maven-compiler-plugin:2.3.2:compile (default-compile) @ 
events-api ---
[INFO] Nothing to compile - all classes are up to date
[INFO]
[INFO] --- maven-resources-plugin:2.6:testResources 
(default-testResources) @ events-api ---
[WARNING] Using platform encoding (Cp1252 actually) to copy filtered 
resources, i.e. build is platform dependent!
[INFO] skip non existing resourceDirectory 
C:\Users\peter\Documents\NetBeansProjects\Rio\examples\events\events-api\src\test\resources
[INFO]
[INFO] --- maven-compiler-plugin:2.3.2:testCompile (default-testCompile) 
@ events-api ---
[INFO] No sources to compile
[INFO]
[INFO] --- maven-surefire-plugin:2.13:test (default-test) @ events-api ---
[INFO] No tests to run.
[INFO]
[INFO] 
------------------------------------------------------------------------
[INFO] Building Example :: Events Proxy 2.3.5-SNAPSHOT
[INFO] 
------------------------------------------------------------------------
[INFO]
[INFO] --- maven-resources-plugin:2.6:resources (default-resources) @ 
events-proxy ---
[WARNING] Using platform encoding (Cp1252 actually) to copy filtered 
resources, i.e. build is platform dependent!
[INFO] skip non existing resourceDirectory 
C:\Users\peter\Documents\NetBeansProjects\Rio\examples\events\events-proxy\src\main\resources
[INFO]
[INFO] --- maven-compiler-plugin:2.3.2:compile (default-compile) @ 
events-proxy ---
[INFO] Nothing to compile - all classes are up to date
[INFO]
[INFO] --- maven-resources-plugin:2.6:testResources 
(default-testResources) @ events-proxy ---
[WARNING] Using platform encoding (Cp1252 actually) to copy filtered 
resources, i.e. build is platform dependent!
[INFO] skip non existing resourceDirectory 
C:\Users\peter\Documents\NetBeansProjects\Rio\examples\events\events-proxy\src\test\resources
[INFO]
[INFO] --- maven-compiler-plugin:2.3.2:testCompile (default-testCompile) 
@ events-proxy ---
[INFO] No sources to compile
[INFO]
[INFO] --- maven-surefire-plugin:2.13:test (default-test) @ events-proxy ---
[INFO] No tests to run.
[INFO]
[INFO] 
------------------------------------------------------------------------
[INFO] Building Example :: Events Service Implementation 2.3.5-SNAPSHOT
[INFO] 
------------------------------------------------------------------------
[INFO]
[INFO] --- maven-resources-plugin:2.6:resources (default-resources) @ 
events-service ---
[WARNING] Using platform encoding (Cp1252 actually) to copy filtered 
resources, i.e. build is platform dependent!
[INFO] Copying 1 resource
[INFO]
[INFO] --- maven-compiler-plugin:2.3.2:compile (default-compile) @ 
events-service ---
[INFO] Nothing to compile - all classes are up to date
[INFO]
[INFO] --- maven-resources-plugin:2.6:testResources 
(default-testResources) @ events-service ---
[WARNING] Using platform encoding (Cp1252 actually) to copy filtered 
resources, i.e. build is platform dependent!
[INFO] skip non existing resourceDirectory 
C:\Users\peter\Documents\NetBeansProjects\Rio\examples\events\events-service\src\test\resources
[INFO]
[INFO] --- maven-compiler-plugin:2.3.2:testCompile (default-testCompile) 
@ events-service ---
[INFO] Compiling 2 source files to 
C:\Users\peter\Documents\NetBeansProjects\Rio\examples\events\events-service\target\test-classes
[INFO]
[INFO] --- maven-surefire-plugin:2.13:test (default-test) @ 
events-service ---
[INFO]
[INFO] 
------------------------------------------------------------------------
[INFO] Building Example :: Events UI 2.3.5-SNAPSHOT
[INFO] 
------------------------------------------------------------------------
[INFO]
[INFO] --- maven-resources-plugin:2.6:resources (default-resources) @ 
events-ui ---
[WARNING] Using platform encoding (Cp1252 actually) to copy filtered 
resources, i.e. build is platform dependent!
[INFO] skip non existing resourceDirectory 
C:\Users\peter\Documents\NetBeansProjects\Rio\examples\events\events-ui\src\main\resources
[INFO]
[INFO] --- maven-compiler-plugin:2.3.2:compile (default-compile) @ 
events-ui ---
[INFO] Nothing to compile - all classes are up to date
[INFO]
[INFO] --- maven-resources-plugin:2.6:testResources 
(default-testResources) @ events-ui ---
[WARNING] Using platform encoding (Cp1252 actually) to copy filtered 
resources, i.e. build is platform dependent!
[INFO] skip non existing resourceDirectory 
C:\Users\peter\Documents\NetBeansProjects\Rio\examples\events\events-ui\src\test\resources
[INFO]
[INFO] --- maven-compiler-plugin:2.3.2:testCompile (default-testCompile) 
@ events-ui ---
[INFO] No sources to compile
[INFO]
[INFO] --- maven-surefire-plugin:2.13:test (default-test) @ events-ui ---
[INFO] No tests to run.
[INFO]
[INFO] 
------------------------------------------------------------------------
[INFO] Building Example :: Hospital 2.3.5-SNAPSHOT
[INFO] 
------------------------------------------------------------------------
[INFO]
[INFO] 
------------------------------------------------------------------------
[INFO] Building Example :: Hospital API 2.3.5-SNAPSHOT
[INFO] 
------------------------------------------------------------------------
[INFO]
[INFO] --- maven-resources-plugin:2.6:resources (default-resources) @ 
hospital-api ---
[WARNING] Using platform encoding (Cp1252 actually) to copy filtered 
resources, i.e. build is platform dependent!
[INFO] skip non existing resourceDirectory 
C:\Users\peter\Documents\NetBeansProjects\Rio\examples\hospital\hospital-api\src\main\resources
[INFO]
[INFO] --- maven-compiler-plugin:2.3.2:compile (default-compile) @ 
hospital-api ---
[INFO] Nothing to compile - all classes are up to date
[INFO]
[INFO] --- maven-resources-plugin:2.6:testResources 
(default-testResources) @ hospital-api ---
[WARNING] Using platform encoding (Cp1252 actually) to copy filtered 
resources, i.e. build is platform dependent!
[INFO] skip non existing resourceDirectory 
C:\Users\peter\Documents\NetBeansProjects\Rio\examples\hospital\hospital-api\src\test\resources
[INFO]
[INFO] --- maven-compiler-plugin:2.3.2:testCompile (default-testCompile) 
@ hospital-api ---
[INFO] No sources to compile
[INFO]
[INFO] --- maven-surefire-plugin:2.13:test (default-test) @ hospital-api ---
[INFO] No tests to run.
[INFO]
[INFO] 
------------------------------------------------------------------------
[INFO] Building Example :: Hospital Rules 2.3.5-SNAPSHOT
[INFO] 
------------------------------------------------------------------------
[INFO]
[INFO] --- maven-resources-plugin:2.6:resources (default-resources) @ 
hospital-rule ---
[WARNING] Using platform encoding (Cp1252 actually) to copy filtered 
resources, i.e. build is platform dependent!
[INFO] Copying 2 resources
[INFO]
[INFO] --- maven-compiler-plugin:2.3.2:compile (default-compile) @ 
hospital-rule ---
[INFO] Nothing to compile - all classes are up to date
[INFO]
[INFO] --- maven-resources-plugin:2.6:testResources 
(default-testResources) @ hospital-rule ---
[WARNING] Using platform encoding (Cp1252 actually) to copy filtered 
resources, i.e. build is platform dependent!
[INFO] skip non existing resourceDirectory 
C:\Users\peter\Documents\NetBeansProjects\Rio\examples\hospital\hospital-rule\src\test\resources
[INFO]
[INFO] --- maven-compiler-plugin:2.3.2:testCompile (default-testCompile) 
@ hospital-rule ---
[INFO] No sources to compile
[INFO]
[INFO] --- maven-surefire-plugin:2.13:test (default-test) @ 
hospital-rule ---
[INFO] No tests to run.
[INFO]
[INFO] 
------------------------------------------------------------------------
[INFO] Building Example :: Hospital Service Implementation 2.3.5-SNAPSHOT
[INFO] 
------------------------------------------------------------------------
[INFO]
[INFO] --- maven-resources-plugin:2.6:resources (default-resources) @ 
hospital-service ---
[WARNING] Using platform encoding (Cp1252 actually) to copy filtered 
resources, i.e. build is platform dependent!
[INFO] Copying 2 resources
[INFO]
[INFO] --- maven-compiler-plugin:2.3.2:compile (default-compile) @ 
hospital-service ---
[INFO] Nothing to compile - all classes are up to date
[INFO]
[INFO] --- maven-resources-plugin:2.6:testResources 
(default-testResources) @ hospital-service ---
[WARNING] Using platform encoding (Cp1252 actually) to copy filtered 
resources, i.e. build is platform dependent!
[INFO] skip non existing resourceDirectory 
C:\Users\peter\Documents\NetBeansProjects\Rio\examples\hospital\hospital-service\src\test\resources
[INFO]
[INFO] --- maven-compiler-plugin:2.3.2:testCompile (default-testCompile) 
@ hospital-service ---
[INFO] Compiling 1 source file to 
C:\Users\peter\Documents\NetBeansProjects\Rio\examples\hospital\hospital-service\target\test-classes
[INFO]
[INFO] --- maven-surefire-plugin:2.13:test (default-test) @ 
hospital-service ---
[INFO]
[INFO] 
------------------------------------------------------------------------
[INFO] Building Example :: Hospital UI 2.3.5-SNAPSHOT
[INFO] 
------------------------------------------------------------------------
[INFO]
[INFO] --- maven-resources-plugin:2.6:resources (default-resources) @ 
hospital-ui ---
[WARNING] Using platform encoding (Cp1252 actually) to copy filtered 
resources, i.e. build is platform dependent!
[INFO] Copying 6 resources
[INFO]
[INFO] --- maven-compiler-plugin:2.3.2:compile (default-compile) @ 
hospital-ui ---
[INFO] Nothing to compile - all classes are up to date
[INFO]
[INFO] --- maven-resources-plugin:2.6:testResources 
(default-testResources) @ hospital-ui ---
[WARNING] Using platform encoding (Cp1252 actually) to copy filtered 
resources, i.e. build is platform dependent!
[INFO] skip non existing resourceDirectory 
C:\Users\peter\Documents\NetBeansProjects\Rio\examples\hospital\hospital-ui\src\test\resources
[INFO]
[INFO] --- maven-compiler-plugin:2.3.2:testCompile (default-testCompile) 
@ hospital-ui ---
[INFO] No sources to compile
[INFO]
[INFO] --- maven-surefire-plugin:2.13:test (default-test) @ hospital-ui ---
[INFO] No tests to run.
[INFO]
[INFO] 
------------------------------------------------------------------------
[INFO] Building Example :: SpringBean 2.3.5-SNAPSHOT
[INFO] 
------------------------------------------------------------------------
[INFO]
[INFO] 
------------------------------------------------------------------------
[INFO] Building Example :: SpringBean API 2.3.5-SNAPSHOT
[INFO] 
------------------------------------------------------------------------
[INFO]
[INFO] --- maven-resources-plugin:2.6:resources (default-resources) @ 
springbean-api ---
[WARNING] Using platform encoding (Cp1252 actually) to copy filtered 
resources, i.e. build is platform dependent!
[INFO] skip non existing resourceDirectory 
C:\Users\peter\Documents\NetBeansProjects\Rio\examples\springbean\springbean-api\src\main\resources
[INFO]
[INFO] --- maven-compiler-plugin:2.3.2:compile (default-compile) @ 
springbean-api ---
[INFO] Nothing to compile - all classes are up to date
[INFO]
[INFO] --- maven-resources-plugin:2.6:testResources 
(default-testResources) @ springbean-api ---
[WARNING] Using platform encoding (Cp1252 actually) to copy filtered 
resources, i.e. build is platform dependent!
[INFO] skip non existing resourceDirectory 
C:\Users\peter\Documents\NetBeansProjects\Rio\examples\springbean\springbean-api\src\test\resources
[INFO]
[INFO] --- maven-compiler-plugin:2.3.2:testCompile (default-testCompile) 
@ springbean-api ---
[INFO] No sources to compile
[INFO]
[INFO] --- maven-surefire-plugin:2.13:test (default-test) @ 
springbean-api ---
[INFO] No tests to run.
[INFO]
[INFO] 
------------------------------------------------------------------------
[INFO] Building Example :: SpringBean Service Implementation 2.3.5-SNAPSHOT
[INFO] 
------------------------------------------------------------------------
[INFO]
[INFO] --- maven-resources-plugin:2.6:resources (default-resources) @ 
springbean-service ---
[WARNING] Using platform encoding (Cp1252 actually) to copy filtered 
resources, i.e. build is platform dependent!
[INFO] Copying 1 resource
[INFO]
[INFO] --- maven-compiler-plugin:2.3.2:compile (default-compile) @ 
springbean-service ---
[INFO] Nothing to compile - all classes are up to date
[INFO]
[INFO] --- maven-resources-plugin:2.6:testResources 
(default-testResources) @ springbean-service ---
[WARNING] Using platform encoding (Cp1252 actually) to copy filtered 
resources, i.e. build is platform dependent!
[INFO] skip non existing resourceDirectory 
C:\Users\peter\Documents\NetBeansProjects\Rio\examples\springbean\springbean-service\src\test\resources
[INFO]
[INFO] --- maven-compiler-plugin:2.3.2:testCompile (default-testCompile) 
@ springbean-service ---
[INFO] Compiling 2 source files to 
C:\Users\peter\Documents\NetBeansProjects\Rio\examples\springbean\springbean-service\target\test-classes
[INFO]
[INFO] --- maven-surefire-plugin:2.13:test (default-test) @ 
springbean-service ---
[INFO]
[INFO] 
------------------------------------------------------------------------
[INFO] Building Example :: Workflow 2.3.5-SNAPSHOT
[INFO] 
------------------------------------------------------------------------
[INFO]
[INFO] 
------------------------------------------------------------------------
[INFO] Building Example :: Workflow API 2.3.5-SNAPSHOT
[INFO] 
------------------------------------------------------------------------
[INFO]
[INFO] --- maven-resources-plugin:2.6:resources (default-resources) @ 
workflow-api ---
[WARNING] Using platform encoding (Cp1252 actually) to copy filtered 
resources, i.e. build is platform dependent!
[INFO] skip non existing resourceDirectory 
C:\Users\peter\Documents\NetBeansProjects\Rio\examples\workflow\workflow-api\src\main\resources
[INFO]
[INFO] --- maven-compiler-plugin:2.3.2:compile (default-compile) @ 
workflow-api ---
[INFO] Compiling 1 source file to 
C:\Users\peter\Documents\NetBeansProjects\Rio\examples\workflow\workflow-api\target\classes
[INFO]
[INFO] --- maven-resources-plugin:2.6:testResources 
(default-testResources) @ workflow-api ---
[WARNING] Using platform encoding (Cp1252 actually) to copy filtered 
resources, i.e. build is platform dependent!
[INFO] skip non existing resourceDirectory 
C:\Users\peter\Documents\NetBeansProjects\Rio\examples\workflow\workflow-api\src\test\resources
[INFO]
[INFO] --- maven-compiler-plugin:2.3.2:testCompile (default-testCompile) 
@ workflow-api ---
[INFO] No sources to compile
[INFO]
[INFO] --- maven-surefire-plugin:2.13:test (default-test) @ workflow-api ---
[INFO] No tests to run.
[INFO]
[INFO] 
------------------------------------------------------------------------
[INFO] Building Example :: Workflow Service Implementation 2.3.5-SNAPSHOT
[INFO] 
------------------------------------------------------------------------
[WARNING] The POM for 
org.apache.river.mahalo:mahalo-service:jar:3.0-SNAPSHOT is missing, no 
dependency information available
Downloading: 
http://www.rio-project.org/maven2/org/apache/river/mahalo/mahalo-service/3.0-SNAPSHOT/mahalo-service-3.0-SNAPSHOT.jar
Downloading: 
http://repository.jboss.org/nexus/content/groups/public-jboss/org/apache/river/mahalo/mahalo-service/3.0-SNAPSHOT/mahalo-service-3.0-SNAPSHOT.jar
[INFO]
[INFO] 
------------------------------------------------------------------------
[INFO] Building Example :: Tomcat 2.3.5-SNAPSHOT
[INFO] 
------------------------------------------------------------------------
[INFO]
[INFO] --- maven-resources-plugin:3.0.2:resources (default-resources) @ 
tomcat ---
[WARNING] Using platform encoding (Cp1252 actually) to copy filtered 
resources, i.e. build is platform dependent!
[INFO] skip non existing resourceDirectory 
C:\Users\peter\Documents\NetBeansProjects\Rio\examples\tomcat\src\main\resources
[INFO]
[INFO] --- maven-compiler-plugin:2.3.2:compile (default-compile) @ 
tomcat ---
[INFO] No sources to compile
[INFO]
[INFO] --- maven-resources-plugin:3.0.2:testResources 
(default-testResources) @ tomcat ---
[WARNING] Using platform encoding (Cp1252 actually) to copy filtered 
resources, i.e. build is platform dependent!
[INFO] skip non existing resourceDirectory 
C:\Users\peter\Documents\NetBeansProjects\Rio\examples\tomcat\src\test\resources
[INFO]
[INFO] --- maven-compiler-plugin:2.3.2:testCompile (default-testCompile) 
@ tomcat ---
[INFO] Compiling 1 source file to 
C:\Users\peter\Documents\NetBeansProjects\Rio\examples\tomcat\target\test-classes
[INFO]
[INFO] --- maven-surefire-plugin:2.13:test (default-test) @ tomcat ---
[INFO]
[INFO] 
------------------------------------------------------------------------
[INFO] Building Rio Distribution 5.2.3-SNAPSHOT
[INFO] 
------------------------------------------------------------------------
[INFO] 
------------------------------------------------------------------------
[INFO] Reactor Summary:
[INFO]
[INFO] Rio Project ........................................ SUCCESS [  
0.063 s]
[INFO] Module :: Rio Logging Support ...................... SUCCESS [  
1.122 s]
[INFO] Module :: Rio Platform ............................. SUCCESS [ 
16.453 s]
[INFO] Module :: Rio service starters ..................... SUCCESS [  
0.826 s]
[INFO] Module :: Webster .................................. SUCCESS [  
4.671 s]
[INFO] Module :: Rio API .................................. SUCCESS [  
2.720 s]
[INFO] Module :: Rio Proxy ................................ SUCCESS [  
0.067 s]
[INFO] Module :: Rio Library .............................. SUCCESS 
[02:55 min]
[INFO] Module :: Aether Resolver .......................... FAILURE [  
01:02 h]
[INFO] Module :: Project Module Resolver .................. FAILURE [  
5.726 s]
[INFO] Module :: Event Collector Service API .............. SUCCESS [  
0.584 s]
[INFO] Module :: Event Collector Service Proxy ............ SUCCESS [  
0.065 s]
[INFO] Module :: Cybernode Service API .................... SUCCESS [  
0.095 s]
[INFO] Module :: Cybernode Service Proxy .................. SUCCESS [  
0.064 s]
[INFO] Module :: Cybernode Service Implementation ......... SUCCESS [  
3.338 s]
[INFO] Module :: Monitor Service API ...................... SUCCESS [  
0.062 s]
[INFO] Module :: Rio Test Infrastructure .................. SUCCESS [ 
12.239 s]
[INFO] Module :: Event Collector Service Implementation ... SUCCESS [ 
48.434 s]
[INFO] Module :: Watch User Interface ..................... SUCCESS [  
2.215 s]
[INFO] Module :: Cybernode Service UI ..................... SUCCESS [  
0.063 s]
[INFO] Module :: Gnostic .................................. SUCCESS [  
0.002 s]
[INFO] Module :: Gnostic API .............................. SUCCESS [  
0.511 s]
[INFO] Module :: Gnostic Service Implementation ........... SUCCESS [ 
14.114 s]
[INFO] Module :: Monitor Service Proxy .................... SUCCESS [  
0.084 s]
[INFO] Module :: Monitor Service Implementation ........... FAILURE [  
3.500 s]
[INFO] Module :: Rio Command Line Interface ............... SUCCESS [  
0.050 s]
[INFO] Module :: Rio Management User Interface ............ SUCCESS [  
0.109 s]
[INFO] Rio Examples ....................................... SUCCESS [  
0.001 s]
[INFO] Example :: Calculator .............................. SUCCESS [  
0.000 s]
[INFO] Example :: Calculator API .......................... SUCCESS [  
0.384 s]
[INFO] Example :: Calculator Service Implementation ....... SUCCESS [  
1.815 s]
[INFO] Example :: Events .................................. SUCCESS [  
0.009 s]
[INFO] Example :: Events API .............................. SUCCESS [  
0.037 s]
[INFO] Example :: Events Proxy ............................ SUCCESS [  
0.034 s]
[INFO] Example :: Events Service Implementation ........... SUCCESS [  
1.335 s]
[INFO] Example :: Events UI ............................... SUCCESS [  
0.036 s]
[INFO] Example :: Hospital ................................ SUCCESS [  
0.001 s]
[INFO] Example :: Hospital API ............................ SUCCESS [  
0.039 s]
[INFO] Example :: Hospital Rules .......................... SUCCESS [  
0.037 s]
[INFO] Example :: Hospital Service Implementation ......... SUCCESS [  
1.610 s]
[INFO] Example :: Hospital UI ............................. SUCCESS [  
0.061 s]
[INFO] Example :: SpringBean .............................. SUCCESS [  
0.001 s]
[INFO] Example :: SpringBean API .......................... SUCCESS [  
0.080 s]
[INFO] Example :: SpringBean Service Implementation ....... SUCCESS [  
1.657 s]
[INFO] Example :: Workflow ................................ SUCCESS [  
0.005 s]
[INFO] Example :: Workflow API ............................ SUCCESS [  
0.855 s]
[INFO] Example :: Workflow Service Implementation ......... FAILURE [ 
23.254 s]
[INFO] Example :: Tomcat .................................. SUCCESS [  
2.224 s]
[INFO] Rio Distribution ................................... SUCCESS [  
0.000 s]
[INFO] 
------------------------------------------------------------------------
[INFO] BUILD FAILURE
[INFO] 
------------------------------------------------------------------------
[INFO] Total time: 01:07 h
[INFO] Finished at: 2017-04-22T19:00:38+10:00
[INFO] Final Memory: 74M/177M
[INFO] 
------------------------------------------------------------------------
[ERROR] Failed to execute goal 
org.apache.maven.plugins:maven-surefire-plugin:2.13:test (default-test) 
on project resolver-aether: There are test failures.
[ERROR]
[ERROR] Please refer to 
C:\Users\peter\Documents\NetBeansProjects\Rio\rio-resolver\resolver-aether\target\surefire-reports 
for the individual test results.
[ERROR] -> [Help 1]
[ERROR] Failed to execute goal 
org.apache.maven.plugins:maven-surefire-plugin:2.13:test (default-test) 
on project resolver-project: There are test failures.
[ERROR]
[ERROR] Please refer to 
C:\Users\peter\Documents\NetBeansProjects\Rio\rio-resolver\resolver-project\target\surefire-reports 
for the individual test results.
[ERROR] -> [Help 1]
[ERROR] Failed to execute goal 
org.apache.maven.plugins:maven-compiler-plugin:2.3.2:testCompile 
(default-testCompile) on project monitor-service: Compilation fa
ilure: Compilation failure:
[ERROR] 
\Users\peter\Documents\NetBeansProjects\Rio\rio-services\monitor\monitor-service\src\test\java\org\rioproject\monitor\service\DeploymentVerifierTest.jav
a:[18,30] error: package org.apache.river.reggie does not exist
[ERROR] 
\Users\peter\Documents\NetBeansProjects\Rio\rio-services\monitor\monitor-service\src\test\java\org\rioproject\monitor\service\DeploymentVerifierTest.jav
a:[197,32] error: cannot find symbol
[ERROR] -> [Help 1]
[ERROR] Failed to execute goal on project workflow-service: Could not 
resolve dependencies for project 
org.rioproject.examples.workflow:workflow-service:jar:2.3
.5-SNAPSHOT: Could not find artifact 
org.apache.river.mahalo:mahalo-service:jar:3.0-SNAPSHOT in rio 
(http://www.rio-project.org/maven2) -> [Help 2]
[ERROR]
[ERROR] To see the full stack trace of the errors, re-run Maven with the 
-e switch.
[ERROR] Re-run Maven using the -X switch to enable full debug logging.
[ERROR]
[ERROR] For more information about the errors and possible solutions, 
please read the following articles:
[ERROR] [Help 1] 
http://cwiki.apache.org/confluence/display/MAVEN/MojoFailureException
[ERROR] [Help 2] 
http://cwiki.apache.org/confluence/display/MAVEN/DependencyResolutionException
[ERROR]
[ERROR] After correcting the problems, you can resume the build with the 
command
[ERROR]   mvn <goals> -rf :resolver-aether
[INFO] Build failures were ignored.

Mime
View raw message