river-dev mailing list archives

Site index · List index
Message view « Date » · « Thread »
Top « Date » · « Thread »
From Apache Jenkins Server <jenk...@builds.apache.org>
Subject Build failed in Jenkins: river-ServiceDiscoveryManagerTests #16
Date Sat, 21 Jun 2014 22:06:52 GMT
See <https://builds.apache.org/job/river-ServiceDiscoveryManagerTests/16/>

------------------------------------------
[...truncated 8408 lines...]
     [java] -----------------------------------------
     [java] com/sun/jini/test/impl/servicediscovery/event/LookupTaskRace.td
     [java] Test Failed: Construct Failed: com.sun.jini.qa.harness.TestException: Problem
creating service for net.jini.core.lookup.ServiceRegistrar; nested exception is: 
     [java] 	RemoteException in server thread; nested exception is: 
     [java] 	java.rmi.RemoteException: Create failed; nested exception is: 
     [java] 	java.lang.ClassNotFoundException: com.sun.jini.reggie.TransientRegistrarImpl
     [java] 
     [java] -----------------------------------------
     [java] com/sun/jini/test/impl/servicediscovery/event/LookupTaskServiceIdMapRace.td
     [java] Test Failed: Construct Failed: com.sun.jini.qa.harness.TestException: Problem
creating service for net.jini.core.lookup.ServiceRegistrar; nested exception is: 
     [java] 	RemoteException in server thread; nested exception is: 
     [java] 	java.rmi.RemoteException: Create failed; nested exception is: 
     [java] 	java.lang.ClassNotFoundException: com.sun.jini.reggie.TransientRegistrarImpl
     [java] 
     [java] -----------------------------------------
     [java] com/sun/jini/test/impl/servicediscovery/event/NotifyEventDropProxyTaskRace.td
     [java] Test Failed: Construct Failed: com.sun.jini.qa.harness.TestException: Problem
creating service for net.jini.core.lookup.ServiceRegistrar; nested exception is: 
     [java] 	RemoteException in server thread; nested exception is: 
     [java] 	java.rmi.RemoteException: Create failed; nested exception is: 
     [java] 	java.lang.ClassNotFoundException: com.sun.jini.reggie.TransientRegistrarImpl
     [java] 
     [java] -----------------------------------------
     [java] com/sun/jini/test/impl/servicediscovery/event/ReRegisterBadEquals.td
     [java] Test Failed: Construct Failed: com.sun.jini.qa.harness.TestException: Problem
creating service for net.jini.core.lookup.ServiceRegistrar; nested exception is: 
     [java] 	RemoteException in server thread; nested exception is: 
     [java] 	java.rmi.RemoteException: Create failed; nested exception is: 
     [java] 	java.lang.ClassNotFoundException: com.sun.jini.reggie.TransientRegistrarImpl
     [java] 
     [java] -----------------------------------------
     [java] com/sun/jini/test/impl/servicediscovery/event/ReRegisterGoodEquals.td
     [java] Test Failed: Construct Failed: com.sun.jini.qa.harness.TestException: Problem
creating service for net.jini.core.lookup.ServiceRegistrar; nested exception is: 
     [java] 	RemoteException in server thread; nested exception is: 
     [java] 	java.rmi.RemoteException: Create failed; nested exception is: 
     [java] 	java.lang.ClassNotFoundException: com.sun.jini.reggie.TransientRegistrarImpl
     [java] 
     [java] -----------------------------------------
     [java] com/sun/jini/test/impl/servicediscovery/event/ServiceDiscardCacheTerminate.td
     [java] Test Failed: Construct Failed: com.sun.jini.qa.harness.TestException: Problem
creating service for net.jini.core.lookup.ServiceRegistrar; nested exception is: 
     [java] 	RemoteException in server thread; nested exception is: 
     [java] 	java.rmi.RemoteException: Create failed; nested exception is: 
     [java] 	java.lang.ClassNotFoundException: com.sun.jini.reggie.TransientRegistrarImpl
     [java] 
     [java] -----------------------------------------
     [java] com/sun/jini/test/spec/servicediscovery/DefaultDiscoverPublic.td
     [java] Test Passed: OK
     [java] 
     [java] -----------------------------------------
     [java] com/sun/jini/test/spec/servicediscovery/cache/AddListenerNPE.td
     [java] Test Passed: OK
     [java] 
     [java] -----------------------------------------
     [java] com/sun/jini/test/spec/servicediscovery/cache/CacheDiscard.td
     [java] Test Failed: Construct Failed: com.sun.jini.qa.harness.TestException: Problem
creating service for net.jini.core.lookup.ServiceRegistrar; nested exception is: 
     [java] 	RemoteException in server thread; nested exception is: 
     [java] 	java.rmi.RemoteException: Create failed; nested exception is: 
     [java] 	java.lang.ClassNotFoundException: com.sun.jini.reggie.TransientRegistrarImpl
     [java] 
     [java] -----------------------------------------
     [java] com/sun/jini/test/spec/servicediscovery/cache/CacheLookup.td
     [java] Test Failed: Construct Failed: com.sun.jini.qa.harness.TestException: Problem
creating service for net.jini.core.lookup.ServiceRegistrar; nested exception is: 
     [java] 	RemoteException in server thread; nested exception is: 
     [java] 	java.rmi.RemoteException: Create failed; nested exception is: 
     [java] 	java.lang.ClassNotFoundException: com.sun.jini.reggie.TransientRegistrarImpl
     [java] 
     [java] -----------------------------------------
     [java] com/sun/jini/test/spec/servicediscovery/cache/CacheLookupFilterFilter.td
     [java] Test Failed: Construct Failed: com.sun.jini.qa.harness.TestException: Problem
creating service for net.jini.core.lookup.ServiceRegistrar; nested exception is: 
     [java] 	RemoteException in server thread; nested exception is: 
     [java] 	java.rmi.RemoteException: Create failed; nested exception is: 
     [java] 	java.lang.ClassNotFoundException: com.sun.jini.reggie.TransientRegistrarImpl
     [java] 
     [java] -----------------------------------------
     [java] com/sun/jini/test/spec/servicediscovery/cache/CacheLookupFilterNoFilter.td
     [java] Test Failed: Construct Failed: com.sun.jini.qa.harness.TestException: Problem
creating service for net.jini.core.lookup.ServiceRegistrar; nested exception is: 
     [java] 	RemoteException in server thread; nested exception is: 
     [java] 	java.rmi.RemoteException: Create failed; nested exception is: 
     [java] 	java.lang.ClassNotFoundException: com.sun.jini.reggie.TransientRegistrarImpl
     [java] 
     [java] -----------------------------------------
     [java] com/sun/jini/test/spec/servicediscovery/cache/CacheLookupNoFilterFilter.td
     [java] Test Failed: Construct Failed: com.sun.jini.qa.harness.TestException: Problem
creating service for net.jini.core.lookup.ServiceRegistrar; nested exception is: 
     [java] 	RemoteException in server thread; nested exception is: 
     [java] 	java.rmi.RemoteException: Create failed; nested exception is: 
     [java] 	java.lang.ClassNotFoundException: com.sun.jini.reggie.TransientRegistrarImpl
     [java] 
     [java] -----------------------------------------
     [java] com/sun/jini/test/spec/servicediscovery/discovery/Locator.td
     [java] Test Passed: OK
     [java] 
     [java] -----------------------------------------
     [java] com/sun/jini/test/spec/servicediscovery/discovery/MulticastAnnouncement.td
     [java] Test Passed: OK
     [java] 
     [java] -----------------------------------------
     [java] com/sun/jini/test/spec/servicediscovery/discovery/MulticastRequest.td
     [java] Test Passed: OK
     [java] 
     [java] -----------------------------------------
     [java] com/sun/jini/test/spec/servicediscovery/discovery/Permission.td
     [java] Test Passed: OK
     [java] 
     [java] -----------------------------------------
     [java] com/sun/jini/test/spec/servicediscovery/event/AddAttrServiceChanged.td
     [java] Test Failed: Construct Failed: com.sun.jini.qa.harness.TestException: Problem
creating service for net.jini.core.lookup.ServiceRegistrar; nested exception is: 
     [java] 	RemoteException in server thread; nested exception is: 
     [java] 	java.rmi.RemoteException: Create failed; nested exception is: 
     [java] 	java.lang.ClassNotFoundException: com.sun.jini.reggie.TransientRegistrarImpl
     [java] 
     [java] -----------------------------------------
     [java] com/sun/jini/test/spec/servicediscovery/event/ModifyAttrServiceChanged.td
     [java] Test Failed: Construct Failed: com.sun.jini.qa.harness.TestException: Problem
creating service for net.jini.core.lookup.ServiceRegistrar; nested exception is: 
     [java] 	RemoteException in server thread; nested exception is: 
     [java] 	java.rmi.RemoteException: Create failed; nested exception is: 
     [java] 	java.lang.ClassNotFoundException: com.sun.jini.reggie.TransientRegistrarImpl
     [java] 
     [java] -----------------------------------------
     [java] com/sun/jini/test/spec/servicediscovery/event/SetAttrServiceChanged.td
     [java] Test Failed: Construct Failed: com.sun.jini.qa.harness.TestException: Problem
creating service for net.jini.core.lookup.ServiceRegistrar; nested exception is: 
     [java] 	RemoteException in server thread; nested exception is: 
     [java] 	java.rmi.RemoteException: Create failed; nested exception is: 
     [java] 	java.lang.ClassNotFoundException: com.sun.jini.reggie.TransientRegistrarImpl
     [java] 
     [java] -----------------------------------------
     [java] com/sun/jini/test/spec/servicediscovery/lookup/Lookup.td
     [java] Test Failed: Construct Failed: com.sun.jini.qa.harness.TestException: Problem
creating service for net.jini.core.lookup.ServiceRegistrar; nested exception is: 
     [java] 	RemoteException in server thread; nested exception is: 
     [java] 	java.rmi.RemoteException: Create failed; nested exception is: 
     [java] 	java.lang.ClassNotFoundException: com.sun.jini.reggie.TransientRegistrarImpl
     [java] 
     [java] -----------------------------------------
     [java] com/sun/jini/test/spec/servicediscovery/lookup/LookupFilter.td
     [java] Test Failed: Construct Failed: com.sun.jini.qa.harness.TestException: Problem
creating service for net.jini.core.lookup.ServiceRegistrar; nested exception is: 
     [java] 	RemoteException in server thread; nested exception is: 
     [java] 	java.rmi.RemoteException: Create failed; nested exception is: 
     [java] 	java.lang.ClassNotFoundException: com.sun.jini.reggie.TransientRegistrarImpl
     [java] 
     [java] -----------------------------------------
     [java] com/sun/jini/test/spec/servicediscovery/lookup/LookupMax.td
     [java] Test Failed: Construct Failed: com.sun.jini.qa.harness.TestException: Problem
creating service for net.jini.core.lookup.ServiceRegistrar; nested exception is: 
     [java] 	RemoteException in server thread; nested exception is: 
     [java] 	java.rmi.RemoteException: Create failed; nested exception is: 
     [java] 	java.lang.ClassNotFoundException: com.sun.jini.reggie.TransientRegistrarImpl
     [java] 
     [java] -----------------------------------------
     [java] com/sun/jini/test/spec/servicediscovery/lookup/LookupMaxFilter.td
     [java] Test Failed: Construct Failed: com.sun.jini.qa.harness.TestException: Problem
creating service for net.jini.core.lookup.ServiceRegistrar; nested exception is: 
     [java] 	RemoteException in server thread; nested exception is: 
     [java] 	java.rmi.RemoteException: Create failed; nested exception is: 
     [java] 	java.lang.ClassNotFoundException: com.sun.jini.reggie.TransientRegistrarImpl
     [java] 
     [java] -----------------------------------------
     [java] com/sun/jini/test/spec/servicediscovery/lookup/LookupMinEqualsMax.td
     [java] Test Failed: Construct Failed: com.sun.jini.qa.harness.TestException: Problem
creating service for net.jini.core.lookup.ServiceRegistrar; nested exception is: 
     [java] 	RemoteException in server thread; nested exception is: 
     [java] 	java.rmi.RemoteException: Create failed; nested exception is: 
     [java] 	java.lang.ClassNotFoundException: com.sun.jini.reggie.TransientRegistrarImpl
     [java] 
     [java] -----------------------------------------
     [java] com/sun/jini/test/spec/servicediscovery/lookup/LookupMinEqualsMaxFilter.td
     [java] Test Failed: Construct Failed: com.sun.jini.qa.harness.TestException: Problem
creating service for net.jini.core.lookup.ServiceRegistrar; nested exception is: 
     [java] 	RemoteException in server thread; nested exception is: 
     [java] 	java.rmi.RemoteException: Create failed; nested exception is: 
     [java] 	java.lang.ClassNotFoundException: com.sun.jini.reggie.TransientRegistrarImpl
     [java] 
     [java] -----------------------------------------
     [java] com/sun/jini/test/spec/servicediscovery/lookup/LookupMinLessMax.td
     [java] Test Failed: Construct Failed: com.sun.jini.qa.harness.TestException: Problem
creating service for net.jini.core.lookup.ServiceRegistrar; nested exception is: 
     [java] 	RemoteException in server thread; nested exception is: 
     [java] 	java.rmi.RemoteException: Create failed; nested exception is: 
     [java] 	java.lang.ClassNotFoundException: com.sun.jini.reggie.TransientRegistrarImpl
     [java] 
     [java] -----------------------------------------
     [java] com/sun/jini/test/spec/servicediscovery/lookup/LookupMinLessMaxFilter.td
     [java] Test Failed: Construct Failed: com.sun.jini.qa.harness.TestException: Problem
creating service for net.jini.core.lookup.ServiceRegistrar; nested exception is: 
     [java] 	RemoteException in server thread; nested exception is: 
     [java] 	java.rmi.RemoteException: Create failed; nested exception is: 
     [java] 	java.lang.ClassNotFoundException: com.sun.jini.reggie.TransientRegistrarImpl
     [java] 
     [java] -----------------------------------------
     [java] com/sun/jini/test/spec/servicediscovery/lookup/LookupMinMaxNoBlock.td
     [java] Test Failed: Construct Failed: com.sun.jini.qa.harness.TestException: Problem
creating service for net.jini.core.lookup.ServiceRegistrar; nested exception is: 
     [java] 	RemoteException in server thread; nested exception is: 
     [java] 	java.rmi.RemoteException: Create failed; nested exception is: 
     [java] 	java.lang.ClassNotFoundException: com.sun.jini.reggie.TransientRegistrarImpl
     [java] 
     [java] -----------------------------------------
     [java] com/sun/jini/test/spec/servicediscovery/lookup/LookupMinMaxNoBlockFilter.td
     [java] Test Failed: Construct Failed: com.sun.jini.qa.harness.TestException: Problem
creating service for net.jini.core.lookup.ServiceRegistrar; nested exception is: 
     [java] 	RemoteException in server thread; nested exception is: 
     [java] 	java.rmi.RemoteException: Create failed; nested exception is: 
     [java] 	java.lang.ClassNotFoundException: com.sun.jini.reggie.TransientRegistrarImpl
     [java] 
     [java] -----------------------------------------
     [java] com/sun/jini/test/spec/servicediscovery/lookup/LookupWait.td
     [java] Test Failed: Construct Failed: com.sun.jini.qa.harness.TestException: Problem
creating service for net.jini.core.lookup.ServiceRegistrar; nested exception is: 
     [java] 	RemoteException in server thread; nested exception is: 
     [java] 	java.rmi.RemoteException: Create failed; nested exception is: 
     [java] 	java.lang.ClassNotFoundException: com.sun.jini.reggie.TransientRegistrarImpl
     [java] 
     [java] -----------------------------------------
     [java] com/sun/jini/test/spec/servicediscovery/lookup/LookupWaitFilter.td
     [java] Test Failed: Construct Failed: com.sun.jini.qa.harness.TestException: Problem
creating service for net.jini.core.lookup.ServiceRegistrar; nested exception is: 
     [java] 	RemoteException in server thread; nested exception is: 
     [java] 	java.rmi.RemoteException: Create failed; nested exception is: 
     [java] 	java.lang.ClassNotFoundException: com.sun.jini.reggie.TransientRegistrarImpl
     [java] 
     [java] -----------------------------------------
     [java] com/sun/jini/test/spec/servicediscovery/lookup/LookupWaitNoBlock.td
     [java] Test Failed: Construct Failed: com.sun.jini.qa.harness.TestException: Problem
creating service for net.jini.core.lookup.ServiceRegistrar; nested exception is: 
     [java] 	RemoteException in server thread; nested exception is: 
     [java] 	java.rmi.RemoteException: Create failed; nested exception is: 
     [java] 	java.lang.ClassNotFoundException: com.sun.jini.reggie.TransientRegistrarImpl
     [java] 
     [java] -----------------------------------------
     [java] 
     [java] # of tests started   = 40
     [java] # of tests completed = 40
     [java] # of tests passed    = 8
     [java] # of tests failed    = 32
     [java] 
     [java] -----------------------------------------
     [java] 
     [java]    Date finished:
     [java]       Sat Jun 21 22:06:46 UTC 2014
     [java]    Time elapsed:
     [java]       1101 seconds
     [java] 
     [java] Java Result: 1

collect-result:
     [copy] Copying 1 file to <https://builds.apache.org/job/river-ServiceDiscoveryManagerTests/ws/trunk/qa/result>
     [copy] Copying 1 file to <https://builds.apache.org/job/river-ServiceDiscoveryManagerTests/ws/trunk/qa/result>
      [zip] Building zip: <https://builds.apache.org/job/river-ServiceDiscoveryManagerTests/16/artifact/trunk/qa/result/qaresults-i386-Linux-1.7.0_25.zip>

BUILD FAILED
<https://builds.apache.org/job/river-ServiceDiscoveryManagerTests/ws/trunk/build.xml>:61:
The following error occurred while executing this line:
<https://builds.apache.org/job/river-ServiceDiscoveryManagerTests/ws/trunk/qa/build.xml>:380:
condition satisfied

Total time: 22 minutes 48 seconds
Build step 'Invoke Ant' marked build as failure
[locks-and-latches] Releasing all the locks
[locks-and-latches] All the locks released
Archiving artifacts
Sending artifact delta relative to river-ServiceDiscoveryManagerTests #15
Archived 1 artifacts
Archive block size is 32768
Received 0 blocks and 90382 bytes
Compression is 0.0%
Took 0.33 sec

Mime
View raw message