river-dev mailing list archives

Site index · List index
Message view « Date » · « Thread »
Top « Date » · « Thread »
From Apache Jenkins Server <jenk...@builds.apache.org>
Subject Build failed in Jenkins: river-LookupServiceTests #25
Date Fri, 13 Jun 2014 01:13:22 GMT
See <https://builds.apache.org/job/river-LookupServiceTests/25/>

------------------------------------------
[...truncated 8588 lines...]
     [java] Test Passed: OK
     [java] 
     [java] -----------------------------------------
     [java] com/sun/jini/test/spec/lookupservice/test_set02/ExpiredEventLeaseCancel.td
     [java] Test Passed: OK
     [java] 
     [java] -----------------------------------------
     [java] com/sun/jini/test/spec/lookupservice/test_set02/ExpiredEventLeaseRenew.td
     [java] Test Passed: OK
     [java] 
     [java] -----------------------------------------
     [java] com/sun/jini/test/spec/lookupservice/test_set02/ExpiredLeaseMapCancel.td
     [java] Test Passed: OK
     [java] 
     [java] -----------------------------------------
     [java] com/sun/jini/test/spec/lookupservice/test_set02/ExpiredLeaseMapRenew.td
     [java] Test Passed: OK
     [java] 
     [java] -----------------------------------------
     [java] com/sun/jini/test/spec/lookupservice/test_set02/ExpiredModifyAttributes.td
     [java] Test Passed: OK
     [java] 
     [java] -----------------------------------------
     [java] com/sun/jini/test/spec/lookupservice/test_set02/ExpiredServiceLeaseCancel.td
     [java] Test Passed: OK
     [java] 
     [java] -----------------------------------------
     [java] com/sun/jini/test/spec/lookupservice/test_set02/ExpiredServiceLeaseRenew.td
     [java] Test Passed: OK
     [java] 
     [java] -----------------------------------------
     [java] com/sun/jini/test/spec/lookupservice/test_set02/ExpiredSetAttributes.td
     [java] Test Passed: OK
     [java] 
     [java] -----------------------------------------
     [java] com/sun/jini/test/spec/lookupservice/test_set02/GetEntryClassesNoMatch.td
     [java] Test Passed: OK
     [java] 
     [java] -----------------------------------------
     [java] com/sun/jini/test/spec/lookupservice/test_set02/GetEntryClassesNullTemplate.td
     [java] Test Passed: OK
     [java] 
     [java] -----------------------------------------
     [java] com/sun/jini/test/spec/lookupservice/test_set02/GetFieldValuesBadField.td
     [java] Test Passed: OK
     [java] 
     [java] -----------------------------------------
     [java] com/sun/jini/test/spec/lookupservice/test_set02/GetFieldValuesBadIndex.td
     [java] Test Passed: OK
     [java] 
     [java] -----------------------------------------
     [java] com/sun/jini/test/spec/lookupservice/test_set02/GetFieldValuesNoMatch.td
     [java] Test Passed: OK
     [java] 
     [java] -----------------------------------------
     [java] com/sun/jini/test/spec/lookupservice/test_set02/GetFieldValuesNullTemplate.td
     [java] Test Passed: OK
     [java] 
     [java] -----------------------------------------
     [java] com/sun/jini/test/spec/lookupservice/test_set02/GetServiceTypesNoMatch.td
     [java] Test Passed: OK
     [java] 
     [java] -----------------------------------------
     [java] com/sun/jini/test/spec/lookupservice/test_set02/GetServiceTypesNullTemplate.td
     [java] Test Passed: OK
     [java] 
     [java] -----------------------------------------
     [java] com/sun/jini/test/spec/lookupservice/test_set02/LeaseMapCancel.td
     [java] Test Passed: OK
     [java] 
     [java] -----------------------------------------
     [java] com/sun/jini/test/spec/lookupservice/test_set02/LeaseMapRenew.td
     [java] Test Failed: Construct Failed: com.sun.jini.qa.harness.TestException: Exception
instantiating class server com.sun.jini.tool.ClassServer; nested exception is: 
     [java] 	null
     [java] 
     [java] -----------------------------------------
     [java] com/sun/jini/test/spec/lookupservice/test_set02/LeaseMapRenewNegDuration.td
     [java] Test Failed: Construct Failed: com.sun.jini.qa.harness.TestException: Exception
instantiating class server com.sun.jini.tool.ClassServer; nested exception is: 
     [java] 	null
     [java] 
     [java] -----------------------------------------
     [java] com/sun/jini/test/spec/lookupservice/test_set02/Lookup2NullTemplate.td
     [java] Test Failed: Construct Failed: com.sun.jini.qa.harness.TestException: Exception
instantiating class server com.sun.jini.tool.ClassServer; nested exception is: 
     [java] 	null
     [java] 
     [java] -----------------------------------------
     [java] com/sun/jini/test/spec/lookupservice/test_set02/LookupNegMatches.td
     [java] Test Failed: Construct Failed: com.sun.jini.qa.harness.TestException: Exception
instantiating class server com.sun.jini.tool.ClassServer; nested exception is: 
     [java] 	null
     [java] 
     [java] -----------------------------------------
     [java] com/sun/jini/test/spec/lookupservice/test_set02/LookupNoMatch.td
     [java] Test Failed: Construct Failed: com.sun.jini.qa.harness.TestException: Exception
instantiating class server com.sun.jini.tool.ClassServer; nested exception is: 
     [java] 	null
     [java] 
     [java] -----------------------------------------
     [java] com/sun/jini/test/spec/lookupservice/test_set02/LookupNullTemplate.td
     [java] Test Failed: Construct Failed: com.sun.jini.qa.harness.TestException: Exception
instantiating class server com.sun.jini.tool.ClassServer; nested exception is: 
     [java] 	null
     [java] 
     [java] -----------------------------------------
     [java] com/sun/jini/test/spec/lookupservice/test_set02/ModifyAttributesBadClass.td
     [java] Test Failed: Construct Failed: com.sun.jini.qa.harness.TestException: Exception
instantiating class server com.sun.jini.tool.ClassServer; nested exception is: 
     [java] 	null
     [java] 
     [java] -----------------------------------------
     [java] com/sun/jini/test/spec/lookupservice/test_set02/ModifyAttributesBadLength.td
     [java] Test Failed: Construct Failed: com.sun.jini.qa.harness.TestException: Exception
instantiating class server com.sun.jini.tool.ClassServer; nested exception is: 
     [java] 	null
     [java] 
     [java] -----------------------------------------
     [java] com/sun/jini/test/spec/lookupservice/test_set02/NotifyBadTransition.td
     [java] Test Failed: Construct Failed: com.sun.jini.qa.harness.TestException: Exception
instantiating class server com.sun.jini.tool.ClassServer; nested exception is: 
     [java] 	null
     [java] 
     [java] -----------------------------------------
     [java] com/sun/jini/test/spec/lookupservice/test_set02/NotifyNegDuration.td
     [java] Test Failed: Construct Failed: com.sun.jini.qa.harness.TestException: Exception
instantiating class server com.sun.jini.tool.ClassServer; nested exception is: 
     [java] 	null
     [java] 
     [java] -----------------------------------------
     [java] com/sun/jini/test/spec/lookupservice/test_set02/NotifyNoTransition.td
     [java] Test Failed: Construct Failed: com.sun.jini.qa.harness.TestException: Exception
instantiating class server com.sun.jini.tool.ClassServer; nested exception is: 
     [java] 	null
     [java] 
     [java] -----------------------------------------
     [java] com/sun/jini/test/spec/lookupservice/test_set02/NotifyNullListener.td
     [java] Test Passed: OK
     [java] 
     [java] -----------------------------------------
     [java] com/sun/jini/test/spec/lookupservice/test_set02/NotifyNullTemplate.td
     [java] Test Passed: OK
     [java] 
     [java] -----------------------------------------
     [java] com/sun/jini/test/spec/lookupservice/test_set02/NotifyOnAttrSet.td
     [java] Test Passed: OK
     [java] 
     [java] -----------------------------------------
     [java] com/sun/jini/test/spec/lookupservice/test_set02/NotifyOnComboAttrSet.td
     [java] Test Passed: OK
     [java] 
     [java] -----------------------------------------
     [java] com/sun/jini/test/spec/lookupservice/test_set02/RegisterInvalidServiceID.td
     [java] Test Passed: OK
     [java] 
     [java] -----------------------------------------
     [java] com/sun/jini/test/spec/lookupservice/test_set02/RegisterNegDuration.td
     [java] Test Passed: OK
     [java] 
     [java] -----------------------------------------
     [java] com/sun/jini/test/spec/lookupservice/test_set02/RegisterNullService.td
     [java] Test Passed: OK
     [java] 
     [java] -----------------------------------------
     [java] com/sun/jini/test/spec/lookupservice/test_set02/RegisterNullServiceItem.td
     [java] Test Passed: OK
     [java] 
     [java] -----------------------------------------
     [java] com/sun/jini/test/spec/lookupservice/test_set03/SimpleAddLookupAttributes.td
     [java] Test Passed: OK
     [java] 
     [java] -----------------------------------------
     [java] com/sun/jini/test/spec/lookupservice/test_set03/SimpleAddLookupGroups.td
     [java] Test Passed: OK
     [java] 
     [java] -----------------------------------------
     [java] com/sun/jini/test/spec/lookupservice/test_set03/SimpleAddLookupLocators.td
     [java] Test Passed: OK
     [java] 
     [java] -----------------------------------------
     [java] com/sun/jini/test/spec/lookupservice/test_set03/SimpleAddMemberGroups.td
     [java] Test Passed: OK
     [java] 
     [java] -----------------------------------------
     [java] com/sun/jini/test/spec/lookupservice/test_set03/SimpleModifyLookupAttributes.td
     [java] Test Passed: OK
     [java] 
     [java] -----------------------------------------
     [java] com/sun/jini/test/spec/lookupservice/test_set03/SimpleRemoveLookupGroups.td
     [java] Test Passed: OK
     [java] 
     [java] -----------------------------------------
     [java] com/sun/jini/test/spec/lookupservice/test_set03/SimpleRemoveLookupLocators.td
     [java] Test Passed: OK
     [java] 
     [java] -----------------------------------------
     [java] com/sun/jini/test/spec/lookupservice/test_set03/SimpleRemoveMemberGroups.td
     [java] Test Passed: OK
     [java] 
     [java] -----------------------------------------
     [java] com/sun/jini/test/spec/lookupservice/test_set03/SimpleSetLookupGroups.td
     [java] Test Passed: OK
     [java] 
     [java] -----------------------------------------
     [java] com/sun/jini/test/spec/lookupservice/test_set03/SimpleSetLookupLocators.td
     [java] Test Passed: OK
     [java] 
     [java] -----------------------------------------
     [java] com/sun/jini/test/spec/lookupservice/test_set03/SimpleSetMemberGroups.td
     [java] Test Passed: OK
     [java] 
     [java] -----------------------------------------
     [java] com/sun/jini/test/spec/lookupservice/test_set03/SimpleUnicastPort.td
     [java] Test Passed: OK
     [java] 
     [java] -----------------------------------------
     [java] com/sun/jini/test/spec/lookupservice/test_set04/ModifyAttributesOverlap.td
     [java] Test Passed: OK
     [java] 
     [java] -----------------------------------------
     [java] com/sun/jini/test/spec/lookupservice/test_set04/ModifyAttributesSwap.td
     [java] Test Passed: OK
     [java] 
     [java] -----------------------------------------
     [java] 
     [java] # of tests started   = 93
     [java] # of tests completed = 93
     [java] # of tests passed    = 82
     [java] # of tests failed    = 11
     [java] 
     [java] -----------------------------------------
     [java] 
     [java]    Date finished:
     [java]       Fri Jun 13 01:13:20 UTC 2014
     [java]    Time elapsed:
     [java]       4677 seconds
     [java] 
     [java] Java Result: 1

collect-result:
     [copy] Copying 1 file to /x1/jenkins/jenkins-slave/workspace/river-LookupServiceTests/trunk/qa/result
     [copy] Copying 1 file to /x1/jenkins/jenkins-slave/workspace/river-LookupServiceTests/trunk/qa/result
      [zip] Building zip: /x1/jenkins/jenkins-slave/workspace/river-LookupServiceTests/trunk/qa/result/qaresults-i386-Linux-1.7.0_25.zip

BUILD FAILED
/x1/jenkins/jenkins-slave/workspace/river-LookupServiceTests/trunk/build.xml:61: The following
error occurred while executing this line:
/x1/jenkins/jenkins-slave/workspace/river-LookupServiceTests/trunk/qa/build.xml:380: condition
satisfied

Total time: 81 minutes 59 seconds
Build step 'Invoke Ant' marked build as failure
[locks-and-latches] Releasing all the locks
[locks-and-latches] All the locks released
Archiving artifacts
Sending artifact delta relative to river-LookupServiceTests #24
Archived 1 artifacts
Archive block size is 32768
Received 0 blocks and 208418 bytes
Compression is 0.0%
Took 86 ms

Mime
View raw message