river-dev mailing list archives

Site index · List index
Message view « Date » · « Thread »
Top « Date » · « Thread »
From Apache Jenkins Server <jenk...@builds.apache.org>
Subject Build failed in Jenkins: river-qa-refactor-win3 #5
Date Sat, 14 Dec 2013 17:26:33 GMT
See <https://builds.apache.org/job/river-qa-refactor-win3/5/changes>

Changes:

[peter_firmstone] Attempting to fix test failures on Windows Server 2008 R2 Jdk1.7.0_21, using
Jenkins as test environment.

------------------------------------------
[...truncated 15785 lines...]
     [java] -----------------------------------------
     [java] com/sun/jini/test/spec/javaspace/conformance/snapshot/SnapshotTransactionWriteNegativeLeaseTest.td
     [java] Test Passed: OK
     [java] 
     [java] -----------------------------------------
     [java] com/sun/jini/test/spec/javaspace/conformance/snapshot/SnapshotTransactionWriteTakeIfExistsNotifyTest.td
     [java] Test Passed: OK
     [java] 
     [java] -----------------------------------------
     [java] com/sun/jini/test/spec/javaspace/conformance/snapshot/SnapshotTransactionWriteTakeIfExistsTest.td
     [java] Test Passed: OK
     [java] 
     [java] -----------------------------------------
     [java] com/sun/jini/test/spec/javaspace/conformance/snapshot/SnapshotTransactionWriteTakeNotifyTest.td
     [java] Test Passed: OK
     [java] 
     [java] -----------------------------------------
     [java] com/sun/jini/test/spec/javaspace/conformance/snapshot/SnapshotTransactionWriteTakeTest.td
     [java] Test Passed: OK
     [java] 
     [java] -----------------------------------------
     [java] com/sun/jini/test/spec/javaspace/conformance/snapshot/SnapshotTransactionWriteTest.td
     [java] Test Passed: OK
     [java] 
     [java] -----------------------------------------
     [java] com/sun/jini/test/spec/javaspace/conformance/snapshot/SnapshotWriteLeaseANYTest.td
     [java] Test Passed: OK
     [java] 
     [java] -----------------------------------------
     [java] com/sun/jini/test/spec/javaspace/conformance/snapshot/SnapshotWriteLeaseFOREVERTest.td
     [java] Test Passed: OK
     [java] 
     [java] -----------------------------------------
     [java] com/sun/jini/test/spec/javaspace/conformance/snapshot/SnapshotWriteNegativeLeaseTest.td
     [java] Test Passed: OK
     [java] 
     [java] -----------------------------------------
     [java] com/sun/jini/test/spec/javaspace/conformance/snapshot/SnapshotWriteTest.td
     [java] Test Passed: OK
     [java] 
     [java] -----------------------------------------
     [java] com/sun/jini/test/impl/mahalo/AdminIFShutdownTest.td
     [java] Test Passed: OK
     [java] 
     [java] -----------------------------------------
     [java] com/sun/jini/test/impl/mahalo/AdminIFTest.td
     [java] Test Passed: OK
     [java] 
     [java] -----------------------------------------
     [java] com/sun/jini/test/impl/mahalo/LeaseExpireCancelTest.td
     [java] Test Passed: OK
     [java] 
     [java] -----------------------------------------
     [java] com/sun/jini/test/impl/mahalo/LeaseExpireRenewTest.td
     [java] Test Passed: OK
     [java] 
     [java] -----------------------------------------
     [java] com/sun/jini/test/impl/mahalo/LeaseMapTest.td
     [java] Test Passed: OK
     [java] 
     [java] -----------------------------------------
     [java] com/sun/jini/test/impl/mahalo/LeaseTest.td
     [java] Test Passed: OK
     [java] 
     [java] -----------------------------------------
     [java] com/sun/jini/test/impl/mahalo/MahaloCreateShutdownTest.td
     [java] Test Passed: OK
     [java] 
     [java] -----------------------------------------
     [java] com/sun/jini/test/impl/mahalo/MahaloIFTest.td
     [java] Test Passed: OK
     [java] 
     [java] -----------------------------------------
     [java] com/sun/jini/test/impl/mahalo/MahaloImplReadyStateTest.td
     [java] Test Skipped: verifiers are: com.sun.jini.test.impl.mercury.ActivatableMercuryVerifier
com.sun.jini.qa.harness.SkipConfigTestVerifier
     [java] -----------------------------------------
     [java] com/sun/jini/test/impl/mahalo/NestableServerTransactionCreatedToStringTest.td
     [java] Test Passed: OK
     [java] 
     [java] -----------------------------------------
     [java] com/sun/jini/test/impl/mahalo/NestableTransactionCreatedToStringTest.td
     [java] Test Passed: OK
     [java] 
     [java] -----------------------------------------
     [java] com/sun/jini/test/impl/mahalo/PrepareAndCommitExceptionTest.td
     [java] Test Failed: Test Failed with an Unexpected Exception: java.rmi.ServerException:
RemoteException in server thread; nested exception is: 
     [java] 	java.rmi.UnmarshalException: unmarshalling method/arguments; nested exception
is: 
     [java] 	java.lang.ClassNotFoundException: com.sun.jini.test.share.TestParticipant
     [java] 
     [java] -----------------------------------------
     [java] com/sun/jini/test/impl/mahalo/PrepareAndCommitExceptionTest2.td
     [java] Test Failed: Test Failed with an Unexpected Exception: java.rmi.ServerException:
RemoteException in server thread; nested exception is: 
     [java] 	java.rmi.UnmarshalException: unmarshalling method/arguments; nested exception
is: 
     [java] 	java.lang.ClassNotFoundException: com.sun.jini.test.share.TestParticipant
     [java] 
     [java] -----------------------------------------
     [java] com/sun/jini/test/impl/mahalo/PrepareAndCommitExceptionTest3.td
     [java] Test Failed: Test Failed with an Unexpected Exception: java.rmi.ServerException:
RemoteException in server thread; nested exception is: 
     [java] 	java.rmi.UnmarshalException: unmarshalling method/arguments; nested exception
is: 
     [java] 	java.lang.ClassNotFoundException: com.sun.jini.test.share.TestParticipant
     [java] 
     [java] -----------------------------------------
     [java] com/sun/jini/test/impl/mahalo/PrepareAndCommitExceptionTest4.td
     [java] Test Failed: Test Failed with an Unexpected Exception: java.rmi.ServerException:
RemoteException in server thread; nested exception is: 
     [java] 	java.rmi.UnmarshalException: unmarshalling method/arguments; nested exception
is: 
     [java] 	java.lang.ClassNotFoundException: com.sun.jini.test.share.TestParticipant
     [java] 
     [java] -----------------------------------------
     [java] com/sun/jini/test/impl/mahalo/PrepareAndCommitExceptionTest5.td
     [java] Test Failed: Test Failed with an Unexpected Exception: java.rmi.ServerException:
RemoteException in server thread; nested exception is: 
     [java] 	java.rmi.UnmarshalException: unmarshalling method/arguments; nested exception
is: 
     [java] 	java.lang.ClassNotFoundException: com.sun.jini.test.share.TestParticipant
     [java] 
     [java] -----------------------------------------
     [java] com/sun/jini/test/impl/mahalo/RandomStressTest.td
     [java] Test Failed: Test Failed: com.sun.jini.qa.harness.TestException: Some of RandomStressTask
tasks not yet finished
     [java] 
     [java] -----------------------------------------
     [java] com/sun/jini/test/impl/mahalo/ServerTransactionEqualityTest.td
     [java] Test Passed: OK
     [java] 
     [java] -----------------------------------------
     [java] com/sun/jini/test/impl/mahalo/ServerTransactionToStringTest.td
     [java] Test Passed: OK
     [java] 
     [java] -----------------------------------------
     [java] com/sun/jini/test/impl/mahalo/TransactionCreatedToStringTest.td
     [java] Test Passed: OK
     [java] 
     [java] -----------------------------------------
     [java] com/sun/jini/test/impl/mahalo/TransactionManagerCreatedToStringTest.td
     [java] Test Passed: OK
     [java] 
     [java] -----------------------------------------
     [java] com/sun/jini/test/impl/mahalo/TxnMgrImplNullActivationConfigEntries.td
     [java] Test Skipped: verifiers are: com.sun.jini.test.impl.mahalo.ActivatableMahaloVerifier
     [java] -----------------------------------------
     [java] com/sun/jini/test/impl/mahalo/TxnMgrImplNullConfigEntries.td
     [java] Test Passed: OK
     [java] 
     [java] -----------------------------------------
     [java] com/sun/jini/test/impl/mahalo/TxnMgrImplNullRecoveredLocators.td
     [java] Test Skipped: verifiers are: com.sun.jini.test.impl.mahalo.ActivatableMahaloVerifier
     [java] -----------------------------------------
     [java] com/sun/jini/test/impl/mahalo/TxnMgrProxyEqualityTest.td
     [java] Test Passed: OK
     [java] 
     [java] -----------------------------------------
     [java] com/sun/jini/test/spec/txnmanager/AsynchAbortOnCommitTest.td
     [java] Test Failed: Test Failed with an Unexpected Exception: java.rmi.ServerException:
RemoteException in server thread; nested exception is: 
     [java] 	java.rmi.UnmarshalException: unmarshalling method/arguments; nested exception
is: 
     [java] 	java.lang.ClassNotFoundException: com.sun.jini.test.share.TestParticipant
     [java] 
     [java] -----------------------------------------
     [java] com/sun/jini/test/spec/txnmanager/AsynchAbortOnPrepareTest.td
     [java] Test Failed: Test Failed with an Unexpected Exception: java.rmi.ServerException:
RemoteException in server thread; nested exception is: 
     [java] 	java.rmi.UnmarshalException: unmarshalling method/arguments; nested exception
is: 
     [java] 	java.lang.ClassNotFoundException: com.sun.jini.test.share.TestParticipant
     [java] 
     [java] -----------------------------------------
     [java] com/sun/jini/test/spec/txnmanager/CommitExpiredTest.td
     [java] Test Failed: Test Failed with an Unexpected Exception: java.rmi.ServerException:
RemoteException in server thread; nested exception is: 
     [java] 	java.rmi.UnmarshalException: unmarshalling method/arguments; nested exception
is: 
     [java] 	java.lang.ClassNotFoundException: com.sun.jini.test.share.TestParticipant
     [java] 
     [java] -----------------------------------------
     [java] com/sun/jini/test/spec/txnmanager/CommitTimeoutTest.td
     [java] Test Failed: Test Failed with an Unexpected Exception: java.rmi.ServerException:
RemoteException in server thread; nested exception is: 
     [java] 	java.rmi.UnmarshalException: unmarshalling method/arguments; nested exception
is: 
     [java] 	java.lang.ClassNotFoundException: com.sun.jini.test.share.TestParticipant
     [java] 
     [java] -----------------------------------------
     [java] com/sun/jini/test/spec/txnmanager/GetStateTest.td
     [java] Test Failed: Test Failed with an Unexpected Exception: java.rmi.ServerException:
RemoteException in server thread; nested exception is: 
     [java] 	java.rmi.UnmarshalException: unmarshalling method/arguments; nested exception
is: 
     [java] 	java.lang.ClassNotFoundException: com.sun.jini.test.share.TestParticipant
     [java] 
     [java] -----------------------------------------
     [java] com/sun/jini/test/spec/txnmanager/JoinIdempotentTest.td
     [java] Test Failed: Test Failed with an Unexpected Exception: java.rmi.ServerException:
RemoteException in server thread; nested exception is: 
     [java] 	java.rmi.UnmarshalException: unmarshalling method/arguments; nested exception
is: 
     [java] 	java.lang.ClassNotFoundException: com.sun.jini.test.share.TestParticipant
     [java] 
     [java] -----------------------------------------
     [java] com/sun/jini/test/spec/txnmanager/JoinWhileActiveTest.td
     [java] Test Failed: Test Failed with an Unexpected Exception: java.rmi.ServerException:
RemoteException in server thread; nested exception is: 
     [java] 	java.rmi.UnmarshalException: unmarshalling method/arguments; nested exception
is: 
     [java] 	java.lang.ClassNotFoundException: com.sun.jini.test.share.TestParticipant
     [java] 
     [java] -----------------------------------------
     [java] com/sun/jini/test/spec/txnmanager/ManyParticipantsTest.td
     [java] Test Failed: Test Failed with an Unexpected Exception: java.rmi.ServerException:
RemoteException in server thread; nested exception is: 
     [java] 	java.rmi.UnmarshalException: unmarshalling method/arguments; nested exception
is: 
     [java] 	java.lang.ClassNotFoundException: com.sun.jini.test.share.TestParticipant
     [java] 
     [java] -----------------------------------------
     [java] com/sun/jini/test/spec/txnmanager/PrepareTimeoutTest.td
     [java] Test Failed: Test Failed with an Unexpected Exception: java.rmi.ServerException:
RemoteException in server thread; nested exception is: 
     [java] 	java.rmi.UnmarshalException: unmarshalling method/arguments; nested exception
is: 
     [java] 	java.lang.ClassNotFoundException: com.sun.jini.test.share.TestParticipant
     [java] 
     [java] -----------------------------------------
     [java] com/sun/jini/test/spec/txnmanager/RollBackErrorTest.td
     [java] Test Failed: Test Failed with an Unexpected Exception: java.rmi.ServerException:
RemoteException in server thread; nested exception is: 
     [java] 	java.rmi.UnmarshalException: unmarshalling method/arguments; nested exception
is: 
     [java] 	java.lang.ClassNotFoundException: com.sun.jini.test.share.TestParticipant
     [java] 
     [java] -----------------------------------------
     [java] com/sun/jini/test/spec/txnmanager/RollForwardErrorTest.td
     [java] Test Failed: Test Failed with an Unexpected Exception: java.rmi.ServerException:
RemoteException in server thread; nested exception is: 
     [java] 	java.rmi.UnmarshalException: unmarshalling method/arguments; nested exception
is: 
     [java] 	java.lang.ClassNotFoundException: com.sun.jini.test.share.TestParticipant
     [java] 
     [java] -----------------------------------------
     [java] com/sun/jini/test/spec/txnmanager/TwoPhaseTest.td
     [java] Test Failed: Test Failed with an Unexpected Exception: java.rmi.ServerException:
RemoteException in server thread; nested exception is: 
     [java] 	java.rmi.UnmarshalException: unmarshalling method/arguments; nested exception
is: 
     [java] 	java.lang.ClassNotFoundException: com.sun.jini.test.share.TestParticipant
     [java] 
     [java] -----------------------------------------
     [java] 
     [java] # of tests started   = 1406
     [java] # of tests completed = 1406
     [java] # of tests skipped   = 52
     [java] # of tests passed    = 1378
     [java] # of tests failed    = 28
     [java] 
     [java] -----------------------------------------
     [java] 
     [java]    Date finished:
     [java]       Sat Dec 14 09:26:20 PST 2013
     [java]    Time elapsed:
     [java]       62465 seconds
     [java] 
     [java] Java Result: 1

collect-result:
     [copy] Copying 1 file to <https://builds.apache.org/job/river-qa-refactor-win3/ws/trunk\qa\result>
     [copy] Copying 1 file to <https://builds.apache.org/job/river-qa-refactor-win3/ws/trunk\qa\result>
      [zip] Building zip: <https://builds.apache.org/job/river-qa-refactor-win3/ws/trunk\qa\result\qaresults-amd64-Windows>
Server 2008 R2-1.7.0.zip

BUILD FAILED
<https://builds.apache.org/job/river-qa-refactor-win3/ws/trunk\build.xml>:2104: The
following error occurred while executing this line:
<https://builds.apache.org/job/river-qa-refactor-win3/ws/trunk\qa\build.xml>:406: The
following error occurred while executing this line:
<https://builds.apache.org/job/river-qa-refactor-win3/ws/trunk\qa\build.xml>:380: condition
satisfied

Total time: 1053 minutes 52 seconds
Build step 'Invoke Ant' marked build as failure
Archiving artifacts

Mime
View raw message