river-dev mailing list archives

Site index · List index
Message view « Date » · « Thread »
Top « Date » · « Thread »
From Apache Jenkins Server <jenk...@builds.apache.org>
Subject Build failed in Jenkins: river-qa-refactor-jdk7 #114
Date Wed, 20 Nov 2013 15:49:25 GMT
See <https://builds.apache.org/job/river-qa-refactor-jdk7/114/changes>

Changes:

[peter_firmstone] Fix Mahalo's use of ConcurrentMap to utilise concurrent methods, originally
Mahalo used HashMap, this was refactored to ConcurrentMap to ensure visibility between threads.

[peter_firmstone] TakeTest05 shares unsynchronized Lists between threads, fix. - Note no related
test failures have been observed, it is likely there are no issues as the List state is up
to date when each new thread is started, it's just easier to ensure there are no problems
by using a thread safe collection.

[peter_firmstone] TransactionTakeTest05 shares unsynchronized collections between threads,
fix.

[peter_firmstone] RIVER-428 - trial use of another ClassLoader for tests.

------------------------------------------
[...truncated 15765 lines...]
     [java] Test Failed: Test Failed: com.sun.jini.qa.harness.TestException: Exception has
been caught while transaction committing:; nested exception is: 
     [java] 	Unable to commit transaction: 1 Participants: {0, com.sun.jini.outrigger.ConstrainableParticipantProxy
for 4b470373-284e-4756-890c-47021ea1cc0a (through Proxy[OutriggerServer,BasicInvocationHandler[BasicObjectEndpoint[d04c0d1d-89e5-4602-91db-b3308ef577e2,TcpEndpoint[140.211.11.27:35153]]]]),
ABORTED} 
     [java] 
     [java] -----------------------------------------
     [java] com/sun/jini/test/spec/javaspace/conformance/snapshot/SnapshotTransactionTakeReadTest.td
     [java] Test Failed: Test Failed: com.sun.jini.qa.harness.TestException: Exception has
been caught while transaction committing:; nested exception is: 
     [java] 	Unable to commit transaction: 1 Participants: {0, com.sun.jini.outrigger.ConstrainableParticipantProxy
for dd51241f-5892-4d33-a97f-d396d737ce05 (through Proxy[OutriggerServer,BasicInvocationHandler[BasicObjectEndpoint[55a627da-337a-49aa-b346-dbad4241efe8,TcpEndpoint[140.211.11.27:43476]]]]),
ABORTED} 
     [java] 
     [java] -----------------------------------------
     [java] com/sun/jini/test/spec/javaspace/conformance/snapshot/SnapshotTransactionTakeTest.td
     [java] Test Passed: OK
     [java] 
     [java] -----------------------------------------
     [java] com/sun/jini/test/spec/javaspace/conformance/snapshot/SnapshotTransactionTakeWaitTest.td
     [java] Test Passed: OK
     [java] 
     [java] -----------------------------------------
     [java] com/sun/jini/test/spec/javaspace/conformance/snapshot/SnapshotTransactionWriteLeaseANYTest.td
     [java] Test Failed: Test Failed: com.sun.jini.qa.harness.TestException: Exception has
been caught while transaction committing:; nested exception is: 
     [java] 	Unable to commit transaction: 1 Participants: {0, com.sun.jini.outrigger.ConstrainableParticipantProxy
for 4a024c8a-29cf-4d63-a6b3-c34451b0de6a (through Proxy[OutriggerServer,BasicInvocationHandler[BasicObjectEndpoint[7dfe7873-f1dc-4730-b8de-a6548f3e412e,TcpEndpoint[140.211.11.27:52382]]]]),
ABORTED} 
     [java] 
     [java] -----------------------------------------
     [java] com/sun/jini/test/spec/javaspace/conformance/snapshot/SnapshotTransactionWriteLeaseFOREVERTest.td
     [java] Test Failed: Test Failed: com.sun.jini.qa.harness.TestException: Exception has
been caught while transaction committing:; nested exception is: 
     [java] 	Unable to commit transaction: 1 Participants: {0, com.sun.jini.outrigger.ConstrainableParticipantProxy
for 00564dd1-e358-47ba-ab4f-1b62ed789576 (through Proxy[OutriggerServer,BasicInvocationHandler[BasicObjectEndpoint[3827825b-9f3e-4fdb-83a9-a6ef7bf6598c,TcpEndpoint[140.211.11.27:53325]]]]),
ABORTED} 
     [java] 
     [java] -----------------------------------------
     [java] com/sun/jini/test/spec/javaspace/conformance/snapshot/SnapshotTransactionWriteNegativeLeaseTest.td
     [java] Test Failed: Test Failed: com.sun.jini.qa.harness.TestException: Exception has
been caught while transaction committing:; nested exception is: 
     [java] 	Unable to commit transaction: 1 Participants: {0, com.sun.jini.outrigger.ConstrainableParticipantProxy
for 3b4788ed-570e-413e-a11d-04fe7410cdb4 (through Proxy[OutriggerServer,BasicInvocationHandler[BasicObjectEndpoint[458dbe8c-dc33-4318-8fb8-08ceb2b8b2aa,TcpEndpoint[140.211.11.27:42904]]]]),
ABORTED} 
     [java] 
     [java] -----------------------------------------
     [java] com/sun/jini/test/spec/javaspace/conformance/snapshot/SnapshotTransactionWriteTakeIfExistsNotifyTest.td
     [java] Test Failed: Test Failed: com.sun.jini.qa.harness.TestException: Exception has
been caught while transaction committing:; nested exception is: 
     [java] 	Unable to commit transaction: 1 Participants: {0, com.sun.jini.outrigger.ConstrainableParticipantProxy
for 268fbdf0-00de-4868-a772-1958820f9853 (through Proxy[OutriggerServer,BasicInvocationHandler[BasicObjectEndpoint[89909f2c-2c95-4d76-8794-4ef8c476ddf0,TcpEndpoint[140.211.11.27:49082]]]]),
ABORTED} 
     [java] 
     [java] -----------------------------------------
     [java] com/sun/jini/test/spec/javaspace/conformance/snapshot/SnapshotTransactionWriteTakeIfExistsTest.td
     [java] Test Failed: Test Failed: com.sun.jini.qa.harness.TestException: Exception has
been caught while transaction committing:; nested exception is: 
     [java] 	Unable to commit transaction: 1 Participants: {0, com.sun.jini.outrigger.ConstrainableParticipantProxy
for d9f7b88b-21fd-4f64-b40d-d2a6b251bbaa (through Proxy[OutriggerServer,BasicInvocationHandler[BasicObjectEndpoint[9690524d-480e-451f-a8dd-cad60738b005,TcpEndpoint[140.211.11.27:49673]]]]),
ABORTED} 
     [java] 
     [java] -----------------------------------------
     [java] com/sun/jini/test/spec/javaspace/conformance/snapshot/SnapshotTransactionWriteTakeNotifyTest.td
     [java] Test Failed: Test Failed: com.sun.jini.qa.harness.TestException: Exception has
been caught while transaction committing:; nested exception is: 
     [java] 	Unable to commit transaction: 1 Participants: {0, com.sun.jini.outrigger.ConstrainableParticipantProxy
for cf422592-bded-47f3-9146-c74a91e9ce8d (through Proxy[OutriggerServer,BasicInvocationHandler[BasicObjectEndpoint[5e557d18-3ed0-4aca-b01f-044abadc680a,TcpEndpoint[140.211.11.27:33201]]]]),
ABORTED} 
     [java] 
     [java] -----------------------------------------
     [java] com/sun/jini/test/spec/javaspace/conformance/snapshot/SnapshotTransactionWriteTakeTest.td
     [java] Test Failed: Test Failed: com.sun.jini.qa.harness.TestException: Exception has
been caught while transaction committing:; nested exception is: 
     [java] 	Unable to commit transaction: 1 Participants: {0, com.sun.jini.outrigger.ConstrainableParticipantProxy
for 8f655957-b0dd-4287-9344-c311060045a1 (through Proxy[OutriggerServer,BasicInvocationHandler[BasicObjectEndpoint[a0080bff-b79f-4b0a-88ed-0a18cfa0e567,TcpEndpoint[140.211.11.27:42744]]]]),
ABORTED} 
     [java] 
     [java] -----------------------------------------
     [java] com/sun/jini/test/spec/javaspace/conformance/snapshot/SnapshotTransactionWriteTest.td
     [java] Test Failed: Test Failed: com.sun.jini.qa.harness.TestException: Exception has
been caught while transaction committing:; nested exception is: 
     [java] 	Unable to commit transaction: 1 Participants: {0, com.sun.jini.outrigger.ConstrainableParticipantProxy
for 724c244a-17eb-4ca4-8429-4f730b03e1e4 (through Proxy[OutriggerServer,BasicInvocationHandler[BasicObjectEndpoint[e56c3bc9-7e57-4db6-8921-467b1c7efe59,TcpEndpoint[140.211.11.27:35916]]]]),
ABORTED} 
     [java] 
     [java] -----------------------------------------
     [java] com/sun/jini/test/spec/javaspace/conformance/snapshot/SnapshotWriteLeaseANYTest.td
     [java] Test Passed: OK
     [java] 
     [java] -----------------------------------------
     [java] com/sun/jini/test/spec/javaspace/conformance/snapshot/SnapshotWriteLeaseFOREVERTest.td
     [java] Test Passed: OK
     [java] 
     [java] -----------------------------------------
     [java] com/sun/jini/test/spec/javaspace/conformance/snapshot/SnapshotWriteNegativeLeaseTest.td
     [java] Test Passed: OK
     [java] 
     [java] -----------------------------------------
     [java] com/sun/jini/test/spec/javaspace/conformance/snapshot/SnapshotWriteTest.td
     [java] Test Passed: OK
     [java] 
     [java] -----------------------------------------
     [java] com/sun/jini/test/impl/mahalo/AdminIFShutdownTest.td
     [java] Test Passed: OK
     [java] 
     [java] -----------------------------------------
     [java] com/sun/jini/test/impl/mahalo/AdminIFTest.td
     [java] Test Passed: OK
     [java] 
     [java] -----------------------------------------
     [java] com/sun/jini/test/impl/mahalo/LeaseExpireCancelTest.td
     [java] Test Passed: OK
     [java] 
     [java] -----------------------------------------
     [java] com/sun/jini/test/impl/mahalo/LeaseExpireRenewTest.td
     [java] Test Passed: OK
     [java] 
     [java] -----------------------------------------
     [java] com/sun/jini/test/impl/mahalo/LeaseMapTest.td
     [java] Test Passed: OK
     [java] 
     [java] -----------------------------------------
     [java] com/sun/jini/test/impl/mahalo/LeaseTest.td
     [java] Test Passed: OK
     [java] 
     [java] -----------------------------------------
     [java] com/sun/jini/test/impl/mahalo/MahaloCreateShutdownTest.td
     [java] Test Passed: OK
     [java] 
     [java] -----------------------------------------
     [java] com/sun/jini/test/impl/mahalo/MahaloIFTest.td
     [java] Test Passed: OK
     [java] 
     [java] -----------------------------------------
     [java] com/sun/jini/test/impl/mahalo/MahaloImplReadyStateTest.td
     [java] Test Skipped: verifiers are: com.sun.jini.test.impl.mercury.ActivatableMercuryVerifier
com.sun.jini.qa.harness.SkipConfigTestVerifier
     [java] -----------------------------------------
     [java] com/sun/jini/test/impl/mahalo/NestableServerTransactionCreatedToStringTest.td
     [java] Test Passed: OK
     [java] 
     [java] -----------------------------------------
     [java] com/sun/jini/test/impl/mahalo/NestableTransactionCreatedToStringTest.td
     [java] Test Passed: OK
     [java] 
     [java] -----------------------------------------
     [java] com/sun/jini/test/impl/mahalo/PrepareAndCommitExceptionTest.td
     [java] Test Passed: OK
     [java] 
     [java] -----------------------------------------
     [java] com/sun/jini/test/impl/mahalo/PrepareAndCommitExceptionTest2.td
     [java] Test Passed: OK
     [java] 
     [java] -----------------------------------------
     [java] com/sun/jini/test/impl/mahalo/PrepareAndCommitExceptionTest3.td
     [java] Test Passed: OK
     [java] 
     [java] -----------------------------------------
     [java] com/sun/jini/test/impl/mahalo/PrepareAndCommitExceptionTest4.td
     [java] Test Passed: OK
     [java] 
     [java] -----------------------------------------
     [java] com/sun/jini/test/impl/mahalo/PrepareAndCommitExceptionTest5.td
     [java] Test Passed: OK
     [java] 
     [java] -----------------------------------------
     [java] com/sun/jini/test/impl/mahalo/RandomStressTest.td
     [java] Test Passed: OK
     [java] 
     [java] -----------------------------------------
     [java] com/sun/jini/test/impl/mahalo/ServerTransactionEqualityTest.td
     [java] Test Passed: OK
     [java] 
     [java] -----------------------------------------
     [java] com/sun/jini/test/impl/mahalo/ServerTransactionToStringTest.td
     [java] Test Passed: OK
     [java] 
     [java] -----------------------------------------
     [java] com/sun/jini/test/impl/mahalo/TransactionCreatedToStringTest.td
     [java] Test Passed: OK
     [java] 
     [java] -----------------------------------------
     [java] com/sun/jini/test/impl/mahalo/TransactionManagerCreatedToStringTest.td
     [java] Test Passed: OK
     [java] 
     [java] -----------------------------------------
     [java] com/sun/jini/test/impl/mahalo/TxnMgrImplNullActivationConfigEntries.td
     [java] Test Skipped: verifiers are: com.sun.jini.test.impl.mahalo.ActivatableMahaloVerifier
     [java] -----------------------------------------
     [java] com/sun/jini/test/impl/mahalo/TxnMgrImplNullConfigEntries.td
     [java] Test Passed: OK
     [java] 
     [java] -----------------------------------------
     [java] com/sun/jini/test/impl/mahalo/TxnMgrImplNullRecoveredLocators.td
     [java] Test Skipped: verifiers are: com.sun.jini.test.impl.mahalo.ActivatableMahaloVerifier
     [java] -----------------------------------------
     [java] com/sun/jini/test/impl/mahalo/TxnMgrProxyEqualityTest.td
     [java] Test Passed: OK
     [java] 
     [java] -----------------------------------------
     [java] com/sun/jini/test/spec/txnmanager/AsynchAbortOnCommitTest.td
     [java] Test Passed: OK
     [java] 
     [java] -----------------------------------------
     [java] com/sun/jini/test/spec/txnmanager/AsynchAbortOnPrepareTest.td
     [java] Test Passed: OK
     [java] 
     [java] -----------------------------------------
     [java] com/sun/jini/test/spec/txnmanager/CommitExpiredTest.td
     [java] Test Passed: OK
     [java] 
     [java] -----------------------------------------
     [java] com/sun/jini/test/spec/txnmanager/CommitTimeoutTest.td
     [java] Test Passed: OK
     [java] 
     [java] -----------------------------------------
     [java] com/sun/jini/test/spec/txnmanager/GetStateTest.td
     [java] Test Passed: OK
     [java] 
     [java] -----------------------------------------
     [java] com/sun/jini/test/spec/txnmanager/JoinIdempotentTest.td
     [java] Test Passed: OK
     [java] 
     [java] -----------------------------------------
     [java] com/sun/jini/test/spec/txnmanager/JoinWhileActiveTest.td
     [java] Test Passed: OK
     [java] 
     [java] -----------------------------------------
     [java] com/sun/jini/test/spec/txnmanager/ManyParticipantsTest.td
     [java] Test Passed: OK
     [java] 
     [java] -----------------------------------------
     [java] com/sun/jini/test/spec/txnmanager/PrepareTimeoutTest.td
     [java] Test Passed: OK
     [java] 
     [java] -----------------------------------------
     [java] com/sun/jini/test/spec/txnmanager/RollBackErrorTest.td
     [java] Test Passed: OK
     [java] 
     [java] -----------------------------------------
     [java] com/sun/jini/test/spec/txnmanager/RollForwardErrorTest.td
     [java] Test Passed: OK
     [java] 
     [java] -----------------------------------------
     [java] com/sun/jini/test/spec/txnmanager/TwoPhaseTest.td
     [java] Test Passed: OK
     [java] 
     [java] -----------------------------------------
     [java] 
     [java] # of tests started   = 1405
     [java] # of tests completed = 1405
     [java] # of tests skipped   = 53
     [java] # of tests passed    = 1320
     [java] # of tests failed    = 85
     [java] 
     [java] -----------------------------------------
     [java] 
     [java]    Date finished:
     [java]       Wed Nov 20 15:49:18 UTC 2013
     [java]    Time elapsed:
     [java]       60832 seconds
     [java] 
     [java] Java Result: 1

collect-result:
     [copy] Copying 1 file to /x1/jenkins/jenkins-slave/workspace/river-qa-refactor-jdk7/trunk/qa/result
     [copy] Copying 1 file to /x1/jenkins/jenkins-slave/workspace/river-qa-refactor-jdk7/trunk/qa/result
      [zip] Building zip: /x1/jenkins/jenkins-slave/workspace/river-qa-refactor-jdk7/trunk/qa/result/qaresults-i386-Linux-1.7.0_25.zip

BUILD FAILED
/x1/jenkins/jenkins-slave/workspace/river-qa-refactor-jdk7/trunk/build.xml:2100: The following
error occurred while executing this line:
/x1/jenkins/jenkins-slave/workspace/river-qa-refactor-jdk7/trunk/qa/build.xml:406: The following
error occurred while executing this line:
/x1/jenkins/jenkins-slave/workspace/river-qa-refactor-jdk7/trunk/qa/build.xml:380: condition
satisfied

Total time: 1018 minutes 17 seconds
Build step 'Invoke Ant' marked build as failure
[locks-and-latches] Releasing all the locks
[locks-and-latches] All the locks released
Archiving artifacts

Mime
View raw message