river-dev mailing list archives

Site index · List index
Message view « Date » · « Thread »
Top « Date » · « Thread »
From Apache Jenkins Server <jenk...@builds.apache.org>
Subject Build failed in Jenkins: river-qa-refactor-jdk7 #115
Date Mon, 25 Nov 2013 20:38:16 GMT
See <https://builds.apache.org/job/river-qa-refactor-jdk7/115/changes>

Changes:

[peter_firmstone] Activate security debugging to find out which protection domain is missing
permissions causing test failures.

------------------------------------------
[...truncated 15763 lines...]
     [java] Test Failed: Test Failed: com.sun.jini.qa.harness.TestException: Exception has
been caught while transaction committing:; nested exception is: 
     [java] 	Unable to commit transaction: 1 Participants: {0, com.sun.jini.outrigger.ConstrainableParticipantProxy
for ec979901-ecaf-4c3e-9dac-7bfe41d7beca (through Proxy[OutriggerServer,BasicInvocationHandler[BasicObjectEndpoint[7e9149a0-82b5-4044-9e36-879b3cd87b2f,TcpEndpoint[67.195.138.61:57430]]]]),
ABORTED} 
     [java] 
     [java] -----------------------------------------
     [java] com/sun/jini/test/spec/javaspace/conformance/snapshot/SnapshotTransactionTakeReadTest.td
     [java] Test Failed: Test Failed: com.sun.jini.qa.harness.TestException: Exception has
been caught while transaction committing:; nested exception is: 
     [java] 	Unable to commit transaction: 1 Participants: {0, com.sun.jini.outrigger.ConstrainableParticipantProxy
for 6f168d1f-f83c-45c9-8807-ba587630ae44 (through Proxy[OutriggerServer,BasicInvocationHandler[BasicObjectEndpoint[7607e6a7-9ce9-46b3-87ff-22928ed37674,TcpEndpoint[67.195.138.61:47026]]]]),
ABORTED} 
     [java] 
     [java] -----------------------------------------
     [java] com/sun/jini/test/spec/javaspace/conformance/snapshot/SnapshotTransactionTakeTest.td
     [java] Test Passed: OK
     [java] 
     [java] -----------------------------------------
     [java] com/sun/jini/test/spec/javaspace/conformance/snapshot/SnapshotTransactionTakeWaitTest.td
     [java] Test Passed: OK
     [java] 
     [java] -----------------------------------------
     [java] com/sun/jini/test/spec/javaspace/conformance/snapshot/SnapshotTransactionWriteLeaseANYTest.td
     [java] Test Failed: Test Failed: com.sun.jini.qa.harness.TestException: Exception has
been caught while transaction committing:; nested exception is: 
     [java] 	Unable to commit transaction: 1 Participants: {0, com.sun.jini.outrigger.ConstrainableParticipantProxy
for b627385a-39e0-4b90-ade0-13bc540ec658 (through Proxy[OutriggerServer,BasicInvocationHandler[BasicObjectEndpoint[79213ed9-c11a-40e3-9e05-3befe4d084da,TcpEndpoint[67.195.138.61:59548]]]]),
ABORTED} 
     [java] 
     [java] -----------------------------------------
     [java] com/sun/jini/test/spec/javaspace/conformance/snapshot/SnapshotTransactionWriteLeaseFOREVERTest.td
     [java] Test Failed: Test Failed: com.sun.jini.qa.harness.TestException: Exception has
been caught while transaction committing:; nested exception is: 
     [java] 	Unable to commit transaction: 1 Participants: {0, com.sun.jini.outrigger.ConstrainableParticipantProxy
for 8886ce17-21b3-4a55-8c48-372a16afbb96 (through Proxy[OutriggerServer,BasicInvocationHandler[BasicObjectEndpoint[9447f186-2050-4d97-a86b-8036e0f306d8,TcpEndpoint[67.195.138.61:37495]]]]),
ABORTED} 
     [java] 
     [java] -----------------------------------------
     [java] com/sun/jini/test/spec/javaspace/conformance/snapshot/SnapshotTransactionWriteNegativeLeaseTest.td
     [java] Test Failed: Test Failed: com.sun.jini.qa.harness.TestException: Exception has
been caught while transaction committing:; nested exception is: 
     [java] 	Unable to commit transaction: 1 Participants: {0, com.sun.jini.outrigger.ConstrainableParticipantProxy
for 90fbf846-8d9f-4020-a00e-0459c5432bb0 (through Proxy[OutriggerServer,BasicInvocationHandler[BasicObjectEndpoint[62284bb2-ba74-454a-943d-c032b10bab13,TcpEndpoint[67.195.138.61:33005]]]]),
ABORTED} 
     [java] 
     [java] -----------------------------------------
     [java] com/sun/jini/test/spec/javaspace/conformance/snapshot/SnapshotTransactionWriteTakeIfExistsNotifyTest.td
     [java] Test Failed: Test Failed: com.sun.jini.qa.harness.TestException: Exception has
been caught while transaction committing:; nested exception is: 
     [java] 	Unable to commit transaction: 1 Participants: {0, com.sun.jini.outrigger.ConstrainableParticipantProxy
for 85b3c884-7258-4751-96ae-1f3227e23195 (through Proxy[OutriggerServer,BasicInvocationHandler[BasicObjectEndpoint[f267c8ac-91ad-4e3b-9332-4d5b621c0ae8,TcpEndpoint[67.195.138.61:55333]]]]),
ABORTED} 
     [java] 
     [java] -----------------------------------------
     [java] com/sun/jini/test/spec/javaspace/conformance/snapshot/SnapshotTransactionWriteTakeIfExistsTest.td
     [java] Test Failed: Test Failed: com.sun.jini.qa.harness.TestException: Exception has
been caught while transaction committing:; nested exception is: 
     [java] 	Unable to commit transaction: 1 Participants: {0, com.sun.jini.outrigger.ConstrainableParticipantProxy
for 8244548c-916f-452e-a7bc-2645fda9728c (through Proxy[OutriggerServer,BasicInvocationHandler[BasicObjectEndpoint[256f61b6-6bb2-4594-8852-80d4af3bf9ac,TcpEndpoint[67.195.138.61:59193]]]]),
ABORTED} 
     [java] 
     [java] -----------------------------------------
     [java] com/sun/jini/test/spec/javaspace/conformance/snapshot/SnapshotTransactionWriteTakeNotifyTest.td
     [java] Test Failed: Test Failed: com.sun.jini.qa.harness.TestException: Exception has
been caught while transaction committing:; nested exception is: 
     [java] 	Unable to commit transaction: 1 Participants: {0, com.sun.jini.outrigger.ConstrainableParticipantProxy
for 27a4553a-8c9c-4349-b3bd-dd1895d879dd (through Proxy[OutriggerServer,BasicInvocationHandler[BasicObjectEndpoint[47a4f073-7548-401d-8600-05fef2d90ae6,TcpEndpoint[67.195.138.61:57197]]]]),
ABORTED} 
     [java] 
     [java] -----------------------------------------
     [java] com/sun/jini/test/spec/javaspace/conformance/snapshot/SnapshotTransactionWriteTakeTest.td
     [java] Test Failed: Test Failed: com.sun.jini.qa.harness.TestException: Exception has
been caught while transaction committing:; nested exception is: 
     [java] 	Unable to commit transaction: 1 Participants: {0, com.sun.jini.outrigger.ConstrainableParticipantProxy
for 661f2f01-69b8-4a2d-b7fc-242ed7b598a8 (through Proxy[OutriggerServer,BasicInvocationHandler[BasicObjectEndpoint[31bcca6d-232c-4985-b9fa-1b01f51ad860,TcpEndpoint[67.195.138.61:53061]]]]),
ABORTED} 
     [java] 
     [java] -----------------------------------------
     [java] com/sun/jini/test/spec/javaspace/conformance/snapshot/SnapshotTransactionWriteTest.td
     [java] Test Failed: Test Failed: com.sun.jini.qa.harness.TestException: Exception has
been caught while transaction committing:; nested exception is: 
     [java] 	Unable to commit transaction: 1 Participants: {0, com.sun.jini.outrigger.ConstrainableParticipantProxy
for 1f938f06-1bdd-4daa-b850-6485be7aed01 (through Proxy[OutriggerServer,BasicInvocationHandler[BasicObjectEndpoint[60e1c007-0b71-45ba-ad4f-8407547e00f3,TcpEndpoint[67.195.138.61:49780]]]]),
ABORTED} 
     [java] 
     [java] -----------------------------------------
     [java] com/sun/jini/test/spec/javaspace/conformance/snapshot/SnapshotWriteLeaseANYTest.td
     [java] Test Passed: OK
     [java] 
     [java] -----------------------------------------
     [java] com/sun/jini/test/spec/javaspace/conformance/snapshot/SnapshotWriteLeaseFOREVERTest.td
     [java] Test Passed: OK
     [java] 
     [java] -----------------------------------------
     [java] com/sun/jini/test/spec/javaspace/conformance/snapshot/SnapshotWriteNegativeLeaseTest.td
     [java] Test Passed: OK
     [java] 
     [java] -----------------------------------------
     [java] com/sun/jini/test/spec/javaspace/conformance/snapshot/SnapshotWriteTest.td
     [java] Test Passed: OK
     [java] 
     [java] -----------------------------------------
     [java] com/sun/jini/test/impl/mahalo/AdminIFShutdownTest.td
     [java] Test Passed: OK
     [java] 
     [java] -----------------------------------------
     [java] com/sun/jini/test/impl/mahalo/AdminIFTest.td
     [java] Test Passed: OK
     [java] 
     [java] -----------------------------------------
     [java] com/sun/jini/test/impl/mahalo/LeaseExpireCancelTest.td
     [java] Test Passed: OK
     [java] 
     [java] -----------------------------------------
     [java] com/sun/jini/test/impl/mahalo/LeaseExpireRenewTest.td
     [java] Test Passed: OK
     [java] 
     [java] -----------------------------------------
     [java] com/sun/jini/test/impl/mahalo/LeaseMapTest.td
     [java] Test Passed: OK
     [java] 
     [java] -----------------------------------------
     [java] com/sun/jini/test/impl/mahalo/LeaseTest.td
     [java] Test Passed: OK
     [java] 
     [java] -----------------------------------------
     [java] com/sun/jini/test/impl/mahalo/MahaloCreateShutdownTest.td
     [java] Test Passed: OK
     [java] 
     [java] -----------------------------------------
     [java] com/sun/jini/test/impl/mahalo/MahaloIFTest.td
     [java] Test Passed: OK
     [java] 
     [java] -----------------------------------------
     [java] com/sun/jini/test/impl/mahalo/MahaloImplReadyStateTest.td
     [java] Test Skipped: verifiers are: com.sun.jini.test.impl.mercury.ActivatableMercuryVerifier
com.sun.jini.qa.harness.SkipConfigTestVerifier
     [java] -----------------------------------------
     [java] com/sun/jini/test/impl/mahalo/NestableServerTransactionCreatedToStringTest.td
     [java] Test Passed: OK
     [java] 
     [java] -----------------------------------------
     [java] com/sun/jini/test/impl/mahalo/NestableTransactionCreatedToStringTest.td
     [java] Test Passed: OK
     [java] 
     [java] -----------------------------------------
     [java] com/sun/jini/test/impl/mahalo/PrepareAndCommitExceptionTest.td
     [java] Test Passed: OK
     [java] 
     [java] -----------------------------------------
     [java] com/sun/jini/test/impl/mahalo/PrepareAndCommitExceptionTest2.td
     [java] Test Passed: OK
     [java] 
     [java] -----------------------------------------
     [java] com/sun/jini/test/impl/mahalo/PrepareAndCommitExceptionTest3.td
     [java] Test Passed: OK
     [java] 
     [java] -----------------------------------------
     [java] com/sun/jini/test/impl/mahalo/PrepareAndCommitExceptionTest4.td
     [java] Test Passed: OK
     [java] 
     [java] -----------------------------------------
     [java] com/sun/jini/test/impl/mahalo/PrepareAndCommitExceptionTest5.td
     [java] Test Passed: OK
     [java] 
     [java] -----------------------------------------
     [java] com/sun/jini/test/impl/mahalo/RandomStressTest.td
     [java] Test Passed: OK
     [java] 
     [java] -----------------------------------------
     [java] com/sun/jini/test/impl/mahalo/ServerTransactionEqualityTest.td
     [java] Test Passed: OK
     [java] 
     [java] -----------------------------------------
     [java] com/sun/jini/test/impl/mahalo/ServerTransactionToStringTest.td
     [java] Test Passed: OK
     [java] 
     [java] -----------------------------------------
     [java] com/sun/jini/test/impl/mahalo/TransactionCreatedToStringTest.td
     [java] Test Passed: OK
     [java] 
     [java] -----------------------------------------
     [java] com/sun/jini/test/impl/mahalo/TransactionManagerCreatedToStringTest.td
     [java] Test Passed: OK
     [java] 
     [java] -----------------------------------------
     [java] com/sun/jini/test/impl/mahalo/TxnMgrImplNullActivationConfigEntries.td
     [java] Test Skipped: verifiers are: com.sun.jini.test.impl.mahalo.ActivatableMahaloVerifier
     [java] -----------------------------------------
     [java] com/sun/jini/test/impl/mahalo/TxnMgrImplNullConfigEntries.td
     [java] Test Passed: OK
     [java] 
     [java] -----------------------------------------
     [java] com/sun/jini/test/impl/mahalo/TxnMgrImplNullRecoveredLocators.td
     [java] Test Skipped: verifiers are: com.sun.jini.test.impl.mahalo.ActivatableMahaloVerifier
     [java] -----------------------------------------
     [java] com/sun/jini/test/impl/mahalo/TxnMgrProxyEqualityTest.td
     [java] Test Passed: OK
     [java] 
     [java] -----------------------------------------
     [java] com/sun/jini/test/spec/txnmanager/AsynchAbortOnCommitTest.td
     [java] Test Passed: OK
     [java] 
     [java] -----------------------------------------
     [java] com/sun/jini/test/spec/txnmanager/AsynchAbortOnPrepareTest.td
     [java] Test Passed: OK
     [java] 
     [java] -----------------------------------------
     [java] com/sun/jini/test/spec/txnmanager/CommitExpiredTest.td
     [java] Test Passed: OK
     [java] 
     [java] -----------------------------------------
     [java] com/sun/jini/test/spec/txnmanager/CommitTimeoutTest.td
     [java] Test Passed: OK
     [java] 
     [java] -----------------------------------------
     [java] com/sun/jini/test/spec/txnmanager/GetStateTest.td
     [java] Test Passed: OK
     [java] 
     [java] -----------------------------------------
     [java] com/sun/jini/test/spec/txnmanager/JoinIdempotentTest.td
     [java] Test Passed: OK
     [java] 
     [java] -----------------------------------------
     [java] com/sun/jini/test/spec/txnmanager/JoinWhileActiveTest.td
     [java] Test Passed: OK
     [java] 
     [java] -----------------------------------------
     [java] com/sun/jini/test/spec/txnmanager/ManyParticipantsTest.td
     [java] Test Passed: OK
     [java] 
     [java] -----------------------------------------
     [java] com/sun/jini/test/spec/txnmanager/PrepareTimeoutTest.td
     [java] Test Passed: OK
     [java] 
     [java] -----------------------------------------
     [java] com/sun/jini/test/spec/txnmanager/RollBackErrorTest.td
     [java] Test Passed: OK
     [java] 
     [java] -----------------------------------------
     [java] com/sun/jini/test/spec/txnmanager/RollForwardErrorTest.td
     [java] Test Passed: OK
     [java] 
     [java] -----------------------------------------
     [java] com/sun/jini/test/spec/txnmanager/TwoPhaseTest.td
     [java] Test Passed: OK
     [java] 
     [java] -----------------------------------------
     [java] 
     [java] # of tests started   = 1405
     [java] # of tests completed = 1405
     [java] # of tests skipped   = 53
     [java] # of tests passed    = 1320
     [java] # of tests failed    = 85
     [java] 
     [java] -----------------------------------------
     [java] 
     [java]    Date finished:
     [java]       Mon Nov 25 20:36:51 UTC 2013
     [java]    Time elapsed:
     [java]       59503 seconds
     [java] 
     [java] Java Result: 1

collect-result:
     [copy] Copying 1 file to <https://builds.apache.org/job/river-qa-refactor-jdk7/ws/trunk/qa/result>
     [copy] Copying 1 file to <https://builds.apache.org/job/river-qa-refactor-jdk7/ws/trunk/qa/result>
      [zip] Building zip: <https://builds.apache.org/job/river-qa-refactor-jdk7/115/artifact/trunk/qa/result/qaresults-i386-Linux-1.7.0_25.zip>

BUILD FAILED
<https://builds.apache.org/job/river-qa-refactor-jdk7/ws/trunk/build.xml>:2100: The
following error occurred while executing this line:
<https://builds.apache.org/job/river-qa-refactor-jdk7/ws/trunk/qa/build.xml>:406: The
following error occurred while executing this line:
<https://builds.apache.org/job/river-qa-refactor-jdk7/ws/trunk/qa/build.xml>:380: condition
satisfied

Total time: 997 minutes 25 seconds
Build step 'Invoke Ant' marked build as failure
[locks-and-latches] Releasing all the locks
[locks-and-latches] All the locks released
Archiving artifacts

Mime
View raw message