river-dev mailing list archives

Site index · List index
Message view « Date » · « Thread »
Top « Date » · « Thread »
From Apache Jenkins Server <jenk...@builds.apache.org>
Subject Build failed in Jenkins: river-qa-refactor-jdk7 #111
Date Sat, 16 Nov 2013 21:20:26 GMT
See <https://builds.apache.org/job/river-qa-refactor-jdk7/111/changes>

Changes:

[peter_firmstone] Update all instances of ReadersWriter to use ReadersPriorityWriter.

ReadersPriorityWriter implementation is very similar to it's parent class ReadersWriter, however
it utilizes Java 5 explicit locking and conditions to avoid waking all reader and writer threads,
when only a writer can obtain the lock.  This avoids warm reader threads from repeatedly synchronizing
on the object lock, causing contention delays for the writer trying to obtain a write lock.

[peter_firmstone] Security debugging of tests no longer needed

[peter_firmstone] Fix tests failing on Java 1.7.0_25 linux, due to missing permission.

------------------------------------------
[...truncated 15766 lines...]
     [java] Test Failed: Test Failed: com.sun.jini.qa.harness.TestException: Exception has
been caught while transaction committing:; nested exception is: 
     [java] 	Unable to commit transaction: 1 Participants: {0, com.sun.jini.outrigger.ConstrainableParticipantProxy
for 5f3ae5da-1447-462f-8a9f-d878e662278b (through Proxy[OutriggerServer,BasicInvocationHandler[BasicObjectEndpoint[a0b33cd4-43ef-4da6-908e-1f2eb0eabd69,TcpEndpoint[67.195.138.61:42853]]]]),
ABORTED} 
     [java] 
     [java] -----------------------------------------
     [java] com/sun/jini/test/spec/javaspace/conformance/snapshot/SnapshotTransactionTakeReadTest.td
     [java] Test Failed: Test Failed: com.sun.jini.qa.harness.TestException: Exception has
been caught while transaction committing:; nested exception is: 
     [java] 	Unable to commit transaction: 1 Participants: {0, com.sun.jini.outrigger.ConstrainableParticipantProxy
for 8f9581bc-9bf4-464c-b051-c44c0d1aabf2 (through Proxy[OutriggerServer,BasicInvocationHandler[BasicObjectEndpoint[dbceb76b-5ca9-48e6-8acc-fa506312999b,TcpEndpoint[67.195.138.61:39543]]]]),
ABORTED} 
     [java] 
     [java] -----------------------------------------
     [java] com/sun/jini/test/spec/javaspace/conformance/snapshot/SnapshotTransactionTakeTest.td
     [java] Test Passed: OK
     [java] 
     [java] -----------------------------------------
     [java] com/sun/jini/test/spec/javaspace/conformance/snapshot/SnapshotTransactionTakeWaitTest.td
     [java] Test Passed: OK
     [java] 
     [java] -----------------------------------------
     [java] com/sun/jini/test/spec/javaspace/conformance/snapshot/SnapshotTransactionWriteLeaseANYTest.td
     [java] Test Failed: Test Failed: com.sun.jini.qa.harness.TestException: Exception has
been caught while transaction committing:; nested exception is: 
     [java] 	Unable to commit transaction: 1 Participants: {0, com.sun.jini.outrigger.ConstrainableParticipantProxy
for d9a3f406-4d77-40aa-a794-b5dadc2c03c1 (through Proxy[OutriggerServer,BasicInvocationHandler[BasicObjectEndpoint[ba7283fa-6795-4b1e-923c-204fccd7a79f,TcpEndpoint[67.195.138.61:57007]]]]),
ABORTED} 
     [java] 
     [java] -----------------------------------------
     [java] com/sun/jini/test/spec/javaspace/conformance/snapshot/SnapshotTransactionWriteLeaseFOREVERTest.td
     [java] Test Failed: Test Failed: com.sun.jini.qa.harness.TestException: Exception has
been caught while transaction committing:; nested exception is: 
     [java] 	Unable to commit transaction: 1 Participants: {0, com.sun.jini.outrigger.ConstrainableParticipantProxy
for 187592be-919f-4b7a-8ba3-0f054a170f82 (through Proxy[OutriggerServer,BasicInvocationHandler[BasicObjectEndpoint[b3dcf983-8984-4c97-85b2-9bbd6e2a142d,TcpEndpoint[67.195.138.61:58727]]]]),
ABORTED} 
     [java] 
     [java] -----------------------------------------
     [java] com/sun/jini/test/spec/javaspace/conformance/snapshot/SnapshotTransactionWriteNegativeLeaseTest.td
     [java] Test Failed: Test Failed: com.sun.jini.qa.harness.TestException: Exception has
been caught while transaction committing:; nested exception is: 
     [java] 	Unable to commit transaction: 1 Participants: {0, com.sun.jini.outrigger.ConstrainableParticipantProxy
for 6e5c0621-dcae-4193-98b9-b3423e1c7656 (through Proxy[OutriggerServer,BasicInvocationHandler[BasicObjectEndpoint[59f7f730-86f0-424b-9d9d-da09899209b3,TcpEndpoint[67.195.138.61:34484]]]]),
ABORTED} 
     [java] 
     [java] -----------------------------------------
     [java] com/sun/jini/test/spec/javaspace/conformance/snapshot/SnapshotTransactionWriteTakeIfExistsNotifyTest.td
     [java] Test Failed: Test Failed: com.sun.jini.qa.harness.TestException: Exception has
been caught while transaction committing:; nested exception is: 
     [java] 	Unable to commit transaction: 1 Participants: {0, com.sun.jini.outrigger.ConstrainableParticipantProxy
for 1edc564c-6975-400d-950a-d7e98e5f3f73 (through Proxy[OutriggerServer,BasicInvocationHandler[BasicObjectEndpoint[b3ea6295-24ee-4941-8b91-5df9d2713c3e,TcpEndpoint[67.195.138.61:60787]]]]),
ABORTED} 
     [java] 
     [java] -----------------------------------------
     [java] com/sun/jini/test/spec/javaspace/conformance/snapshot/SnapshotTransactionWriteTakeIfExistsTest.td
     [java] Test Failed: Test Failed: com.sun.jini.qa.harness.TestException: Exception has
been caught while transaction committing:; nested exception is: 
     [java] 	Unable to commit transaction: 1 Participants: {0, com.sun.jini.outrigger.ConstrainableParticipantProxy
for da08563e-cbdf-4e27-accd-d9c98547a319 (through Proxy[OutriggerServer,BasicInvocationHandler[BasicObjectEndpoint[3bd55e20-4eb7-4812-9509-e0f6d1cfe560,TcpEndpoint[67.195.138.61:40294]]]]),
ABORTED} 
     [java] 
     [java] -----------------------------------------
     [java] com/sun/jini/test/spec/javaspace/conformance/snapshot/SnapshotTransactionWriteTakeNotifyTest.td
     [java] Test Failed: Test Failed: com.sun.jini.qa.harness.TestException: Exception has
been caught while transaction committing:; nested exception is: 
     [java] 	Unable to commit transaction: 1 Participants: {0, com.sun.jini.outrigger.ConstrainableParticipantProxy
for 018b55c1-9d63-4928-af0d-f61036a8132f (through Proxy[OutriggerServer,BasicInvocationHandler[BasicObjectEndpoint[2b5ceb1c-8267-4250-b2f4-2a7d2493e382,TcpEndpoint[67.195.138.61:34736]]]]),
ABORTED} 
     [java] 
     [java] -----------------------------------------
     [java] com/sun/jini/test/spec/javaspace/conformance/snapshot/SnapshotTransactionWriteTakeTest.td
     [java] Test Failed: Test Failed: com.sun.jini.qa.harness.TestException: Exception has
been caught while transaction committing:; nested exception is: 
     [java] 	Unable to commit transaction: 1 Participants: {0, com.sun.jini.outrigger.ConstrainableParticipantProxy
for 2b403fba-840b-4262-b3fa-a4aac8bbef6f (through Proxy[OutriggerServer,BasicInvocationHandler[BasicObjectEndpoint[8d68d68a-4885-40f7-af94-f40dceb505ef,TcpEndpoint[67.195.138.61:58266]]]]),
ABORTED} 
     [java] 
     [java] -----------------------------------------
     [java] com/sun/jini/test/spec/javaspace/conformance/snapshot/SnapshotTransactionWriteTest.td
     [java] Test Failed: Test Failed: com.sun.jini.qa.harness.TestException: Exception has
been caught while transaction committing:; nested exception is: 
     [java] 	Unable to commit transaction: 1 Participants: {0, com.sun.jini.outrigger.ConstrainableParticipantProxy
for efc68d65-76ff-4195-8deb-2b6787519106 (through Proxy[OutriggerServer,BasicInvocationHandler[BasicObjectEndpoint[7311cc8e-b139-4a4b-bdf2-94fa26169510,TcpEndpoint[67.195.138.61:50509]]]]),
ABORTED} 
     [java] 
     [java] -----------------------------------------
     [java] com/sun/jini/test/spec/javaspace/conformance/snapshot/SnapshotWriteLeaseANYTest.td
     [java] Test Passed: OK
     [java] 
     [java] -----------------------------------------
     [java] com/sun/jini/test/spec/javaspace/conformance/snapshot/SnapshotWriteLeaseFOREVERTest.td
     [java] Test Passed: OK
     [java] 
     [java] -----------------------------------------
     [java] com/sun/jini/test/spec/javaspace/conformance/snapshot/SnapshotWriteNegativeLeaseTest.td
     [java] Test Passed: OK
     [java] 
     [java] -----------------------------------------
     [java] com/sun/jini/test/spec/javaspace/conformance/snapshot/SnapshotWriteTest.td
     [java] Test Passed: OK
     [java] 
     [java] -----------------------------------------
     [java] com/sun/jini/test/impl/mahalo/AdminIFShutdownTest.td
     [java] Test Passed: OK
     [java] 
     [java] -----------------------------------------
     [java] com/sun/jini/test/impl/mahalo/AdminIFTest.td
     [java] Test Passed: OK
     [java] 
     [java] -----------------------------------------
     [java] com/sun/jini/test/impl/mahalo/LeaseExpireCancelTest.td
     [java] Test Passed: OK
     [java] 
     [java] -----------------------------------------
     [java] com/sun/jini/test/impl/mahalo/LeaseExpireRenewTest.td
     [java] Test Passed: OK
     [java] 
     [java] -----------------------------------------
     [java] com/sun/jini/test/impl/mahalo/LeaseMapTest.td
     [java] Test Passed: OK
     [java] 
     [java] -----------------------------------------
     [java] com/sun/jini/test/impl/mahalo/LeaseTest.td
     [java] Test Passed: OK
     [java] 
     [java] -----------------------------------------
     [java] com/sun/jini/test/impl/mahalo/MahaloCreateShutdownTest.td
     [java] Test Passed: OK
     [java] 
     [java] -----------------------------------------
     [java] com/sun/jini/test/impl/mahalo/MahaloIFTest.td
     [java] Test Passed: OK
     [java] 
     [java] -----------------------------------------
     [java] com/sun/jini/test/impl/mahalo/MahaloImplReadyStateTest.td
     [java] Test Skipped: verifiers are: com.sun.jini.test.impl.mercury.ActivatableMercuryVerifier
com.sun.jini.qa.harness.SkipConfigTestVerifier
     [java] -----------------------------------------
     [java] com/sun/jini/test/impl/mahalo/NestableServerTransactionCreatedToStringTest.td
     [java] Test Passed: OK
     [java] 
     [java] -----------------------------------------
     [java] com/sun/jini/test/impl/mahalo/NestableTransactionCreatedToStringTest.td
     [java] Test Passed: OK
     [java] 
     [java] -----------------------------------------
     [java] com/sun/jini/test/impl/mahalo/PrepareAndCommitExceptionTest.td
     [java] Test Passed: OK
     [java] 
     [java] -----------------------------------------
     [java] com/sun/jini/test/impl/mahalo/PrepareAndCommitExceptionTest2.td
     [java] Test Passed: OK
     [java] 
     [java] -----------------------------------------
     [java] com/sun/jini/test/impl/mahalo/PrepareAndCommitExceptionTest3.td
     [java] Test Passed: OK
     [java] 
     [java] -----------------------------------------
     [java] com/sun/jini/test/impl/mahalo/PrepareAndCommitExceptionTest4.td
     [java] Test Passed: OK
     [java] 
     [java] -----------------------------------------
     [java] com/sun/jini/test/impl/mahalo/PrepareAndCommitExceptionTest5.td
     [java] Test Passed: OK
     [java] 
     [java] -----------------------------------------
     [java] com/sun/jini/test/impl/mahalo/RandomStressTest.td
     [java] Test Passed: OK
     [java] 
     [java] -----------------------------------------
     [java] com/sun/jini/test/impl/mahalo/ServerTransactionEqualityTest.td
     [java] Test Passed: OK
     [java] 
     [java] -----------------------------------------
     [java] com/sun/jini/test/impl/mahalo/ServerTransactionToStringTest.td
     [java] Test Passed: OK
     [java] 
     [java] -----------------------------------------
     [java] com/sun/jini/test/impl/mahalo/TransactionCreatedToStringTest.td
     [java] Test Passed: OK
     [java] 
     [java] -----------------------------------------
     [java] com/sun/jini/test/impl/mahalo/TransactionManagerCreatedToStringTest.td
     [java] Test Passed: OK
     [java] 
     [java] -----------------------------------------
     [java] com/sun/jini/test/impl/mahalo/TxnMgrImplNullActivationConfigEntries.td
     [java] Test Skipped: verifiers are: com.sun.jini.test.impl.mahalo.ActivatableMahaloVerifier
     [java] -----------------------------------------
     [java] com/sun/jini/test/impl/mahalo/TxnMgrImplNullConfigEntries.td
     [java] Test Passed: OK
     [java] 
     [java] -----------------------------------------
     [java] com/sun/jini/test/impl/mahalo/TxnMgrImplNullRecoveredLocators.td
     [java] Test Skipped: verifiers are: com.sun.jini.test.impl.mahalo.ActivatableMahaloVerifier
     [java] -----------------------------------------
     [java] com/sun/jini/test/impl/mahalo/TxnMgrProxyEqualityTest.td
     [java] Test Passed: OK
     [java] 
     [java] -----------------------------------------
     [java] com/sun/jini/test/spec/txnmanager/AsynchAbortOnCommitTest.td
     [java] Test Passed: OK
     [java] 
     [java] -----------------------------------------
     [java] com/sun/jini/test/spec/txnmanager/AsynchAbortOnPrepareTest.td
     [java] Test Passed: OK
     [java] 
     [java] -----------------------------------------
     [java] com/sun/jini/test/spec/txnmanager/CommitExpiredTest.td
     [java] Test Passed: OK
     [java] 
     [java] -----------------------------------------
     [java] com/sun/jini/test/spec/txnmanager/CommitTimeoutTest.td
     [java] Test Passed: OK
     [java] 
     [java] -----------------------------------------
     [java] com/sun/jini/test/spec/txnmanager/GetStateTest.td
     [java] Test Passed: OK
     [java] 
     [java] -----------------------------------------
     [java] com/sun/jini/test/spec/txnmanager/JoinIdempotentTest.td
     [java] Test Passed: OK
     [java] 
     [java] -----------------------------------------
     [java] com/sun/jini/test/spec/txnmanager/JoinWhileActiveTest.td
     [java] Test Passed: OK
     [java] 
     [java] -----------------------------------------
     [java] com/sun/jini/test/spec/txnmanager/ManyParticipantsTest.td
     [java] Test Passed: OK
     [java] 
     [java] -----------------------------------------
     [java] com/sun/jini/test/spec/txnmanager/PrepareTimeoutTest.td
     [java] Test Passed: OK
     [java] 
     [java] -----------------------------------------
     [java] com/sun/jini/test/spec/txnmanager/RollBackErrorTest.td
     [java] Test Passed: OK
     [java] 
     [java] -----------------------------------------
     [java] com/sun/jini/test/spec/txnmanager/RollForwardErrorTest.td
     [java] Test Passed: OK
     [java] 
     [java] -----------------------------------------
     [java] com/sun/jini/test/spec/txnmanager/TwoPhaseTest.td
     [java] Test Passed: OK
     [java] 
     [java] -----------------------------------------
     [java] 
     [java] # of tests started   = 1405
     [java] # of tests completed = 1405
     [java] # of tests skipped   = 53
     [java] # of tests passed    = 1320
     [java] # of tests failed    = 85
     [java] 
     [java] -----------------------------------------
     [java] 
     [java]    Date finished:
     [java]       Sat Nov 16 21:20:22 UTC 2013
     [java]    Time elapsed:
     [java]       59416 seconds
     [java] 
     [java] Java Result: 1

collect-result:
     [copy] Copying 1 file to <https://builds.apache.org/job/river-qa-refactor-jdk7/ws/trunk/qa/result>
     [copy] Copying 1 file to <https://builds.apache.org/job/river-qa-refactor-jdk7/ws/trunk/qa/result>
      [zip] Building zip: <https://builds.apache.org/job/river-qa-refactor-jdk7/111/artifact/trunk/qa/result/qaresults-i386-Linux-1.7.0_25.zip>

BUILD FAILED
<https://builds.apache.org/job/river-qa-refactor-jdk7/ws/trunk/build.xml>:2100: The
following error occurred while executing this line:
<https://builds.apache.org/job/river-qa-refactor-jdk7/ws/trunk/qa/build.xml>:406: The
following error occurred while executing this line:
<https://builds.apache.org/job/river-qa-refactor-jdk7/ws/trunk/qa/build.xml>:380: condition
satisfied

Total time: 994 minutes 45 seconds
Build step 'Invoke Ant' marked build as failure
[locks-and-latches] Releasing all the locks
[locks-and-latches] All the locks released
Archiving artifacts

Mime
View raw message