river-dev mailing list archives

Site index · List index
Message view « Date » · « Thread »
Top « Date » · « Thread »
From Apache Jenkins Server <jenk...@builds.apache.org>
Subject Build failed in Jenkins: river-qa-refactor-win #15
Date Sun, 17 Nov 2013 21:30:31 GMT
See <https://builds.apache.org/job/river-qa-refactor-win/15/changes>

Changes:

[peter_firmstone] Update to documentation in preparation for a preliminary release.

[peter_firmstone] Update to documentation in preparation for a preliminary release.

[peter_firmstone] Add missing permission for Outrigger proxy to read property for testing

[peter_firmstone] Fix spelling

[peter_firmstone] Revert default slop duration to 10 seconds as per River 2.2.2.  This value
was shortened to 1 second to assist synchronization / timing debugging during refactoring.

[peter_firmstone] Update jsk-platform.jar manifest

[peter_firmstone] RIVER-426 Support for SchemeSpecificPart with URIString normalization, patch
contributed by Shawn Ellis

[peter_firmstone] Update all instances of ReadersWriter to use ReadersPriorityWriter.

ReadersPriorityWriter implementation is very similar to it's parent class ReadersWriter, however
it utilizes Java 5 explicit locking and conditions to avoid waking all reader and writer threads,
when only a writer can obtain the lock.  This avoids warm reader threads from repeatedly synchronizing
on the object lock, causing contention delays for the writer trying to obtain a write lock.

[peter_firmstone] Security debugging of tests no longer needed

[peter_firmstone] Fix tests failing on Java 1.7.0_25 linux, due to missing permission.

[peter_firmstone] Reggie is having some concurrency issues on Windows Server 2008 and Java
7 (see qa refactoring tests on this platform), this new subclass of ReadersWriter, more accurately
implements the original intent of the class by using multiple Conditions with an explicit
lock.  While I'm not expecting this to fix the concurrency issues, it rules out the case where
a writer is unable to obtain a lock in order to wait for readers to finish.

------------------------------------------
[...truncated 18116 lines...]
     [java] -----------------------------------------
     [java] com/sun/jini/test/impl/mahalo/AdminIFTest.td
     [java] Test Failed: Test Failed: com.sun.jini.qa.harness.TestException: Exception has
been caught in specifyServices: Problem creating service for net.jini.core.transaction.server.TransactionManager;
nested exception is: 
     [java] 	Failed to start the shared nonactivatable group; nested exception is: 
     [java] 	NonActivatableGroupAdmin: Failed to exec the group; nested exception is: 
     [java] 	null
     [java] 
     [java] -----------------------------------------
     [java] com/sun/jini/test/impl/mahalo/LeaseExpireCancelTest.td
     [java] Test Failed: Test Failed: com.sun.jini.qa.harness.TestException: Exception has
been caught in specifyServices: Problem creating service for net.jini.core.transaction.server.TransactionManager;
nested exception is: 
     [java] 	Failed to start the shared nonactivatable group; nested exception is: 
     [java] 	NonActivatableGroupAdmin: Failed to exec the group; nested exception is: 
     [java] 	null
     [java] 
     [java] -----------------------------------------
     [java] com/sun/jini/test/impl/mahalo/LeaseExpireRenewTest.td
     [java] Test Failed: Test Failed: com.sun.jini.qa.harness.TestException: Exception has
been caught in specifyServices: Problem creating service for net.jini.core.transaction.server.TransactionManager;
nested exception is: 
     [java] 	Failed to start the shared nonactivatable group; nested exception is: 
     [java] 	NonActivatableGroupAdmin: Failed to exec the group; nested exception is: 
     [java] 	null
     [java] 
     [java] -----------------------------------------
     [java] com/sun/jini/test/impl/mahalo/LeaseMapTest.td
     [java] Test Failed: Test Failed: com.sun.jini.qa.harness.TestException: Exception has
been caught in specifyServices: Problem creating service for net.jini.core.transaction.server.TransactionManager;
nested exception is: 
     [java] 	Failed to start the shared nonactivatable group; nested exception is: 
     [java] 	NonActivatableGroupAdmin: Failed to exec the group; nested exception is: 
     [java] 	null
     [java] 
     [java] -----------------------------------------
     [java] com/sun/jini/test/impl/mahalo/LeaseTest.td
     [java] Test Failed: Test Failed: com.sun.jini.qa.harness.TestException: Exception has
been caught in specifyServices: Problem creating service for net.jini.core.transaction.server.TransactionManager;
nested exception is: 
     [java] 	Failed to start the shared nonactivatable group; nested exception is: 
     [java] 	NonActivatableGroupAdmin: Failed to exec the group; nested exception is: 
     [java] 	null
     [java] 
     [java] -----------------------------------------
     [java] com/sun/jini/test/impl/mahalo/MahaloCreateShutdownTest.td
     [java] Test Passed: OK
     [java] 
     [java] -----------------------------------------
     [java] com/sun/jini/test/impl/mahalo/MahaloIFTest.td
     [java] Test Passed: OK
     [java] 
     [java] -----------------------------------------
     [java] com/sun/jini/test/impl/mahalo/MahaloImplReadyStateTest.td
     [java] Test Skipped: verifiers are: com.sun.jini.test.impl.mercury.ActivatableMercuryVerifier
com.sun.jini.qa.harness.SkipConfigTestVerifier
     [java] -----------------------------------------
     [java] com/sun/jini/test/impl/mahalo/NestableServerTransactionCreatedToStringTest.td
     [java] Test Passed: OK
     [java] 
     [java] -----------------------------------------
     [java] com/sun/jini/test/impl/mahalo/NestableTransactionCreatedToStringTest.td
     [java] Test Passed: OK
     [java] 
     [java] -----------------------------------------
     [java] com/sun/jini/test/impl/mahalo/PrepareAndCommitExceptionTest.td
     [java] Test Failed: Test Failed: com.sun.jini.qa.harness.TestException: Exception has
been caught in specifyServices: Problem creating service for net.jini.core.transaction.server.TransactionManager;
nested exception is: 
     [java] 	Failed to start the shared nonactivatable group; nested exception is: 
     [java] 	NonActivatableGroupAdmin: Failed to exec the group; nested exception is: 
     [java] 	null
     [java] 
     [java] -----------------------------------------
     [java] com/sun/jini/test/impl/mahalo/PrepareAndCommitExceptionTest2.td
     [java] Test Failed: Test Failed: com.sun.jini.qa.harness.TestException: Exception has
been caught in specifyServices: Problem creating service for net.jini.core.transaction.server.TransactionManager;
nested exception is: 
     [java] 	Failed to start the shared nonactivatable group; nested exception is: 
     [java] 	NonActivatableGroupAdmin: Failed to exec the group; nested exception is: 
     [java] 	null
     [java] 
     [java] -----------------------------------------
     [java] com/sun/jini/test/impl/mahalo/PrepareAndCommitExceptionTest3.td
     [java] Test Failed: Test Failed: com.sun.jini.qa.harness.TestException: Exception has
been caught in specifyServices: Problem creating service for net.jini.core.transaction.server.TransactionManager;
nested exception is: 
     [java] 	Failed to start the shared nonactivatable group; nested exception is: 
     [java] 	NonActivatableGroupAdmin: Failed to exec the group; nested exception is: 
     [java] 	null
     [java] 
     [java] -----------------------------------------
     [java] com/sun/jini/test/impl/mahalo/PrepareAndCommitExceptionTest4.td
     [java] Test Failed: Test Failed: com.sun.jini.qa.harness.TestException: Exception has
been caught in specifyServices: Problem creating service for net.jini.core.transaction.server.TransactionManager;
nested exception is: 
     [java] 	Failed to start the shared nonactivatable group; nested exception is: 
     [java] 	NonActivatableGroupAdmin: Failed to exec the group; nested exception is: 
     [java] 	null
     [java] 
     [java] -----------------------------------------
     [java] com/sun/jini/test/impl/mahalo/PrepareAndCommitExceptionTest5.td
     [java] Test Failed: Test Failed: com.sun.jini.qa.harness.TestException: Exception has
been caught in specifyServices: Problem creating service for net.jini.core.transaction.server.TransactionManager;
nested exception is: 
     [java] 	Failed to start the shared nonactivatable group; nested exception is: 
     [java] 	NonActivatableGroupAdmin: Failed to exec the group; nested exception is: 
     [java] 	null
     [java] 
     [java] -----------------------------------------
     [java] com/sun/jini/test/impl/mahalo/RandomStressTest.td
     [java] Test Failed: Test Failed: com.sun.jini.qa.harness.TestException: Exception has
been caught in specifyServices: Problem creating service for net.jini.core.transaction.server.TransactionManager;
nested exception is: 
     [java] 	Failed to start the shared nonactivatable group; nested exception is: 
     [java] 	NonActivatableGroupAdmin: Failed to exec the group; nested exception is: 
     [java] 	null
     [java] 
     [java] -----------------------------------------
     [java] com/sun/jini/test/impl/mahalo/ServerTransactionEqualityTest.td
     [java] Test Failed: Test Failed: com.sun.jini.qa.harness.TestException: Exception has
been caught in specifyServices: Problem creating service for net.jini.core.transaction.server.TransactionManager;
nested exception is: 
     [java] 	Failed to start the shared nonactivatable group; nested exception is: 
     [java] 	NonActivatableGroupAdmin: Failed to exec the group; nested exception is: 
     [java] 	null
     [java] 
     [java] -----------------------------------------
     [java] com/sun/jini/test/impl/mahalo/ServerTransactionToStringTest.td
     [java] Test Failed: Test Failed: com.sun.jini.qa.harness.TestException: Exception has
been caught in specifyServices: Problem creating service for net.jini.core.transaction.server.TransactionManager;
nested exception is: 
     [java] 	Failed to start the shared nonactivatable group; nested exception is: 
     [java] 	NonActivatableGroupAdmin: Failed to exec the group; nested exception is: 
     [java] 	null
     [java] 
     [java] -----------------------------------------
     [java] com/sun/jini/test/impl/mahalo/TransactionCreatedToStringTest.td
     [java] Test Passed: OK
     [java] 
     [java] -----------------------------------------
     [java] com/sun/jini/test/impl/mahalo/TransactionManagerCreatedToStringTest.td
     [java] Test Passed: OK
     [java] 
     [java] -----------------------------------------
     [java] com/sun/jini/test/impl/mahalo/TxnMgrImplNullActivationConfigEntries.td
     [java] Test Skipped: verifiers are: com.sun.jini.test.impl.mahalo.ActivatableMahaloVerifier
     [java] -----------------------------------------
     [java] com/sun/jini/test/impl/mahalo/TxnMgrImplNullConfigEntries.td
     [java] Test Failed: Test Failed: com.sun.jini.qa.harness.TestException: Service failed
due to non-configuration relatedexception.
     [java] 
     [java] -----------------------------------------
     [java] com/sun/jini/test/impl/mahalo/TxnMgrImplNullRecoveredLocators.td
     [java] Test Skipped: verifiers are: com.sun.jini.test.impl.mahalo.ActivatableMahaloVerifier
     [java] -----------------------------------------
     [java] com/sun/jini/test/impl/mahalo/TxnMgrProxyEqualityTest.td
     [java] Test Failed: Test Failed: com.sun.jini.qa.harness.TestException: Exception has
been caught in specifyServices: Problem creating service for net.jini.core.transaction.server.TransactionManager;
nested exception is: 
     [java] 	Failed to start the shared nonactivatable group; nested exception is: 
     [java] 	NonActivatableGroupAdmin: Failed to exec the group; nested exception is: 
     [java] 	null
     [java] 
     [java] -----------------------------------------
     [java] com/sun/jini/test/spec/txnmanager/AsynchAbortOnCommitTest.td
     [java] Test Failed: Test Failed: com.sun.jini.qa.harness.TestException: Exception has
been caught in specifyServices: Problem creating service for net.jini.core.transaction.server.TransactionManager;
nested exception is: 
     [java] 	Failed to start the shared nonactivatable group; nested exception is: 
     [java] 	NonActivatableGroupAdmin: Failed to exec the group; nested exception is: 
     [java] 	null
     [java] 
     [java] -----------------------------------------
     [java] com/sun/jini/test/spec/txnmanager/AsynchAbortOnPrepareTest.td
     [java] Test Failed: Test Failed: com.sun.jini.qa.harness.TestException: Exception has
been caught in specifyServices: Problem creating service for net.jini.core.transaction.server.TransactionManager;
nested exception is: 
     [java] 	Failed to start the shared nonactivatable group; nested exception is: 
     [java] 	NonActivatableGroupAdmin: Failed to exec the group; nested exception is: 
     [java] 	null
     [java] 
     [java] -----------------------------------------
     [java] com/sun/jini/test/spec/txnmanager/CommitExpiredTest.td
     [java] Test Failed: Test Failed: com.sun.jini.qa.harness.TestException: Exception has
been caught in specifyServices: Problem creating service for net.jini.core.transaction.server.TransactionManager;
nested exception is: 
     [java] 	Failed to start the shared nonactivatable group; nested exception is: 
     [java] 	NonActivatableGroupAdmin: Failed to exec the group; nested exception is: 
     [java] 	null
     [java] 
     [java] -----------------------------------------
     [java] com/sun/jini/test/spec/txnmanager/CommitTimeoutTest.td
     [java] Test Failed: Test Failed: com.sun.jini.qa.harness.TestException: Exception has
been caught in specifyServices: Problem creating service for net.jini.core.transaction.server.TransactionManager;
nested exception is: 
     [java] 	Failed to start the shared nonactivatable group; nested exception is: 
     [java] 	NonActivatableGroupAdmin: Failed to exec the group; nested exception is: 
     [java] 	null
     [java] 
     [java] -----------------------------------------
     [java] com/sun/jini/test/spec/txnmanager/GetStateTest.td
     [java] Test Failed: Test Failed: com.sun.jini.qa.harness.TestException: Exception has
been caught in specifyServices: Problem creating service for net.jini.core.transaction.server.TransactionManager;
nested exception is: 
     [java] 	Failed to start the shared nonactivatable group; nested exception is: 
     [java] 	NonActivatableGroupAdmin: Failed to exec the group; nested exception is: 
     [java] 	null
     [java] 
     [java] -----------------------------------------
     [java] com/sun/jini/test/spec/txnmanager/JoinIdempotentTest.td
     [java] Test Failed: Test Failed: com.sun.jini.qa.harness.TestException: Exception has
been caught in specifyServices: Problem creating service for net.jini.core.transaction.server.TransactionManager;
nested exception is: 
     [java] 	Failed to start the shared nonactivatable group; nested exception is: 
     [java] 	NonActivatableGroupAdmin: Failed to exec the group; nested exception is: 
     [java] 	null
     [java] 
     [java] -----------------------------------------
     [java] com/sun/jini/test/spec/txnmanager/JoinWhileActiveTest.td
     [java] Test Failed: Test Failed: com.sun.jini.qa.harness.TestException: Exception has
been caught in specifyServices: Problem creating service for net.jini.core.transaction.server.TransactionManager;
nested exception is: 
     [java] 	Failed to start the shared nonactivatable group; nested exception is: 
     [java] 	NonActivatableGroupAdmin: Failed to exec the group; nested exception is: 
     [java] 	null
     [java] 
     [java] -----------------------------------------
     [java] com/sun/jini/test/spec/txnmanager/ManyParticipantsTest.td
     [java] Test Failed: Test Failed: com.sun.jini.qa.harness.TestException: Exception has
been caught in specifyServices: Problem creating service for net.jini.core.transaction.server.TransactionManager;
nested exception is: 
     [java] 	Failed to start the shared nonactivatable group; nested exception is: 
     [java] 	NonActivatableGroupAdmin: Failed to exec the group; nested exception is: 
     [java] 	null
     [java] 
     [java] -----------------------------------------
     [java] com/sun/jini/test/spec/txnmanager/PrepareTimeoutTest.td
     [java] Test Failed: Test Failed: com.sun.jini.qa.harness.TestException: Exception has
been caught in specifyServices: Problem creating service for net.jini.core.transaction.server.TransactionManager;
nested exception is: 
     [java] 	Failed to start the shared nonactivatable group; nested exception is: 
     [java] 	NonActivatableGroupAdmin: Failed to exec the group; nested exception is: 
     [java] 	null
     [java] 
     [java] -----------------------------------------
     [java] com/sun/jini/test/spec/txnmanager/RollBackErrorTest.td
     [java] Test Failed: Test Failed: com.sun.jini.qa.harness.TestException: Exception has
been caught in specifyServices: Problem creating service for net.jini.core.transaction.server.TransactionManager;
nested exception is: 
     [java] 	Failed to start the shared nonactivatable group; nested exception is: 
     [java] 	NonActivatableGroupAdmin: Failed to exec the group; nested exception is: 
     [java] 	null
     [java] 
     [java] -----------------------------------------
     [java] com/sun/jini/test/spec/txnmanager/RollForwardErrorTest.td
     [java] Test Failed: Test Failed: com.sun.jini.qa.harness.TestException: Exception has
been caught in specifyServices: Problem creating service for net.jini.core.transaction.server.TransactionManager;
nested exception is: 
     [java] 	Failed to start the shared nonactivatable group; nested exception is: 
     [java] 	NonActivatableGroupAdmin: Failed to exec the group; nested exception is: 
     [java] 	null
     [java] 
     [java] -----------------------------------------
     [java] com/sun/jini/test/spec/txnmanager/TwoPhaseTest.td
     [java] Test Failed: Test Failed: com.sun.jini.qa.harness.TestException: Exception has
been caught in specifyServices: Problem creating service for net.jini.core.transaction.server.TransactionManager;
nested exception is: 
     [java] 	Failed to start the shared nonactivatable group; nested exception is: 
     [java] 	NonActivatableGroupAdmin: Failed to exec the group; nested exception is: 
     [java] 	null
     [java] 
     [java] -----------------------------------------
     [java] 
     [java] # of tests started   = 1406
     [java] # of tests completed = 1406
     [java] # of tests skipped   = 52
     [java] # of tests passed    = 643
     [java] # of tests failed    = 763
     [java] 
     [java] -----------------------------------------
     [java] 
     [java]    Date finished:
     [java]       Sun Nov 17 21:28:05 GMT 2013
     [java]    Time elapsed:
     [java]       13339 seconds
     [java] 
     [java] Java Result: 1

collect-result:
     [copy] Copying 1 file to <https://builds.apache.org/job/river-qa-refactor-win/ws/trunk\qa\result>
     [copy] Copying 1 file to <https://builds.apache.org/job/river-qa-refactor-win/ws/trunk\qa\result>
      [zip] Building zip: <https://builds.apache.org/job/river-qa-refactor-win/ws/trunk\qa\result\qaresults-amd64-Windows>
Server 2008-1.7.0.zip

BUILD FAILED
<https://builds.apache.org/job/river-qa-refactor-win/ws/trunk\build.xml>:2100: The following
error occurred while executing this line:
<https://builds.apache.org/job/river-qa-refactor-win/ws/trunk\qa\build.xml>:406: The
following error occurred while executing this line:
<https://builds.apache.org/job/river-qa-refactor-win/ws/trunk\qa\build.xml>:380: condition
satisfied

Total time: 231 minutes 53 seconds
Build step 'Invoke Ant' marked build as failure
Archiving artifacts

Mime
View raw message