river-dev mailing list archives

Site index · List index
Message view « Date » · « Thread »
Top « Date » · « Thread »
From Apache Jenkins Server <jenk...@builds.apache.org>
Subject Build failed in Jenkins: river-qa-refactor-jdk7 #98
Date Mon, 08 Jul 2013 13:27:37 GMT
See <https://builds.apache.org/job/river-qa-refactor-jdk7/98/changes>

Changes:

[peter_firmstone] Moved Starter from com.sun.jini.start and renamed it to org.apache.river.api.util.Commission,
to avoid issues with ClassLoader visibility and allow application to other purposes.

------------------------------------------
[...truncated 18107 lines...]
     [java] Test Failed: Test Failed: com.sun.jini.qa.harness.TestException: Exception has
been caught in specifyServices: Problem creating service for net.jini.core.transaction.server.TransactionManager;
nested exception is: 
     [java] 	Failed to start the shared nonactivatable group; nested exception is: 
     [java] 	NonActivatableGroupAdmin: Failed to exec the group; nested exception is: 
     [java] 	null
     [java] 
     [java] -----------------------------------------
     [java] com/sun/jini/test/impl/mahalo/LeaseExpireCancelTest.td
     [java] Test Failed: Test Failed: com.sun.jini.qa.harness.TestException: Exception has
been caught in specifyServices: Problem creating service for net.jini.core.transaction.server.TransactionManager;
nested exception is: 
     [java] 	Failed to start the shared nonactivatable group; nested exception is: 
     [java] 	NonActivatableGroupAdmin: Failed to exec the group; nested exception is: 
     [java] 	null
     [java] 
     [java] -----------------------------------------
     [java] com/sun/jini/test/impl/mahalo/LeaseExpireRenewTest.td
     [java] Test Failed: Test Failed: com.sun.jini.qa.harness.TestException: Exception has
been caught in specifyServices: Problem creating service for net.jini.core.transaction.server.TransactionManager;
nested exception is: 
     [java] 	Failed to start the shared nonactivatable group; nested exception is: 
     [java] 	NonActivatableGroupAdmin: Failed to exec the group; nested exception is: 
     [java] 	null
     [java] 
     [java] -----------------------------------------
     [java] com/sun/jini/test/impl/mahalo/LeaseMapTest.td
     [java] Test Failed: Test Failed: com.sun.jini.qa.harness.TestException: Exception has
been caught in specifyServices: Problem creating service for net.jini.core.transaction.server.TransactionManager;
nested exception is: 
     [java] 	Failed to start the shared nonactivatable group; nested exception is: 
     [java] 	NonActivatableGroupAdmin: Failed to exec the group; nested exception is: 
     [java] 	null
     [java] 
     [java] -----------------------------------------
     [java] com/sun/jini/test/impl/mahalo/LeaseTest.td
     [java] Test Failed: Test Failed: com.sun.jini.qa.harness.TestException: Exception has
been caught in specifyServices: Problem creating service for net.jini.core.transaction.server.TransactionManager;
nested exception is: 
     [java] 	Failed to start the shared nonactivatable group; nested exception is: 
     [java] 	NonActivatableGroupAdmin: Failed to exec the group; nested exception is: 
     [java] 	null
     [java] 
     [java] -----------------------------------------
     [java] com/sun/jini/test/impl/mahalo/MahaloCreateShutdownTest.td
     [java] Test Passed: OK
     [java] 
     [java] -----------------------------------------
     [java] com/sun/jini/test/impl/mahalo/MahaloIFTest.td
     [java] Test Passed: OK
     [java] 
     [java] -----------------------------------------
     [java] com/sun/jini/test/impl/mahalo/MahaloImplReadyStateTest.td
     [java] Test Skipped: verifiers are: com.sun.jini.test.impl.mercury.ActivatableMercuryVerifier
com.sun.jini.qa.harness.SkipConfigTestVerifier
     [java] -----------------------------------------
     [java] com/sun/jini/test/impl/mahalo/NestableServerTransactionCreatedToStringTest.td
     [java] Test Passed: OK
     [java] 
     [java] -----------------------------------------
     [java] com/sun/jini/test/impl/mahalo/NestableTransactionCreatedToStringTest.td
     [java] Test Passed: OK
     [java] 
     [java] -----------------------------------------
     [java] com/sun/jini/test/impl/mahalo/PrepareAndCommitExceptionTest.td
     [java] Test Failed: Test Failed: com.sun.jini.qa.harness.TestException: Exception has
been caught in specifyServices: Problem creating service for net.jini.core.transaction.server.TransactionManager;
nested exception is: 
     [java] 	Failed to start the shared nonactivatable group; nested exception is: 
     [java] 	NonActivatableGroupAdmin: Failed to exec the group; nested exception is: 
     [java] 	null
     [java] 
     [java] -----------------------------------------
     [java] com/sun/jini/test/impl/mahalo/PrepareAndCommitExceptionTest2.td
     [java] Test Failed: Test Failed: com.sun.jini.qa.harness.TestException: Exception has
been caught in specifyServices: Problem creating service for net.jini.core.transaction.server.TransactionManager;
nested exception is: 
     [java] 	Failed to start the shared nonactivatable group; nested exception is: 
     [java] 	NonActivatableGroupAdmin: Failed to exec the group; nested exception is: 
     [java] 	null
     [java] 
     [java] -----------------------------------------
     [java] com/sun/jini/test/impl/mahalo/PrepareAndCommitExceptionTest3.td
     [java] Test Failed: Test Failed: com.sun.jini.qa.harness.TestException: Exception has
been caught in specifyServices: Problem creating service for net.jini.core.transaction.server.TransactionManager;
nested exception is: 
     [java] 	Failed to start the shared nonactivatable group; nested exception is: 
     [java] 	NonActivatableGroupAdmin: Failed to exec the group; nested exception is: 
     [java] 	null
     [java] 
     [java] -----------------------------------------
     [java] com/sun/jini/test/impl/mahalo/PrepareAndCommitExceptionTest4.td
     [java] Test Failed: Test Failed: com.sun.jini.qa.harness.TestException: Exception has
been caught in specifyServices: Problem creating service for net.jini.core.transaction.server.TransactionManager;
nested exception is: 
     [java] 	Failed to start the shared nonactivatable group; nested exception is: 
     [java] 	NonActivatableGroupAdmin: Failed to exec the group; nested exception is: 
     [java] 	null
     [java] 
     [java] -----------------------------------------
     [java] com/sun/jini/test/impl/mahalo/PrepareAndCommitExceptionTest5.td
     [java] Test Failed: Test Failed: com.sun.jini.qa.harness.TestException: Exception has
been caught in specifyServices: Problem creating service for net.jini.core.transaction.server.TransactionManager;
nested exception is: 
     [java] 	Failed to start the shared nonactivatable group; nested exception is: 
     [java] 	NonActivatableGroupAdmin: Failed to exec the group; nested exception is: 
     [java] 	null
     [java] 
     [java] -----------------------------------------
     [java] com/sun/jini/test/impl/mahalo/RandomStressTest.td
     [java] Test Failed: Test Failed: com.sun.jini.qa.harness.TestException: Exception has
been caught in specifyServices: Problem creating service for net.jini.core.transaction.server.TransactionManager;
nested exception is: 
     [java] 	Failed to start the shared nonactivatable group; nested exception is: 
     [java] 	NonActivatableGroupAdmin: Failed to exec the group; nested exception is: 
     [java] 	null
     [java] 
     [java] -----------------------------------------
     [java] com/sun/jini/test/impl/mahalo/ServerTransactionEqualityTest.td
     [java] Test Failed: Test Failed: com.sun.jini.qa.harness.TestException: Exception has
been caught in specifyServices: Problem creating service for net.jini.core.transaction.server.TransactionManager;
nested exception is: 
     [java] 	Failed to start the shared nonactivatable group; nested exception is: 
     [java] 	NonActivatableGroupAdmin: Failed to exec the group; nested exception is: 
     [java] 	null
     [java] 
     [java] -----------------------------------------
     [java] com/sun/jini/test/impl/mahalo/ServerTransactionToStringTest.td
     [java] Test Failed: Test Failed: com.sun.jini.qa.harness.TestException: Exception has
been caught in specifyServices: Problem creating service for net.jini.core.transaction.server.TransactionManager;
nested exception is: 
     [java] 	Failed to start the shared nonactivatable group; nested exception is: 
     [java] 	NonActivatableGroupAdmin: Failed to exec the group; nested exception is: 
     [java] 	null
     [java] 
     [java] -----------------------------------------
     [java] com/sun/jini/test/impl/mahalo/TransactionCreatedToStringTest.td
     [java] Test Passed: OK
     [java] 
     [java] -----------------------------------------
     [java] com/sun/jini/test/impl/mahalo/TransactionManagerCreatedToStringTest.td
     [java] Test Passed: OK
     [java] 
     [java] -----------------------------------------
     [java] com/sun/jini/test/impl/mahalo/TxnMgrImplNullActivationConfigEntries.td
     [java] Test Skipped: verifiers are: com.sun.jini.test.impl.mahalo.ActivatableMahaloVerifier
     [java] -----------------------------------------
     [java] com/sun/jini/test/impl/mahalo/TxnMgrImplNullConfigEntries.td
     [java] Test Failed: Test Failed: com.sun.jini.qa.harness.TestException: Service failed
due to non-configuration relatedexception.
     [java] 
     [java] -----------------------------------------
     [java] com/sun/jini/test/impl/mahalo/TxnMgrImplNullRecoveredLocators.td
     [java] Test Skipped: verifiers are: com.sun.jini.test.impl.mahalo.ActivatableMahaloVerifier
     [java] -----------------------------------------
     [java] com/sun/jini/test/impl/mahalo/TxnMgrProxyEqualityTest.td
     [java] Test Failed: Test Failed: com.sun.jini.qa.harness.TestException: Exception has
been caught in specifyServices: Problem creating service for net.jini.core.transaction.server.TransactionManager;
nested exception is: 
     [java] 	Failed to start the shared nonactivatable group; nested exception is: 
     [java] 	NonActivatableGroupAdmin: Failed to exec the group; nested exception is: 
     [java] 	null
     [java] 
     [java] -----------------------------------------
     [java] com/sun/jini/test/spec/txnmanager/AsynchAbortOnCommitTest.td
     [java] Test Failed: Test Failed: com.sun.jini.qa.harness.TestException: Exception has
been caught in specifyServices: Problem creating service for net.jini.core.transaction.server.TransactionManager;
nested exception is: 
     [java] 	Failed to start the shared nonactivatable group; nested exception is: 
     [java] 	NonActivatableGroupAdmin: Failed to exec the group; nested exception is: 
     [java] 	null
     [java] 
     [java] -----------------------------------------
     [java] com/sun/jini/test/spec/txnmanager/AsynchAbortOnPrepareTest.td
     [java] Test Failed: Test Failed: com.sun.jini.qa.harness.TestException: Exception has
been caught in specifyServices: Problem creating service for net.jini.core.transaction.server.TransactionManager;
nested exception is: 
     [java] 	Failed to start the shared nonactivatable group; nested exception is: 
     [java] 	NonActivatableGroupAdmin: Failed to exec the group; nested exception is: 
     [java] 	null
     [java] 
     [java] -----------------------------------------
     [java] com/sun/jini/test/spec/txnmanager/CommitExpiredTest.td
     [java] Test Failed: Test Failed: com.sun.jini.qa.harness.TestException: Exception has
been caught in specifyServices: Problem creating service for net.jini.core.transaction.server.TransactionManager;
nested exception is: 
     [java] 	Failed to start the shared nonactivatable group; nested exception is: 
     [java] 	NonActivatableGroupAdmin: Failed to exec the group; nested exception is: 
     [java] 	null
     [java] 
     [java] -----------------------------------------
     [java] com/sun/jini/test/spec/txnmanager/CommitTimeoutTest.td
     [java] Test Failed: Test Failed: com.sun.jini.qa.harness.TestException: Exception has
been caught in specifyServices: Problem creating service for net.jini.core.transaction.server.TransactionManager;
nested exception is: 
     [java] 	Failed to start the shared nonactivatable group; nested exception is: 
     [java] 	NonActivatableGroupAdmin: Failed to exec the group; nested exception is: 
     [java] 	null
     [java] 
     [java] -----------------------------------------
     [java] com/sun/jini/test/spec/txnmanager/GetStateTest.td
     [java] Test Failed: Test Failed: com.sun.jini.qa.harness.TestException: Exception has
been caught in specifyServices: Problem creating service for net.jini.core.transaction.server.TransactionManager;
nested exception is: 
     [java] 	Failed to start the shared nonactivatable group; nested exception is: 
     [java] 	NonActivatableGroupAdmin: Failed to exec the group; nested exception is: 
     [java] 	null
     [java] 
     [java] -----------------------------------------
     [java] com/sun/jini/test/spec/txnmanager/JoinIdempotentTest.td
     [java] Test Failed: Test Failed: com.sun.jini.qa.harness.TestException: Exception has
been caught in specifyServices: Problem creating service for net.jini.core.transaction.server.TransactionManager;
nested exception is: 
     [java] 	Failed to start the shared nonactivatable group; nested exception is: 
     [java] 	NonActivatableGroupAdmin: Failed to exec the group; nested exception is: 
     [java] 	null
     [java] 
     [java] -----------------------------------------
     [java] com/sun/jini/test/spec/txnmanager/JoinWhileActiveTest.td
     [java] Test Failed: Test Failed: com.sun.jini.qa.harness.TestException: Exception has
been caught in specifyServices: Problem creating service for net.jini.core.transaction.server.TransactionManager;
nested exception is: 
     [java] 	Failed to start the shared nonactivatable group; nested exception is: 
     [java] 	NonActivatableGroupAdmin: Failed to exec the group; nested exception is: 
     [java] 	null
     [java] 
     [java] -----------------------------------------
     [java] com/sun/jini/test/spec/txnmanager/ManyParticipantsTest.td
     [java] Test Failed: Test Failed: com.sun.jini.qa.harness.TestException: Exception has
been caught in specifyServices: Problem creating service for net.jini.core.transaction.server.TransactionManager;
nested exception is: 
     [java] 	Failed to start the shared nonactivatable group; nested exception is: 
     [java] 	NonActivatableGroupAdmin: Failed to exec the group; nested exception is: 
     [java] 	null
     [java] 
     [java] -----------------------------------------
     [java] com/sun/jini/test/spec/txnmanager/PrepareTimeoutTest.td
     [java] Test Failed: Test Failed: com.sun.jini.qa.harness.TestException: Exception has
been caught in specifyServices: Problem creating service for net.jini.core.transaction.server.TransactionManager;
nested exception is: 
     [java] 	Failed to start the shared nonactivatable group; nested exception is: 
     [java] 	NonActivatableGroupAdmin: Failed to exec the group; nested exception is: 
     [java] 	null
     [java] 
     [java] -----------------------------------------
     [java] com/sun/jini/test/spec/txnmanager/RollBackErrorTest.td
     [java] Test Failed: Test Failed: com.sun.jini.qa.harness.TestException: Exception has
been caught in specifyServices: Problem creating service for net.jini.core.transaction.server.TransactionManager;
nested exception is: 
     [java] 	Failed to start the shared nonactivatable group; nested exception is: 
     [java] 	NonActivatableGroupAdmin: Failed to exec the group; nested exception is: 
     [java] 	null
     [java] 
     [java] -----------------------------------------
     [java] com/sun/jini/test/spec/txnmanager/RollForwardErrorTest.td
     [java] Test Failed: Test Failed: com.sun.jini.qa.harness.TestException: Exception has
been caught in specifyServices: Problem creating service for net.jini.core.transaction.server.TransactionManager;
nested exception is: 
     [java] 	Failed to start the shared nonactivatable group; nested exception is: 
     [java] 	NonActivatableGroupAdmin: Failed to exec the group; nested exception is: 
     [java] 	null
     [java] 
     [java] -----------------------------------------
     [java] com/sun/jini/test/spec/txnmanager/TwoPhaseTest.td
     [java] Test Failed: Test Failed: com.sun.jini.qa.harness.TestException: Exception has
been caught in specifyServices: Problem creating service for net.jini.core.transaction.server.TransactionManager;
nested exception is: 
     [java] 	Failed to start the shared nonactivatable group; nested exception is: 
     [java] 	NonActivatableGroupAdmin: Failed to exec the group; nested exception is: 
     [java] 	null
     [java] 
     [java] -----------------------------------------
     [java] 
     [java] # of tests started   = 1405
     [java] # of tests completed = 1405
     [java] # of tests skipped   = 53
     [java] # of tests passed    = 643
     [java] # of tests failed    = 762
     [java] 
     [java] -----------------------------------------
     [java] 
     [java]    Date finished:
     [java]       Mon Jul 08 13:27:33 UTC 2013
     [java]    Time elapsed:
     [java]       12427 seconds
     [java] 
     [java] Java Result: 1

collect-result:
     [copy] Copying 1 file to /home/hudson/jenkins-slave/workspace/river-qa-refactor-jdk7/trunk/qa/result
     [copy] Copying 1 file to /home/hudson/jenkins-slave/workspace/river-qa-refactor-jdk7/trunk/qa/result
      [zip] Building zip: /home/hudson/jenkins-slave/workspace/river-qa-refactor-jdk7/trunk/qa/result/qaresults-amd64-Linux-1.7.0_04.zip

BUILD FAILED
/home/hudson/jenkins-slave/workspace/river-qa-refactor-jdk7/trunk/build.xml:2100: The following
error occurred while executing this line:
/home/hudson/jenkins-slave/workspace/river-qa-refactor-jdk7/trunk/qa/build.xml:406: The following
error occurred while executing this line:
/home/hudson/jenkins-slave/workspace/river-qa-refactor-jdk7/trunk/qa/build.xml:380: condition
satisfied

Total time: 213 minutes 3 seconds
Build step 'Invoke Ant' marked build as failure
[locks-and-latches] Releasing all the locks
[locks-and-latches] All the locks released
Archiving artifacts

Mime
View raw message