river-dev mailing list archives

Site index · List index
Message view « Date » · « Thread »
Top « Date » · « Thread »
From Apache Jenkins Server <jenk...@builds.apache.org>
Subject Build failed in Jenkins: river-qa-refactoring #79
Date Tue, 07 May 2013 05:40:07 GMT
See <https://builds.apache.org/job/river-qa-refactoring/79/changes>

Changes:

[peter_firmstone] Ensured that Distributed object's are constructed using privileges equivalent
to CodeSource(null, null), very minimal to avoid the ability to prevent remote processes from
creating privileged objects.
See SerialReflectionFactory.

Updated UriTest

Ensured visibility of test fields by changing to final or volatile.

Changed LookupDropProxyTaskRace test so it isn't run by default, it must be run manually.

------------------------------------------
[...truncated 18188 lines...]
     [java] -----------------------------------------
     [java] com/sun/jini/test/impl/mahalo/AdminIFTest.td
     [java] Test Failed: Test Failed: com.sun.jini.qa.harness.TestException: Exception has
been caught in specifyServices: Problem creating service for net.jini.core.transaction.server.TransactionManager;
nested exception is: 
     [java] 	RemoteException occurred in server thread; nested exception is: 
     [java] 	java.rmi.RemoteException: Create failed; nested exception is: 
     [java] 	java.lang.ClassNotFoundException: com.sun.jini.mahalo.TxnMgrProxy$ConstrainableTxnMgrProxy
     [java] 
     [java] -----------------------------------------
     [java] com/sun/jini/test/impl/mahalo/LeaseExpireCancelTest.td
     [java] Test Failed: Test Failed: com.sun.jini.qa.harness.TestException: Exception has
been caught in specifyServices: Problem creating service for net.jini.core.transaction.server.TransactionManager;
nested exception is: 
     [java] 	RemoteException occurred in server thread; nested exception is: 
     [java] 	java.rmi.RemoteException: Create failed; nested exception is: 
     [java] 	java.lang.ClassNotFoundException: com.sun.jini.mahalo.TxnMgrProxy$ConstrainableTxnMgrProxy
     [java] 
     [java] -----------------------------------------
     [java] com/sun/jini/test/impl/mahalo/LeaseExpireRenewTest.td
     [java] Test Failed: Test Failed: com.sun.jini.qa.harness.TestException: Exception has
been caught in specifyServices: Problem creating service for net.jini.core.transaction.server.TransactionManager;
nested exception is: 
     [java] 	RemoteException occurred in server thread; nested exception is: 
     [java] 	java.rmi.RemoteException: Create failed; nested exception is: 
     [java] 	java.lang.ClassNotFoundException: com.sun.jini.mahalo.TxnMgrProxy$ConstrainableTxnMgrProxy
     [java] 
     [java] -----------------------------------------
     [java] com/sun/jini/test/impl/mahalo/LeaseMapTest.td
     [java] Test Failed: Test Failed: com.sun.jini.qa.harness.TestException: Exception has
been caught in specifyServices: Problem creating service for net.jini.core.transaction.server.TransactionManager;
nested exception is: 
     [java] 	RemoteException occurred in server thread; nested exception is: 
     [java] 	java.rmi.RemoteException: Create failed; nested exception is: 
     [java] 	java.lang.ClassNotFoundException: com.sun.jini.mahalo.TxnMgrProxy$ConstrainableTxnMgrProxy
     [java] 
     [java] -----------------------------------------
     [java] com/sun/jini/test/impl/mahalo/LeaseTest.td
     [java] Test Failed: Test Failed: com.sun.jini.qa.harness.TestException: Exception has
been caught in specifyServices: Problem creating service for net.jini.core.transaction.server.TransactionManager;
nested exception is: 
     [java] 	RemoteException occurred in server thread; nested exception is: 
     [java] 	java.rmi.RemoteException: Create failed; nested exception is: 
     [java] 	java.lang.ClassNotFoundException: com.sun.jini.mahalo.TxnMgrProxy$ConstrainableTxnMgrProxy
     [java] 
     [java] -----------------------------------------
     [java] com/sun/jini/test/impl/mahalo/MahaloCreateShutdownTest.td
     [java] Test Passed: OK
     [java] 
     [java] -----------------------------------------
     [java] com/sun/jini/test/impl/mahalo/MahaloIFTest.td
     [java] Test Passed: OK
     [java] 
     [java] -----------------------------------------
     [java] com/sun/jini/test/impl/mahalo/MahaloImplReadyStateTest.td
     [java] Test Skipped: verifiers are: com.sun.jini.test.impl.mercury.ActivatableMercuryVerifier
com.sun.jini.qa.harness.SkipConfigTestVerifier
     [java] -----------------------------------------
     [java] com/sun/jini/test/impl/mahalo/NestableServerTransactionCreatedToStringTest.td
     [java] Test Passed: OK
     [java] 
     [java] -----------------------------------------
     [java] com/sun/jini/test/impl/mahalo/NestableTransactionCreatedToStringTest.td
     [java] Test Passed: OK
     [java] 
     [java] -----------------------------------------
     [java] com/sun/jini/test/impl/mahalo/PrepareAndCommitExceptionTest.td
     [java] Test Failed: Test Failed: com.sun.jini.qa.harness.TestException: Exception has
been caught in specifyServices: Problem creating service for net.jini.core.transaction.server.TransactionManager;
nested exception is: 
     [java] 	RemoteException occurred in server thread; nested exception is: 
     [java] 	java.rmi.RemoteException: Create failed; nested exception is: 
     [java] 	java.lang.ClassNotFoundException: com.sun.jini.mahalo.TxnMgrProxy$ConstrainableTxnMgrProxy
     [java] 
     [java] -----------------------------------------
     [java] com/sun/jini/test/impl/mahalo/PrepareAndCommitExceptionTest2.td
     [java] Test Failed: Test Failed: com.sun.jini.qa.harness.TestException: Exception has
been caught in specifyServices: Problem creating service for net.jini.core.transaction.server.TransactionManager;
nested exception is: 
     [java] 	RemoteException occurred in server thread; nested exception is: 
     [java] 	java.rmi.RemoteException: Create failed; nested exception is: 
     [java] 	java.lang.ClassNotFoundException: com.sun.jini.mahalo.TxnMgrProxy$ConstrainableTxnMgrProxy
     [java] 
     [java] -----------------------------------------
     [java] com/sun/jini/test/impl/mahalo/PrepareAndCommitExceptionTest3.td
     [java] Test Failed: Test Failed: com.sun.jini.qa.harness.TestException: Exception has
been caught in specifyServices: Problem creating service for net.jini.core.transaction.server.TransactionManager;
nested exception is: 
     [java] 	RemoteException occurred in server thread; nested exception is: 
     [java] 	java.rmi.RemoteException: Create failed; nested exception is: 
     [java] 	java.lang.ClassNotFoundException: com.sun.jini.mahalo.TxnMgrProxy$ConstrainableTxnMgrProxy
     [java] 
     [java] -----------------------------------------
     [java] com/sun/jini/test/impl/mahalo/PrepareAndCommitExceptionTest4.td
     [java] Test Failed: Test Failed: com.sun.jini.qa.harness.TestException: Exception has
been caught in specifyServices: Problem creating service for net.jini.core.transaction.server.TransactionManager;
nested exception is: 
     [java] 	RemoteException occurred in server thread; nested exception is: 
     [java] 	java.rmi.RemoteException: Create failed; nested exception is: 
     [java] 	java.lang.ClassNotFoundException: com.sun.jini.mahalo.TxnMgrProxy$ConstrainableTxnMgrProxy
     [java] 
     [java] -----------------------------------------
     [java] com/sun/jini/test/impl/mahalo/PrepareAndCommitExceptionTest5.td
     [java] Test Failed: Test Failed: com.sun.jini.qa.harness.TestException: Exception has
been caught in specifyServices: Problem creating service for net.jini.core.transaction.server.TransactionManager;
nested exception is: 
     [java] 	RemoteException occurred in server thread; nested exception is: 
     [java] 	java.rmi.RemoteException: Create failed; nested exception is: 
     [java] 	java.lang.ClassNotFoundException: com.sun.jini.mahalo.TxnMgrProxy$ConstrainableTxnMgrProxy
     [java] 
     [java] -----------------------------------------
     [java] com/sun/jini/test/impl/mahalo/RandomStressTest.td
     [java] Test Failed: Test Failed: com.sun.jini.qa.harness.TestException: Exception has
been caught in specifyServices: Problem creating service for net.jini.core.transaction.server.TransactionManager;
nested exception is: 
     [java] 	RemoteException occurred in server thread; nested exception is: 
     [java] 	java.rmi.RemoteException: Create failed; nested exception is: 
     [java] 	java.lang.ClassNotFoundException: com.sun.jini.mahalo.TxnMgrProxy$ConstrainableTxnMgrProxy
     [java] 
     [java] -----------------------------------------
     [java] com/sun/jini/test/impl/mahalo/ServerTransactionEqualityTest.td
     [java] Test Failed: Test Failed: com.sun.jini.qa.harness.TestException: Exception has
been caught in specifyServices: Problem creating service for net.jini.core.transaction.server.TransactionManager;
nested exception is: 
     [java] 	RemoteException occurred in server thread; nested exception is: 
     [java] 	java.rmi.RemoteException: Create failed; nested exception is: 
     [java] 	java.lang.ClassNotFoundException: com.sun.jini.mahalo.TxnMgrProxy$ConstrainableTxnMgrProxy
     [java] 
     [java] -----------------------------------------
     [java] com/sun/jini/test/impl/mahalo/ServerTransactionToStringTest.td
     [java] Test Failed: Test Failed: com.sun.jini.qa.harness.TestException: Exception has
been caught in specifyServices: Problem creating service for net.jini.core.transaction.server.TransactionManager;
nested exception is: 
     [java] 	RemoteException occurred in server thread; nested exception is: 
     [java] 	java.rmi.RemoteException: Create failed; nested exception is: 
     [java] 	java.lang.ClassNotFoundException: com.sun.jini.mahalo.TxnMgrProxy$ConstrainableTxnMgrProxy
     [java] 
     [java] -----------------------------------------
     [java] com/sun/jini/test/impl/mahalo/TransactionCreatedToStringTest.td
     [java] Test Passed: OK
     [java] 
     [java] -----------------------------------------
     [java] com/sun/jini/test/impl/mahalo/TransactionManagerCreatedToStringTest.td
     [java] Test Passed: OK
     [java] 
     [java] -----------------------------------------
     [java] com/sun/jini/test/impl/mahalo/TxnMgrImplNullActivationConfigEntries.td
     [java] Test Skipped: verifiers are: com.sun.jini.test.impl.mahalo.ActivatableMahaloVerifier
     [java] -----------------------------------------
     [java] com/sun/jini/test/impl/mahalo/TxnMgrImplNullConfigEntries.td
     [java] Test Passed: OK
     [java] 
     [java] -----------------------------------------
     [java] com/sun/jini/test/impl/mahalo/TxnMgrImplNullRecoveredLocators.td
     [java] Test Skipped: verifiers are: com.sun.jini.test.impl.mahalo.ActivatableMahaloVerifier
     [java] -----------------------------------------
     [java] com/sun/jini/test/impl/mahalo/TxnMgrProxyEqualityTest.td
     [java] Test Failed: Test Failed: com.sun.jini.qa.harness.TestException: Exception has
been caught in specifyServices: Problem creating service for net.jini.core.transaction.server.TransactionManager;
nested exception is: 
     [java] 	RemoteException occurred in server thread; nested exception is: 
     [java] 	java.rmi.RemoteException: Create failed; nested exception is: 
     [java] 	java.lang.ClassNotFoundException: com.sun.jini.mahalo.TxnMgrProxy$ConstrainableTxnMgrProxy
     [java] 
     [java] -----------------------------------------
     [java] com/sun/jini/test/spec/txnmanager/AsynchAbortOnCommitTest.td
     [java] Test Failed: Test Failed: com.sun.jini.qa.harness.TestException: Exception has
been caught in specifyServices: Problem creating service for net.jini.core.transaction.server.TransactionManager;
nested exception is: 
     [java] 	RemoteException occurred in server thread; nested exception is: 
     [java] 	java.rmi.RemoteException: Create failed; nested exception is: 
     [java] 	java.lang.ClassNotFoundException: com.sun.jini.mahalo.TxnMgrProxy$ConstrainableTxnMgrProxy
     [java] 
     [java] -----------------------------------------
     [java] com/sun/jini/test/spec/txnmanager/AsynchAbortOnPrepareTest.td
     [java] Test Failed: Test Failed: com.sun.jini.qa.harness.TestException: Exception has
been caught in specifyServices: Problem creating service for net.jini.core.transaction.server.TransactionManager;
nested exception is: 
     [java] 	RemoteException occurred in server thread; nested exception is: 
     [java] 	java.rmi.RemoteException: Create failed; nested exception is: 
     [java] 	java.lang.ClassNotFoundException: com.sun.jini.mahalo.TxnMgrProxy$ConstrainableTxnMgrProxy
     [java] 
     [java] -----------------------------------------
     [java] com/sun/jini/test/spec/txnmanager/CommitExpiredTest.td
     [java] Test Failed: Test Failed: com.sun.jini.qa.harness.TestException: Exception has
been caught in specifyServices: Problem creating service for net.jini.core.transaction.server.TransactionManager;
nested exception is: 
     [java] 	RemoteException occurred in server thread; nested exception is: 
     [java] 	java.rmi.RemoteException: Create failed; nested exception is: 
     [java] 	java.lang.ClassNotFoundException: com.sun.jini.mahalo.TxnMgrProxy$ConstrainableTxnMgrProxy
     [java] 
     [java] -----------------------------------------
     [java] com/sun/jini/test/spec/txnmanager/CommitTimeoutTest.td
     [java] Test Failed: Test Failed: com.sun.jini.qa.harness.TestException: Exception has
been caught in specifyServices: Problem creating service for net.jini.core.transaction.server.TransactionManager;
nested exception is: 
     [java] 	RemoteException occurred in server thread; nested exception is: 
     [java] 	java.rmi.RemoteException: Create failed; nested exception is: 
     [java] 	java.lang.ClassNotFoundException: com.sun.jini.mahalo.TxnMgrProxy$ConstrainableTxnMgrProxy
     [java] 
     [java] -----------------------------------------
     [java] com/sun/jini/test/spec/txnmanager/GetStateTest.td
     [java] Test Failed: Test Failed: com.sun.jini.qa.harness.TestException: Exception has
been caught in specifyServices: Problem creating service for net.jini.core.transaction.server.TransactionManager;
nested exception is: 
     [java] 	RemoteException occurred in server thread; nested exception is: 
     [java] 	java.rmi.RemoteException: Create failed; nested exception is: 
     [java] 	java.lang.ClassNotFoundException: com.sun.jini.mahalo.TxnMgrProxy$ConstrainableTxnMgrProxy
     [java] 
     [java] -----------------------------------------
     [java] com/sun/jini/test/spec/txnmanager/JoinIdempotentTest.td
     [java] Test Failed: Test Failed: com.sun.jini.qa.harness.TestException: Exception has
been caught in specifyServices: Problem creating service for net.jini.core.transaction.server.TransactionManager;
nested exception is: 
     [java] 	RemoteException occurred in server thread; nested exception is: 
     [java] 	java.rmi.RemoteException: Create failed; nested exception is: 
     [java] 	java.lang.ClassNotFoundException: com.sun.jini.mahalo.TxnMgrProxy$ConstrainableTxnMgrProxy
     [java] 
     [java] -----------------------------------------
     [java] com/sun/jini/test/spec/txnmanager/JoinWhileActiveTest.td
     [java] Test Failed: Test Failed: com.sun.jini.qa.harness.TestException: Exception has
been caught in specifyServices: Problem creating service for net.jini.core.transaction.server.TransactionManager;
nested exception is: 
     [java] 	RemoteException occurred in server thread; nested exception is: 
     [java] 	java.rmi.RemoteException: Create failed; nested exception is: 
     [java] 	java.lang.ClassNotFoundException: com.sun.jini.mahalo.TxnMgrProxy$ConstrainableTxnMgrProxy
     [java] 
     [java] -----------------------------------------
     [java] com/sun/jini/test/spec/txnmanager/ManyParticipantsTest.td
     [java] Test Failed: Test Failed: com.sun.jini.qa.harness.TestException: Exception has
been caught in specifyServices: Problem creating service for net.jini.core.transaction.server.TransactionManager;
nested exception is: 
     [java] 	RemoteException occurred in server thread; nested exception is: 
     [java] 	java.rmi.RemoteException: Create failed; nested exception is: 
     [java] 	java.lang.ClassNotFoundException: com.sun.jini.mahalo.TxnMgrProxy$ConstrainableTxnMgrProxy
     [java] 
     [java] -----------------------------------------
     [java] com/sun/jini/test/spec/txnmanager/PrepareTimeoutTest.td
     [java] Test Failed: Test Failed: com.sun.jini.qa.harness.TestException: Exception has
been caught in specifyServices: Problem creating service for net.jini.core.transaction.server.TransactionManager;
nested exception is: 
     [java] 	RemoteException occurred in server thread; nested exception is: 
     [java] 	java.rmi.RemoteException: Create failed; nested exception is: 
     [java] 	java.lang.ClassNotFoundException: com.sun.jini.mahalo.TxnMgrProxy$ConstrainableTxnMgrProxy
     [java] 
     [java] -----------------------------------------
     [java] com/sun/jini/test/spec/txnmanager/RollBackErrorTest.td
     [java] Test Failed: Test Failed: com.sun.jini.qa.harness.TestException: Exception has
been caught in specifyServices: Problem creating service for net.jini.core.transaction.server.TransactionManager;
nested exception is: 
     [java] 	RemoteException occurred in server thread; nested exception is: 
     [java] 	java.rmi.RemoteException: Create failed; nested exception is: 
     [java] 	java.lang.ClassNotFoundException: com.sun.jini.mahalo.TxnMgrProxy$ConstrainableTxnMgrProxy
     [java] 
     [java] -----------------------------------------
     [java] com/sun/jini/test/spec/txnmanager/RollForwardErrorTest.td
     [java] Test Failed: Test Failed: com.sun.jini.qa.harness.TestException: Exception has
been caught in specifyServices: Problem creating service for net.jini.core.transaction.server.TransactionManager;
nested exception is: 
     [java] 	RemoteException occurred in server thread; nested exception is: 
     [java] 	java.rmi.RemoteException: Create failed; nested exception is: 
     [java] 	java.lang.ClassNotFoundException: com.sun.jini.mahalo.TxnMgrProxy$ConstrainableTxnMgrProxy
     [java] 
     [java] -----------------------------------------
     [java] com/sun/jini/test/spec/txnmanager/TwoPhaseTest.td
     [java] Test Failed: Test Failed: com.sun.jini.qa.harness.TestException: Exception has
been caught in specifyServices: Problem creating service for net.jini.core.transaction.server.TransactionManager;
nested exception is: 
     [java] 	RemoteException occurred in server thread; nested exception is: 
     [java] 	java.rmi.RemoteException: Create failed; nested exception is: 
     [java] 	java.lang.ClassNotFoundException: com.sun.jini.mahalo.TxnMgrProxy$ConstrainableTxnMgrProxy
     [java] 
     [java] -----------------------------------------
     [java] 
     [java] # of tests started   = 1405
     [java] # of tests completed = 1405
     [java] # of tests skipped   = 53
     [java] # of tests passed    = 602
     [java] # of tests failed    = 803
     [java] 
     [java] -----------------------------------------
     [java] 
     [java]    Date finished:
     [java]       Tue May 07 05:39:59 UTC 2013
     [java]    Time elapsed:
     [java]       15031 seconds
     [java] 
     [java] Java Result: 1

collect-result:
     [copy] Copying 1 file to <https://builds.apache.org/job/river-qa-refactoring/ws/trunk/qa/result>
     [copy] Copying 1 file to <https://builds.apache.org/job/river-qa-refactoring/ws/trunk/qa/result>
      [zip] Building zip: <https://builds.apache.org/job/river-qa-refactoring/79/artifact/trunk/qa/result/qaresults-i386-Linux-1.6.0_45.zip>

BUILD FAILED
<https://builds.apache.org/job/river-qa-refactoring/ws/trunk/build.xml>:2098: The following
error occurred while executing this line:
<https://builds.apache.org/job/river-qa-refactoring/ws/trunk/qa/build.xml>:406: The
following error occurred while executing this line:
<https://builds.apache.org/job/river-qa-refactoring/ws/trunk/qa/build.xml>:380: condition
satisfied

Total time: 254 minutes 50 seconds
Build step 'Invoke Ant' marked build as failure
Archiving artifacts

Mime
View raw message