river-dev mailing list archives

Site index · List index
Message view « Date » · « Thread »
Top « Date » · « Thread »
From Peter Firmstone <j...@zeus.net.au>
Subject jtreg test results
Date Mon, 01 Apr 2013 05:41:07 GMT
The usual test failures due to missing Kerberos server, the missing 
jiniproxy (Squid) server and Preferred annotations not preserved for 
stubs (reflective proxy's are used now anyways).  


[jtreg] TEST RESULT: Failed. Execution failed: `main' threw exception: 
TestFailedException: TEST FAILED: client failed to call back in time
    [jtreg] --------------------------------------------------
    [jtreg] Test results: passed: 132; failed: 6
    [jtreg] Report written to 
/opt/src/River_Fixed/peterConcurrentPolicy/qa/jtreg/JTreport/html/report.html
    [jtreg] Results written to 
/opt/src/River_Fixed/peterConcurrentPolicy/qa/jtreg/JTwork
    [jtreg] Error: Some tests failed or other problems occurred.
     [move] Moving 8 files to /opt/src/River_Fixed/peterConcurrentPolicy/lib
     [move] Moving 1 file to 
/opt/src/River_Fixed/peterConcurrentPolicy/lib-ext
   [delete] Deleting directory 
/opt/src/River_Fixed/peterConcurrentPolicy/qa/jtreg/JTlib-tmp
   [delete] Deleting: 
/opt/src/River_Fixed/peterConcurrentPolicy/qa/jtreg/test.props

BUILD FAILED
/opt/src/River_Fixed/peterConcurrentPolicy/qa/build.xml:263: if=jtreg.fail

Total time: 28 minutes 27 seconds

com/sun/jini/action/catchSecurityException/CatchSecurityException.java                   
             Passed. Execution successful
com/sun/jini/config/KeyStores/TestGetKeyStore.java                                       
             Passed. Execution successful
com/sun/jini/config/KeyStores/TestGetX500Principal.java                                  
             Passed. Execution successful
com/sun/jini/phoenix/ExecOptionPermission/Operations.java                                
             Passed. Execution successful
com/sun/jini/tool/CheckConfigurationFile/TestCheck.java                                  
             Passed. Execution successful
java/rmi/server/RMIClassLoader/loadProxyClasses/PreferredLoadProxyClasses.java           
             Passed. Execution successful
java/rmi/server/Unreferenced/marshalledObjectGet/MarshalledObjectGet.java                
             Passed. Execution successful
java/rmi/server/Unreferenced/whenOnUnexport/WhenOnUnexport.java                          
             Passed. Execution successful
net/jini/activation/Activatable/activateExceptionTest/ActivateExceptionTest.java         
             Passed. Execution successful
net/jini/activation/Activatable/activateFailure/ActivateFailure.java                     
             Passed. Execution successful
net/jini/activation/Activatable/checkImplClassLoader/CheckImplClassLoader.java           
             Passed. Execution successful
net/jini/activation/Activatable/checkRegisterInLog/CheckRegisterInLog.java               
             Passed. Execution successful
net/jini/activation/Activatable/createPrivateActivable/CreatePrivateActivatable.java     
             Passed. Execution successful
net/jini/activation/Activatable/downloadParameterClass/DownloadParameterClass.java       
             Passed. Execution successful
net/jini/activation/Activatable/downloadSecurityManager/DownloadSecurityManager.java     
             Passed. Execution successful
net/jini/activation/Activatable/forceLogSnapshot/ForceLogSnapshot.java                   
             Passed. Execution successful
net/jini/activation/Activatable/inactiveGroup/InactiveGroup.java                         
             Passed. Execution successful
net/jini/activation/Activatable/nestedActivate/NestedActivate.java                       
             Passed. Execution successful
net/jini/activation/Activatable/nonExistentActivatable/NonExistentActivatable.java       
             Passed. Execution successful
net/jini/activation/Activatable/restartCrashedService/RestartCrashedService.java         
             Passed. Execution successful
net/jini/activation/Activatable/restartService/RestartService.java                       
             Passed. Execution successful
net/jini/activation/Activatable/terminateGroup/TerminateGroup.java                       
             Passed. Execution successful
net/jini/activation/Activatable/unregisterInactive/UnregisterInactive.java               
             Passed. Execution successful
net/jini/activation/Activatable/useProxyAccessor/UseProxyAccessor.java                   
             Passed. Execution successful
net/jini/activation/ActivatableInvocationHandler/readObject/ReadObject.java              
             Passed. Execution successful
net/jini/activation/ActivationAdmin/getGroupsObjects/GetGroupsObjects.java               
             Passed. Execution successful
net/jini/activation/ActivationSystem/accessControl/AccessControl.java                    
             Passed. Execution successful
net/jini/activation/ActivationSystem/bootstrapAttack/BootstrapAttack.java                
             Passed. Execution successful
net/jini/activation/ActivationSystem/ensureRestart/EnsureRestart.java                    
             Passed. Execution successful
net/jini/activation/ActivationSystem/unregisterGroup/UnregisterGroup.java                
             Passed. Execution successful
net/jini/config/ConfigurationFile/TestParser/TestParser.java                             
             Passed. Execution successful
net/jini/config/TestAPI/TestConstructor.java                                             
             Passed. Execution successful
net/jini/config/TestAPI/TestGetEntryType.java                                            
             Passed. Execution successful
net/jini/config/TestAPI/TestGetInstance.java                                             
             Passed. Execution successful
net/jini/config/TestAPI/TestOverrides.java                                               
             Passed. Execution successful
net/jini/config/TestAPI/TestUnicodeEscapesDecodingReader.java                            
             Passed. Execution successful
net/jini/config/TestAbstractConfiguration.java                                           
             Passed. Execution successful
net/jini/config/TestEmptyConfiguration.java                                              
             Passed. Execution successful
net/jini/constraints/BasicMethodConstraints/getConstraints/GetConstraints.java           
             Passed. Execution successful
net/jini/constraints/BasicMethodConstraints/ordering/Ordering.java                       
             Passed. Execution successful
net/jini/constraints/basicOperations/BasicOperations.java                                
             Passed. Execution successful
net/jini/constraints/readObject/ReadObject.java                                          
             Passed. Execution successful
net/jini/iiop/echo/ConnectedExport.java                                                  
             Passed. Execution successful
net/jini/iiop/echo/NonIiopExport.java                                                    
             Passed. Execution successful
net/jini/iiop/echo/UnconnectedExport.java                                                
             Passed. Execution successful
net/jini/io/MarshalInputStream/verifyWithEqualLoaders/VerifyWithEqualLoaders.java        
             Passed. Execution successful
net/jini/jeri/BasicInvocationDispatcher/checkClientPermission/CheckClientPermission.java 
             Passed. Execution successful
net/jini/jeri/BasicInvocationDispatcher/suppressStackTraces/SuppressStackTraces.java     
             Passed. Execution successful
net/jini/jeri/BasicInvocationHandler/serverStackTrace/ServerStackTrace.java              
             Passed. Execution successful
net/jini/jeri/BasicInvocationHandler/unmarshalUnexpectedException/UnmarshalUnexpectedException.java
   Passed. Execution successful
net/jini/jeri/BasicJeriExporter/dgcServerExposure/DgcServerExposure.java                 
             Passed. Execution successful
net/jini/jeri/BasicJeriExporter/globalListenLock/GlobalListenLock.java                   
             Passed. Execution successful
net/jini/jeri/BasicJeriExporter/operations/Operations.java                               
             Passed. Execution successful
net/jini/jeri/BasicJeriExporter/sameClassCheck/SameClassCheck.java                       
             Passed. Execution successful
net/jini/jeri/BasicJeriTrustVerifier/BjtvSubclassTest.java                               
             Passed. Execution successful
net/jini/jeri/connection/ConnectionManager/overlocking/Overlocking.java                  
             Passed. Execution successful
net/jini/jeri/connection/ConnectionManager/saturation/Saturation.java                    
             Passed. Execution successful
net/jini/jeri/http/connectionReuse/Test.java                                             
             Passed. Execution successful
net/jini/jeri/http/echo/EchoImpl.java                                                    
             Failed. Execution failed: `main' threw exception: java.rmi.UnknownHostException:
unknown host in BasicObjectEndpoint[169ca63c-3705-4349-a44a-bdccee09cb1d,HttpEndpoint[10.1.1.2:43324]];
nested exception is:   java.net.UnknownHostException: jiniproxy
net/jini/jeri/internal/runtime/getRemoteInterfaces/GetRemoteInterfaces.java              
             Passed. Execution successful
net/jini/jeri/internal/runtime/runtimeThreadInheritanceLeak/RuntimeThreadInheritanceLeak.java
         Passed. Execution successful
net/jini/jeri/kerberos/RegressionTests/runListenEndpointTest.sh                          
             Failed. Execution failed: exit code 1
net/jini/jeri/kerberos/UnitTests/TestVerifier.java                                       
             Passed. Execution successful
net/jini/jeri/kerberos/UnitTests/runTestEndpoints.sh                                     
             Failed. Execution failed: exit code 1
net/jini/jeri/kerberos/UnitTests/runTestPerformance.sh                                   
             Failed. Execution failed: exit code 1
net/jini/jeri/ssl/UnitTests/TestConnectionContext.java                                   
             Passed. Execution successful
net/jini/jeri/ssl/UnitTests/TestEndpoint.java                                            
             Passed. Execution successful
net/jini/jeri/ssl/UnitTests/TestEndpointHttps.sh                                         
             Passed. Execution successful
net/jini/jeri/ssl/UnitTests/TestEndpointInternal.java                                    
             Passed. Execution successful
net/jini/jeri/ssl/UnitTests/TestEndpointInternalHttps.sh                                 
             Passed. Execution successful
net/jini/jeri/ssl/UnitTests/TestPerformance.java                                         
             Passed. Execution successful
net/jini/jeri/ssl/UnitTests/TestPerformanceHttps.sh                                      
             Passed. Execution successful
net/jini/jeri/ssl/UnitTests/TestRMI.java                                                 
             Passed. Execution successful
net/jini/jeri/ssl/UnitTests/TestRMIHttps.sh                                              
             Passed. Execution successful
net/jini/jeri/ssl/UnitTests/TestServerEndpoint.java                                      
             Passed. Execution successful
net/jini/jeri/ssl/UnitTests/TestServerEndpointHttps.sh                                   
             Passed. Execution successful
net/jini/jeri/ssl/UnitTests/TestTwoEndpoints.java                                        
             Passed. Execution successful
net/jini/jeri/ssl/UnitTests/TestUtilities.java                                           
             Passed. Execution successful
net/jini/jeri/ssl/UnitTests/TestVerifier.java                                            
             Passed. Execution successful
net/jini/jeri/ssl/UnitTests/TestWeakSoftTable.java                                       
             Passed. Execution successful
net/jini/jeri/tcp/ServerEndpointClose.java                                               
             Passed. Execution successful
net/jini/jeri/tcp/connectTimeout/TestConnectTimeout.java                                 
             Passed. Execution successful
net/jini/jeri/tcp/localHostExposure/LocalHostExposure.java                               
             Passed. Execution successful
net/jini/jeri/tcp/outOfThreads/OutOfThreads.java                                         
             Passed. Execution successful
net/jini/jeri/tcp/outOfThreads/OutOfThreads2.java                                        
             Passed. Execution successful
net/jini/jeri/tcp/serverSocketClose/ServerSocketClose.java                               
             Passed. Execution successful
net/jini/jeri/tcp/unfulfilledConstraints/TestUnfulfilledConstraints.java                 
             Passed. Execution successful
net/jini/jeri/transport/multihomed/Multihomed.java                                       
             Passed. Execution successful
net/jini/jeri/transport/multihomed/runMultihome.sh                                       
             Failed. Execution failed: exit code 1
net/jini/jrmp/ServerContext/TestServerContext.java                                       
             Passed. Execution successful
net/jini/jrmp/echo/TestActivatableExport.java                                            
             Passed. Execution successful
net/jini/jrmp/echo/TestExport.java                                                       
             Passed. Execution successful
net/jini/loader/ClassLoading/verifyBeforeLoading/VerifyBeforeLoading.java                
             Passed. Execution successful
net/jini/loader/pref/PreferredClassLoader/4881293/Test4881293.java                       
             Passed. Execution successful
net/jini/loader/pref/PreferredClassLoader/urlStreamHandlerFactory/TestURLStreamHandlerFactory.java
    Passed. Execution successful
net/jini/loader/pref/PreferredClassProvider/arrayClassNames/ArrayClassNames.java         
             Passed. Execution successful
net/jini/loader/pref/PreferredClassProvider/checkBoomerangs/CheckBoomerangs.java         
             Passed. Execution successful
net/jini/loader/pref/PreferredClassProvider/checkDefinite/CheckDefinite.java             
             Passed. Execution successful
net/jini/loader/pref/PreferredClassProvider/constructorCheck/ConstructorCheck.java       
             Passed. Execution successful
net/jini/loader/pref/PreferredClassProvider/defaultIsExtensionLoader/DefaultIsExtensionLoader.java
    Passed. Execution successful
net/jini/loader/pref/PreferredClassProvider/exerciseProviderConfig/ExerciseNoProvider.java
            Passed. Execution successful
net/jini/loader/pref/PreferredClassProvider/exerciseProviderConfig/ExerciseProviderConfig.java
        Passed. Execution successful
net/jini/loader/pref/PreferredClassProvider/exerciseProviderConfig/ExerciseRequireDlPermProvider.java
 Passed. Execution successful
net/jini/loader/pref/PreferredClassProvider/finalizerAttack/FinalizerAttack.java         
             Passed. Execution successful
net/jini/loader/pref/PreferredClassProvider/malformedAncestorURLs/MalformedAncestorURLs.java
          Passed. Execution successful
net/jini/loader/pref/PreferredClassProvider/nonURLAncestor/NonURLAncestor.java           
             Passed. Execution successful
net/jini/loader/pref/PreferredClassProvider/pinContextLoader/PinContextLoader.java       
             Passed. Execution successful
net/jini/loader/pref/PreferredClassProvider/registryRetainCodebase/RegistryRetainCodebase.java
        Failed. Execution failed: `main' threw exception: TestFailedException: TEST FAILED:
client failed to call back in time
net/jini/loader/pref/PreferredResources/correctInterpretation/CorrectInterpretation.java 
             Passed. Execution successful
net/jini/security/AccessPermission/Operations.java                                       
             Passed. Execution successful
net/jini/security/AuthenticationPermission/Operations.java                               
             Passed. Execution successful
net/jini/security/GrantPermission/implies/Test.java                                      
             Passed. Execution successful
net/jini/security/GrantPermission/invalidNamedPermission/Test.java                       
             Passed. Execution successful
net/jini/security/GrantPermission/nested/Test.java                                       
             Passed. Execution successful
net/jini/security/GrantPermission/parseName/Test.java                                    
             Passed. Execution successful
net/jini/security/GrantPermission/readObject/Test.java                                   
             Passed. Execution successful
net/jini/security/GrantPermission/serialize/Test.java                                    
             Passed. Execution successful
net/jini/security/ProxyPreparer/TestBasicProxyPreparer.java                              
             Passed. Execution successful
net/jini/security/Security/contextClassLoader/Test.java                                  
             Passed. Execution successful
net/jini/security/Security/doPrivileged/Test.java                                        
             Passed. Execution successful
net/jini/security/Security/getContext/Test.java                                          
             Passed. Execution successful
net/jini/security/Security/grants/Test.java                                              
             Passed. Execution successful
net/jini/security/Security/implicitGrants/Test.java                                      
             Passed. Execution successful
net/jini/security/policy/DynamicPolicyProvider/basePolicyNotFound/Test.java              
             Passed. Execution successful
net/jini/security/policy/DynamicPolicyProvider/domainCaching/Test.java                   
             Passed. Execution successful
net/jini/security/policy/DynamicPolicyProvider/dynamicBasePolicy/Test.java               
             Passed. Execution successful
net/jini/security/policy/DynamicPolicyProvider/nullCases/Test.java                       
             Passed. Execution successful
net/jini/security/policy/DynamicPolicyProvider/principalGrants/Test.java                 
             Passed. Execution successful
net/jini/security/policy/DynamicPolicyProvider/selfGrants/Test.java                      
             Passed. Execution successful
net/jini/security/policy/PolicyFileProvider/basePolicyNotFound/Test.java                 
             Passed. Execution successful
net/jini/security/policy/PolicyFileProvider/basicGrants/Test.java                        
             Passed. Execution successful
net/jini/security/policy/PolicyFileProvider/nullCases/Test.java                          
             Passed. Execution successful
net/jini/security/policy/PolicyFileProvider/umbrellaGrants/Test.java                     
             Passed. Execution successful
net/jini/url/httpmd/TestEqual.java                                                       
             Passed. Execution successful
net/jini/url/httpmd/TestHttpmdUtil.java                                                  
             Passed. Execution successful
net/jini/url/httpmd/TestJar.java                                                         
             Passed. Execution successful
net/jini/url/httpmd/TestParse.java                                                       
             Passed. Execution successful
net/jini/url/httpmd/TestStream.java                                                      
             Passed. Execution successful



Mime
View raw message