river-dev mailing list archives

Site index · List index
Message view « Date » · « Thread »
Top « Date » · « Thread »
From Peter Firmstone <j...@zeus.net.au>
Subject Who can figure out this test failure?
Date Tue, 12 Mar 2013 08:05:35 GMT
Firstly I've checked jsk-lib.jar the class 
net.jini.lookup.DiscoveryAdmin is present.

Three other tests failed, missing the same class.

For some reason the class wasn't visible on the classpath for these tests.

I've disabled the build so it isn't lost and is available for inspection:

https://builds.apache.org/view/M-R/view/River/job/river-qa-refactoring/53/

Running com/sun/jini/test/spec/lookupdiscovery/DiscardUnreachable.td
Time is Mon Mar 11 18:01:38 UTC 2013
Starting test in separate process with command:
/home/jenkins/tools/java/jdk1.6.0_27-32/jre/bin/java -Djava.security.manager=org.apache.river.api.security.CombinerSecurityManager
-Djava.security.policy=file:/home/jenkins/jenkins-slave/workspace/river-qa-refactoring/trunk/qa/harness/policy/defaulttest.policy
-cp /home/jenkins/jenkins-slave/workspace/river-qa-refactoring/trunk/qa/lib/jiniharness.jar:/home/jenkins/jenkins-slave/workspace/river-qa-refactoring/trunk/qa/lib/jinitests.jar:/home/jenkins/jenkins-slave/workspace/river-qa-refactoring/trunk/lib/jsk-platform.jar:/home/jenkins/jenkins-slave/workspace/river-qa-refactoring/trunk/lib/jsk-lib.jar:/home/jenkins/jenkins-slave/workspace/river-qa-refactoring/trunk/lib/high-scale-lib.jar:/home/jenkins/jenkins-slave/workspace/river-qa-refactoring/trunk/lib/custard-apple-1.0.2.jar
-ea -esa -client -Djava.ext.dirs=/home/jenkins/tools/java/jdk1.6.0_27-32/jre/lib/ext:/usr/java/packages/lib/ext:/home/jenkins/jenkins-slave/workspace/river-qa-refactoring/trunk/qa/lib-ext:/home/jenkins/jenkins-slave/workspace/river-qa-refactoring/trunk/lib-ext
-Dcom.sun.jini.jsk.port=9080 -Dcom.sun.jini.qa.port=9081 -Dcom.sun.jini.jsk.home=/home/jenkins/jenkins-slave/workspace/river-qa-refactoring/trunk
-Dcom.sun.jini.qa.home=/home/jenkins/jenkins-slave/workspace/river-qa-refactoring/trunk/qa
-Dcom.sun.jini.qa.harness.harnessJar=/home/jenkins/jenkins-slave/workspace/river-qa-refactoring/trunk/qa/lib/jiniharness.jar
-Dcom.sun.jini.qa.harness.testJar=/home/jenkins/jenkins-slave/workspace/river-qa-refactoring/trunk/qa/lib/jinitests.jar
-Dcom.sun.jini.qa.harness.runjiniserver=true -Dcom.sun.jini.qa.harness.runkitserver=true -Djava.security.properties=file:/home/jenkins/jenkins-slave/workspace/river-qa-refactoring/trunk/qa/harness/trust/dynamic-policy.properties
-Dcom.sun.jini.qa.harness.testhosts= -Djava.util.logging.config.file=/home/jenkins/jenkins-slave/workspace/river-qa-refactoring/trunk/qa/src/com/sun/jini/test/resources/qa1.logging
-Dcom.sun.jini.test.home=/home/jenkins/jenkins-slave/workspace/river-qa-refactoring/trunk/qa
-Dcom.sun.jini.test.port=9082 -Dcom.sun.jini.qa.harness.policies=file:/home/jenkins/jenkins-slave/workspace/river-qa-refactoring/trunk/qa/src/com/sun/jini/test/resources/jinitest.policy
-Djava.ext.dirs=/home/jenkins/tools/java/jdk1.6.0_27-32/jre/lib/ext:/usr/java/packages/lib/ext:/home/jenkins/jenkins-slave/workspace/river-qa-refactoring/trunk/qa/lib-ext:/home/jenkins/jenkins-slave/workspace/river-qa-refactoring/trunk/lib-ext
com.sun.jini.qa.harness.MasterTest com/sun/jini/test/spec/lookupdiscovery/DiscardUnreachable.td

TIME: 6:01:39 PM

MasterTest.doTest INFO:
============================== CALLING CONSTRUCT() ==============================

AdminManager.startService FINE: starting qaClassServer
FINE:
FINE: Parameters for qaClassServer(.0):
FINE:      type              : classServer
FINE:      impl              : com.sun.jini.tool.ClassServer
FINE:      directory         : /home/jenkins/jenkins-slave/workspace/river-qa-refactoring/trunk/qa/lib
FINE:      options           : -ea -esa
Mar 11, 2013 6:01:39 PM com.sun.jini.tool.ClassServer run
INFO: ClassServer started [[/home/jenkins/jenkins-slave/workspace/river-qa-refactoring/trunk/qa/lib/],
port 9081]
AdminManager.startService FINE: starting jiniClassServer
FINE:
FINE: Parameters for jiniClassServer(.0):
FINE:      type              : classServer
FINE:      impl              : com.sun.jini.tool.ClassServer
FINE:      directory         : /home/jenkins/jenkins-slave/workspace/river-qa-refactoring/trunk/lib-dl
FINE:      options           : -ea -esa
AdminManager.startService FINE: starting testClassServer
Mar 11, 2013 6:01:39 PM com.sun.jini.tool.ClassServer run
INFO: ClassServer started [[/home/jenkins/jenkins-slave/workspace/river-qa-refactoring/trunk/lib-dl/],
port 9080]
FINE:
FINE: Parameters for testClassServer(.0):
FINE:      type              : classServer
FINE:      impl              : com.sun.jini.tool.ClassServer
FINE:      directory         : /home/jenkins/jenkins-slave/workspace/river-qa-refactoring/trunk/qa/lib
FINE:      options           : -ea -esa
Mar 11, 2013 6:01:39 PM com.sun.jini.tool.ClassServer run
INFO: ClassServer started [[/home/jenkins/jenkins-slave/workspace/river-qa-refactoring/trunk/qa/lib/],
port 9082]
BaseQATest.construct FINE:  construct()
LookupServices.<init>  FINE:  ----- Harness Info -----
LookupServices.<init>  FINE:  harness codebase         -- no codebase
LookupServices.<init>  FINE:  harness classpath        -- /home/jenkins/jenkins-slave/workspace/river-qa-refactoring/trunk/qa/lib/jiniharness.jar:/home/jenkins/jenkins-slave/workspace/river-qa-refactoring/trunk/qa/lib/jinitests.jar:/home/jenkins/jenkins-slave/workspace/river-qa-refactoring/trunk/lib/jsk-platform.jar:/home/jenkins/jenkins-slave/workspace/river-qa-refactoring/trunk/lib/jsk-lib.jar:/home/jenkins/jenkins-slave/workspace/river-qa-refactoring/trunk/lib/high-scale-lib.jar:/home/jenkins/jenkins-slave/workspace/river-qa-refactoring/trunk/lib/custard-apple-1.0.2.jar
LookupServices.<init>  FINE:  net.jini.discovery.debug        -- false
LookupServices.<init>  FINE:  com.sun.jini.reggie.proxy.debug -- false
LookupServices.<init>  FINE:  com.sun.jini.join.debug         -- false
LookupServices.<init>  FINE:  com.sun.jini.sdm.debug          -- false
LookupServices.<init>  FINE:  ----- Lookup Service Info -----
LookupServices.<init>  FINE:  # of lookup services to start            -- 3
LookupServices.<init>  FINE:  # of additional lookup services to start -- 0
LookupServices.<init>  FINE:  seconds to wait for discovery            -- 180
LookupServices.<init>  FINE:  discard if no announcements in (nSecs =) -- 20
QAConfig.getServiceHost FINE: Selecting service host
QAConfig.getServiceHost FINE: Not distributed - selecting this host
QAConfig.getServiceHost FINE: Selecting service host
QAConfig.getServiceHost FINE: Not distributed - selecting this host
QAConfig.getServiceHost FINE: Selecting service host
QAConfig.getServiceHost FINE: Not distributed - selecting this host
LookupServices.startLookup FINE:  starting lookup service 0
AdminManager.startService FINE: starting net.jini.core.lookup.ServiceRegistrar
QAConfig.getServiceHost FINE: Selecting service host
QAConfig.getServiceHost FINE: Not distributed - selecting this host
AdminManager.startService FINE: starting nonActivatableGroup
FINE:
FINE: Parameters for nonActivatableGroup(.0):
FINE:      type              : nonactivatablegroup
FINE:      codebase          : http://minerva:9081/nonactivatablegroup-dl.jar
FINE:      impl              : com.sun.jini.qa.harness.NonActivatableGroupImpl
FINE:      policy file       : file:/home/jenkins/jenkins-slave/workspace/river-qa-refactoring/trunk/qa/harness/policy/defaultnonactvm.policy
FINE:      classpath         : /home/jenkins/jenkins-slave/workspace/river-qa-refactoring/trunk/qa/lib/nonactivatablegroup.jar:/home/jenkins/jenkins-slave/workspace/river-qa-refactoring/trunk/lib/start.jar:/home/jenkins/jenkins-slave/workspace/river-qa-refactoring/trunk/lib/jsk-platform.jar:/home/jenkins/jenkins-slave/workspace/river-qa-refactoring/trunk/lib/custard-apple-1.0.2.jar:/home/jenkins/jenkins-slave/workspace/river-qa-refactoring/trunk/lib/high-scale-lib.jar
FINE:      options           : -ea -esa -server
FINE:      properties        : -Djava.ext.dirs=/home/jenkins/tools/java/jdk1.6.0_27-32/jre/lib/ext:/usr/java/packages/lib/ext:/home/jenkins/jenkins-slave/workspace/river-qa-refactoring/trunk/qa/lib-ext:/home/jenkins/jenkins-slave/workspace/river-qa-refactoring/trunk/lib-ext
FINE:                        : -Dcom.sun.jini.jsk.port=9080
FINE:                        : -Dcom.sun.jini.qa.port=9081
FINE:                        : -Dcom.sun.jini.jsk.home=/home/jenkins/jenkins-slave/workspace/river-qa-refactoring/trunk
FINE:                        : -Dcom.sun.jini.qa.home=/home/jenkins/jenkins-slave/workspace/river-qa-refactoring/trunk/qa
FINE:                        : -Dcom.sun.jini.qa.harness.harnessJar=/home/jenkins/jenkins-slave/workspace/river-qa-refactoring/trunk/qa/lib/jiniharness.jar
FINE:                        : -Dcom.sun.jini.qa.harness.testJar=/home/jenkins/jenkins-slave/workspace/river-qa-refactoring/trunk/qa/lib/jinitests.jar
FINE:                        : -Dcom.sun.jini.qa.harness.runjiniserver=true
FINE:                        : -Dcom.sun.jini.qa.harness.runkitserver=true
FINE:                        : -Djava.security.properties=file:/home/jenkins/jenkins-slave/workspace/river-qa-refactoring/trunk/qa/harness/trust/dynamic-policy.properties
FINE:                        : -Dcom.sun.jini.qa.harness.testhosts=
FINE:                        : -Djava.util.logging.config.file=/home/jenkins/jenkins-slave/workspace/river-qa-refactoring/trunk/qa/src/com/sun/jini/test/resources/qa1.logging
FINE:                        : -Dcom.sun.jini.test.home=/home/jenkins/jenkins-slave/workspace/river-qa-refactoring/trunk/qa
FINE:                        : -Dcom.sun.jini.test.port=9082
FINE:                        : -Dcom.sun.jini.qa.harness.policies=file:/home/jenkins/jenkins-slave/workspace/river-qa-refactoring/trunk/qa/src/com/sun/jini/test/resources/jinitest.policy
FINE:
FINE: Parameters for net.jini.core.lookup.ServiceRegistrar(.0):
FINE:      type              : transient
FINE:      codebase          : http://minerva:9082/qa1-lookup-simulator-dl.jar
FINE:      impl              : com.sun.jini.test.services.lookupsimulator.LookupSimulatorImpl
FINE:      component name    : com.sun.jini.reggie
FINE:      policy file       : file:/home/jenkins/jenkins-slave/workspace/river-qa-refactoring/trunk/qa/src/com/sun/jini/test/share/simulator.policy
FINE:      classpath         : lib/qa1-lookup-simulator.jar:/home/jenkins/jenkins-slave/workspace/river-qa-refactoring/trunk/lib/jsk-platform.jar
FINE:      service conf file : -
FINE:      starter conf file : -
FINE:      proxy preparer    : test.reggiePreparer
FINE:      option args 0     : -
FINE:      option args 1     : com.sun.jini.reggie.initialMemberGroups = new String[]{"LDGroup0_A_minerva_1363024898793",
"LDGroup0_B_minerva_1363024898793", "LDGroup0_C_minerva_1363024898793"}
FINE:      option args 2     : net.jini.discovery.LookupDiscovery.multicastAnnouncementInterval=20000
FINE:      option args 3     : com.sun.jini.reggie.multicastAnnouncementInterval=20000
FINE:      option args 4     : multicast.ttl=0
FINE:
NonActGrp-out: Problem parsing policy: file:/home/jenkins/jenkins-slave/workspace/river-qa-refactoring/trunk/qa/src/com/sun/jini/test/share/simulator.policy
NonActGrp-out: org.apache.river.api.security.PolicyUtils$ExpansionFailedException: Unknown
key: mercury
NonActGrp-out: org.apache.river.api.security.PolicyUtils$ExpansionFailedException: Unknown
key: mercury
NonActGrp-out: 	at org.apache.river.api.security.PolicyUtils.expand(PolicyUtils.java:167)
NonActGrp-out: 	at org.apache.river.api.security.DefaultPolicyParser.resolveGrant(DefaultPolicyParser.java:234)
NonActGrp-out: 	at org.apache.river.api.security.DefaultPolicyParser.parse(DefaultPolicyParser.java:140)
NonActGrp-out: 	at org.apache.river.api.security.ConcurrentPolicyFile$2.run(ConcurrentPolicyFile.java:415)
NonActGrp-out: 	at org.apache.river.api.security.ConcurrentPolicyFile$2.run(ConcurrentPolicyFile.java:401)
NonActGrp-out: 	at java.security.AccessController.doPrivileged(Native Method)
NonActGrp-out: 	at org.apache.river.api.security.ConcurrentPolicyFile.initialize(ConcurrentPolicyFile.java:400)
NonActGrp-out: 	at org.apache.river.api.security.ConcurrentPolicyFile.<init>(ConcurrentPolicyFile.java:234)
NonActGrp-out: 	at org.apache.river.api.security.ConcurrentPolicyFile.<init>(ConcurrentPolicyFile.java:214)
NonActGrp-out: 	at sun.reflect.NativeConstructorAccessorImpl.newInstance0(Native Method)
NonActGrp-out: 	at sun.reflect.NativeConstructorAccessorImpl.newInstance(NativeConstructorAccessorImpl.java:39)
NonActGrp-out: 	at sun.reflect.DelegatingConstructorAccessorImpl.newInstance(DelegatingConstructorAccessorImpl.java:27)
NonActGrp-out: 	at java.lang.reflect.Constructor.newInstance(Constructor.java:513)
NonActGrp-out: 	at java.lang.Class.newInstance0(Class.java:355)
NonActGrp-out: 	at java.lang.Class.newInstance(Class.java:308)
NonActGrp-out: 	at net.jini.security.policy.PolicyFileProvider.<init>(PolicyFileProvider.java:196)
NonActGrp-out: 	at com.sun.jini.start.NonActivatableServiceDescriptor.create(NonActivatableServiceDescriptor.java:626)
NonActGrp-out: 	at com.sun.jini.qa.harness.NonActivatableGroupImpl$GroupImpl.startService(NonActivatableGroupImpl.java:182)
NonActGrp-out: 	at sun.reflect.NativeMethodAccessorImpl.invoke0(Native Method)
NonActGrp-out: 	at sun.reflect.NativeMethodAccessorImpl.invoke(NativeMethodAccessorImpl.java:39)
NonActGrp-out: 	at sun.reflect.DelegatingMethodAccessorImpl.invoke(DelegatingMethodAccessorImpl.java:25)
NonActGrp-out: 	at java.lang.reflect.Method.invoke(Method.java:597)
NonActGrp-out: 	at sun.rmi.server.UnicastServerRef.dispatch(UnicastServerRef.java:305)
NonActGrp-out: 	at sun.rmi.transport.Transport$1.run(Transport.java:159)
NonActGrp-out: 	at java.security.AccessController.doPrivileged(Native Method)
NonActGrp-out: 	at sun.rmi.transport.Transport.serviceCall(Transport.java:155)
NonActGrp-out: 	at sun.rmi.transport.tcp.TCPTransport.handleMessages(TCPTransport.java:535)
NonActGrp-out: 	at sun.rmi.transport.tcp.TCPTransport$ConnectionHandler.run0(TCPTransport.java:790)
NonActGrp-out: 	at sun.rmi.transport.tcp.TCPTransport$ConnectionHandler.run(TCPTransport.java:649)
NonActGrp-out: 	at java.util.concurrent.ThreadPoolExecutor$Worker.runTask(ThreadPoolExecutor.java:886)
NonActGrp-out: 	at java.util.concurrent.ThreadPoolExecutor$Worker.run(ThreadPoolExecutor.java:908)
NonActGrp-out: 	at java.lang.Thread.run(Thread.java:662)
NonActGrp-out: Problem parsing policy: file:/home/jenkins/jenkins-slave/workspace/river-qa-refactoring/trunk/qa/src/com/sun/jini/test/share/simulator.policy
NonActGrp-out: org.apache.river.api.security.PolicyUtils$ExpansionFailedException: Unknown
key: test
NonActGrp-out: org.apache.river.api.security.PolicyUtils$ExpansionFailedException: Unknown
key: test
NonActGrp-out: 	at org.apache.river.api.security.PolicyUtils.expand(PolicyUtils.java:167)
NonActGrp-out: 	at org.apache.river.api.security.DefaultPolicyParser.resolveGrant(DefaultPolicyParser.java:234)
NonActGrp-out: 	at org.apache.river.api.security.DefaultPolicyParser.parse(DefaultPolicyParser.java:140)
NonActGrp-out: 	at org.apache.river.api.security.ConcurrentPolicyFile$2.run(ConcurrentPolicyFile.java:415)
NonActGrp-out: 	at org.apache.river.api.security.ConcurrentPolicyFile$2.run(ConcurrentPolicyFile.java:401)
NonActGrp-out: 	at java.security.AccessController.doPrivileged(Native Method)
NonActGrp-out: 	at org.apache.river.api.security.ConcurrentPolicyFile.initialize(ConcurrentPolicyFile.java:400)
NonActGrp-out: 	at org.apache.river.api.security.ConcurrentPolicyFile.<init>(ConcurrentPolicyFile.java:234)
NonActGrp-out: 	at org.apache.river.api.security.ConcurrentPolicyFile.<init>(ConcurrentPolicyFile.java:214)
NonActGrp-out: 	at sun.reflect.NativeConstructorAccessorImpl.newInstance0(Native Method)
NonActGrp-out: 	at sun.reflect.NativeConstructorAccessorImpl.newInstance(NativeConstructorAccessorImpl.java:39)
NonActGrp-out: 	at sun.reflect.DelegatingConstructorAccessorImpl.newInstance(DelegatingConstructorAccessorImpl.java:27)
NonActGrp-out: 	at java.lang.reflect.Constructor.newInstance(Constructor.java:513)
NonActGrp-out: 	at java.lang.Class.newInstance0(Class.java:355)
NonActGrp-out: 	at java.lang.Class.newInstance(Class.java:308)
NonActGrp-out: 	at net.jini.security.policy.PolicyFileProvider.<init>(PolicyFileProvider.java:196)
NonActGrp-out: 	at com.sun.jini.start.NonActivatableServiceDescriptor.create(NonActivatableServiceDescriptor.java:626)
NonActGrp-out: 	at com.sun.jini.qa.harness.NonActivatableGroupImpl$GroupImpl.startService(NonActivatableGroupImpl.java:182)
NonActGrp-out: 	at sun.reflect.NativeMethodAccessorImpl.invoke0(Native Method)
NonActGrp-out: 	at sun.reflect.NativeMethodAccessorImpl.invoke(NativeMethodAccessorImpl.java:39)
NonActGrp-out: 	at sun.reflect.DelegatingMethodAccessorImpl.invoke(DelegatingMethodAccessorImpl.java:25)
NonActGrp-out: 	at java.lang.reflect.Method.invoke(Method.java:597)
NonActGrp-out: 	at sun.rmi.server.UnicastServerRef.dispatch(UnicastServerRef.java:305)
NonActGrp-out: 	at sun.rmi.transport.Transport$1.run(Transport.java:159)
NonActGrp-out: 	at java.security.AccessController.doPrivileged(Native Method)
NonActGrp-out: 	at sun.rmi.transport.Transport.serviceCall(Transport.java:155)
NonActGrp-out: 	at sun.rmi.transport.tcp.TCPTransport.handleMessages(TCPTransport.java:535)
NonActGrp-out: 	at sun.rmi.transport.tcp.TCPTransport$ConnectionHandler.run0(TCPTransport.java:790)
NonActGrp-out: 	at sun.rmi.transport.tcp.TCPTransport$ConnectionHandler.run(TCPTransport.java:649)
NonActGrp-out: 	at java.util.concurrent.ThreadPoolExecutor$Worker.runTask(ThreadPoolExecutor.java:886)
NonActGrp-out: 	at java.util.concurrent.ThreadPoolExecutor$Worker.run(ThreadPoolExecutor.java:908)
NonActGrp-out: 	at java.lang.Thread.run(Thread.java:662)
NonActGrp-out: Problem parsing policy: file:/home/jenkins/jenkins-slave/workspace/river-qa-refactoring/trunk/qa/src/com/sun/jini/test/share/simulator.policy
NonActGrp-out: org.apache.river.api.security.PolicyUtils$ExpansionFailedException: Unknown
key: fiddler
NonActGrp-out: org.apache.river.api.security.PolicyUtils$ExpansionFailedException: Unknown
key: fiddler
NonActGrp-out: 	at org.apache.river.api.security.PolicyUtils.expand(PolicyUtils.java:167)
NonActGrp-out: 	at org.apache.river.api.security.DefaultPolicyParser.resolveGrant(DefaultPolicyParser.java:234)
NonActGrp-out: 	at org.apache.river.api.security.DefaultPolicyParser.parse(DefaultPolicyParser.java:140)
NonActGrp-out: 	at org.apache.river.api.security.ConcurrentPolicyFile$2.run(ConcurrentPolicyFile.java:415)
NonActGrp-out: 	at org.apache.river.api.security.ConcurrentPolicyFile$2.run(ConcurrentPolicyFile.java:401)
NonActGrp-out: 	at java.security.AccessController.doPrivileged(Native Method)
NonActGrp-out: 	at org.apache.river.api.security.ConcurrentPolicyFile.initialize(ConcurrentPolicyFile.java:400)
NonActGrp-out: 	at org.apache.river.api.security.ConcurrentPolicyFile.<init>(ConcurrentPolicyFile.java:234)
NonActGrp-out: 	at org.apache.river.api.security.ConcurrentPolicyFile.<init>(ConcurrentPolicyFile.java:214)
NonActGrp-out: 	at sun.reflect.NativeConstructorAccessorImpl.newInstance0(Native Method)
NonActGrp-out: 	at sun.reflect.NativeConstructorAccessorImpl.newInstance(NativeConstructorAccessorImpl.java:39)
NonActGrp-out: 	at sun.reflect.DelegatingConstructorAccessorImpl.newInstance(DelegatingConstructorAccessorImpl.java:27)
NonActGrp-out: 	at java.lang.reflect.Constructor.newInstance(Constructor.java:513)
NonActGrp-out: 	at java.lang.Class.newInstance0(Class.java:355)
NonActGrp-out: 	at java.lang.Class.newInstance(Class.java:308)
NonActGrp-out: 	at net.jini.security.policy.PolicyFileProvider.<init>(PolicyFileProvider.java:196)
NonActGrp-out: 	at com.sun.jini.start.NonActivatableServiceDescriptor.create(NonActivatableServiceDescriptor.java:626)
NonActGrp-out: 	at com.sun.jini.qa.harness.NonActivatableGroupImpl$GroupImpl.startService(NonActivatableGroupImpl.java:182)
NonActGrp-out: 	at sun.reflect.NativeMethodAccessorImpl.invoke0(Native Method)
NonActGrp-out: 	at sun.reflect.NativeMethodAccessorImpl.invoke(NativeMethodAccessorImpl.java:39)
NonActGrp-out: 	at sun.reflect.DelegatingMethodAccessorImpl.invoke(DelegatingMethodAccessorImpl.java:25)
NonActGrp-out: 	at java.lang.reflect.Method.invoke(Method.java:597)
NonActGrp-out: 	at sun.rmi.server.UnicastServerRef.dispatch(UnicastServerRef.java:305)
NonActGrp-out: 	at sun.rmi.transport.Transport$1.run(Transport.java:159)
NonActGrp-out: 	at java.security.AccessController.doPrivileged(Native Method)
NonActGrp-out: 	at sun.rmi.transport.Transport.serviceCall(Transport.java:155)
NonActGrp-out: 	at sun.rmi.transport.tcp.TCPTransport.handleMessages(TCPTransport.java:535)
NonActGrp-out: 	at sun.rmi.transport.tcp.TCPTransport$ConnectionHandler.run0(TCPTransport.java:790)
NonActGrp-out: 	at sun.rmi.transport.tcp.TCPTransport$ConnectionHandler.run(TCPTransport.java:649)
NonActGrp-out: 	at java.util.concurrent.ThreadPoolExecutor$Worker.runTask(ThreadPoolExecutor.java:886)
NonActGrp-out: 	at java.util.concurrent.ThreadPoolExecutor$Worker.run(ThreadPoolExecutor.java:908)
NonActGrp-out: 	at java.lang.Thread.run(Thread.java:662)
NonActGrp-out: Problem parsing policy: file:/home/jenkins/jenkins-slave/workspace/river-qa-refactoring/trunk/qa/src/com/sun/jini/test/share/simulator.policy
NonActGrp-out: org.apache.river.api.security.PolicyUtils$ExpansionFailedException: Unknown
key: mahalo
NonActGrp-out: org.apache.river.api.security.PolicyUtils$ExpansionFailedException: Unknown
key: mahalo
NonActGrp-out: 	at org.apache.river.api.security.PolicyUtils.expand(PolicyUtils.java:167)
NonActGrp-out: 	at org.apache.river.api.security.DefaultPolicyParser.resolveGrant(DefaultPolicyParser.java:234)
NonActGrp-out: 	at org.apache.river.api.security.DefaultPolicyParser.parse(DefaultPolicyParser.java:140)
NonActGrp-out: 	at org.apache.river.api.security.ConcurrentPolicyFile$2.run(ConcurrentPolicyFile.java:415)
NonActGrp-out: 	at org.apache.river.api.security.ConcurrentPolicyFile$2.run(ConcurrentPolicyFile.java:401)
NonActGrp-out: 	at java.security.AccessController.doPrivileged(Native Method)
NonActGrp-out: 	at org.apache.river.api.security.ConcurrentPolicyFile.initialize(ConcurrentPolicyFile.java:400)
NonActGrp-out: 	at org.apache.river.api.security.ConcurrentPolicyFile.<init>(ConcurrentPolicyFile.java:234)
NonActGrp-out: 	at org.apache.river.api.security.ConcurrentPolicyFile.<init>(ConcurrentPolicyFile.java:214)
NonActGrp-out: 	at sun.reflect.NativeConstructorAccessorImpl.newInstance0(Native Method)
NonActGrp-out: 	at sun.reflect.NativeConstructorAccessorImpl.newInstance(NativeConstructorAccessorImpl.java:39)
NonActGrp-out: 	at sun.reflect.DelegatingConstructorAccessorImpl.newInstance(DelegatingConstructorAccessorImpl.java:27)
NonActGrp-out: 	at java.lang.reflect.Constructor.newInstance(Constructor.java:513)
NonActGrp-out: 	at java.lang.Class.newInstance0(Class.java:355)
NonActGrp-out: 	at java.lang.Class.newInstance(Class.java:308)
NonActGrp-out: 	at net.jini.security.policy.PolicyFileProvider.<init>(PolicyFileProvider.java:196)
NonActGrp-out: 	at com.sun.jini.start.NonActivatableServiceDescriptor.create(NonActivatableServiceDescriptor.java:626)
NonActGrp-out: 	at com.sun.jini.qa.harness.NonActivatableGroupImpl$GroupImpl.startService(NonActivatableGroupImpl.java:182)
NonActGrp-out: 	at sun.reflect.NativeMethodAccessorImpl.invoke0(Native Method)
NonActGrp-out: 	at sun.reflect.NativeMethodAccessorImpl.invoke(NativeMethodAccessorImpl.java:39)
NonActGrp-out: 	at sun.reflect.DelegatingMethodAccessorImpl.invoke(DelegatingMethodAccessorImpl.java:25)
NonActGrp-out: 	at java.lang.reflect.Method.invoke(Method.java:597)
NonActGrp-out: 	at sun.rmi.server.UnicastServerRef.dispatch(UnicastServerRef.java:305)
NonActGrp-out: 	at sun.rmi.transport.Transport$1.run(Transport.java:159)
NonActGrp-out: 	at java.security.AccessController.doPrivileged(Native Method)
NonActGrp-out: 	at sun.rmi.transport.Transport.serviceCall(Transport.java:155)
NonActGrp-out: 	at sun.rmi.transport.tcp.TCPTransport.handleMessages(TCPTransport.java:535)
NonActGrp-out: 	at sun.rmi.transport.tcp.TCPTransport$ConnectionHandler.run0(TCPTransport.java:790)
NonActGrp-out: 	at sun.rmi.transport.tcp.TCPTransport$ConnectionHandler.run(TCPTransport.java:649)
NonActGrp-out: 	at java.util.concurrent.ThreadPoolExecutor$Worker.runTask(ThreadPoolExecutor.java:886)
NonActGrp-out: 	at java.util.concurrent.ThreadPoolExecutor$Worker.run(ThreadPoolExecutor.java:908)
NonActGrp-out: 	at java.lang.Thread.run(Thread.java:662)
NonActGrp-out: Problem parsing policy: file:/home/jenkins/jenkins-slave/workspace/river-qa-refactoring/trunk/qa/src/com/sun/jini/test/share/simulator.policy
NonActGrp-out: org.apache.river.api.security.PolicyUtils$ExpansionFailedException: Unknown
key: outrigger
NonActGrp-out: org.apache.river.api.security.PolicyUtils$ExpansionFailedException: Unknown
key: outrigger
NonActGrp-out: 	at org.apache.river.api.security.PolicyUtils.expand(PolicyUtils.java:167)
NonActGrp-out: 	at org.apache.river.api.security.DefaultPolicyParser.resolveGrant(DefaultPolicyParser.java:234)
NonActGrp-out: 	at org.apache.river.api.security.DefaultPolicyParser.parse(DefaultPolicyParser.java:140)
NonActGrp-out: 	at org.apache.river.api.security.ConcurrentPolicyFile$2.run(ConcurrentPolicyFile.java:415)
NonActGrp-out: 	at org.apache.river.api.security.ConcurrentPolicyFile$2.run(ConcurrentPolicyFile.java:401)
NonActGrp-out: 	at java.security.AccessController.doPrivileged(Native Method)
NonActGrp-out: 	at org.apache.river.api.security.ConcurrentPolicyFile.initialize(ConcurrentPolicyFile.java:400)
NonActGrp-out: 	at org.apache.river.api.security.ConcurrentPolicyFile.<init>(ConcurrentPolicyFile.java:234)
NonActGrp-out: 	at org.apache.river.api.security.ConcurrentPolicyFile.<init>(ConcurrentPolicyFile.java:214)
NonActGrp-out: 	at sun.reflect.NativeConstructorAccessorImpl.newInstance0(Native Method)
NonActGrp-out: 	at sun.reflect.NativeConstructorAccessorImpl.newInstance(NativeConstructorAccessorImpl.java:39)
NonActGrp-out: 	at sun.reflect.DelegatingConstructorAccessorImpl.newInstance(DelegatingConstructorAccessorImpl.java:27)
NonActGrp-out: 	at java.lang.reflect.Constructor.newInstance(Constructor.java:513)
NonActGrp-out: 	at java.lang.Class.newInstance0(Class.java:355)
NonActGrp-out: 	at java.lang.Class.newInstance(Class.java:308)
NonActGrp-out: 	at net.jini.security.policy.PolicyFileProvider.<init>(PolicyFileProvider.java:196)
NonActGrp-out: 	at com.sun.jini.start.NonActivatableServiceDescriptor.create(NonActivatableServiceDescriptor.java:626)
NonActGrp-out: 	at com.sun.jini.qa.harness.NonActivatableGroupImpl$GroupImpl.startService(NonActivatableGroupImpl.java:182)
NonActGrp-out: 	at sun.reflect.NativeMethodAccessorImpl.invoke0(Native Method)
NonActGrp-out: 	at sun.reflect.NativeMethodAccessorImpl.invoke(NativeMethodAccessorImpl.java:39)
NonActGrp-out: 	at sun.reflect.DelegatingMethodAccessorImpl.invoke(DelegatingMethodAccessorImpl.java:25)
NonActGrp-out: 	at java.lang.reflect.Method.invoke(Method.java:597)
NonActGrp-out: 	at sun.rmi.server.UnicastServerRef.dispatch(UnicastServerRef.java:305)
NonActGrp-out: 	at sun.rmi.transport.Transport$1.run(Transport.java:159)
NonActGrp-out: 	at java.security.AccessController.doPrivileged(Native Method)
NonActGrp-out: 	at sun.rmi.transport.Transport.serviceCall(Transport.java:155)
NonActGrp-out: 	at sun.rmi.transport.tcp.TCPTransport.handleMessages(TCPTransport.java:535)
NonActGrp-out: 	at sun.rmi.transport.tcp.TCPTransport$ConnectionHandler.run0(TCPTransport.java:790)
NonActGrp-out: 	at sun.rmi.transport.tcp.TCPTransport$ConnectionHandler.run(TCPTransport.java:649)
NonActGrp-out: 	at java.util.concurrent.ThreadPoolExecutor$Worker.runTask(ThreadPoolExecutor.java:886)
NonActGrp-out: 	at java.util.concurrent.ThreadPoolExecutor$Worker.run(ThreadPoolExecutor.java:908)
NonActGrp-out: 	at java.lang.Thread.run(Thread.java:662)
NonActGrp-out: Problem parsing policy: file:/home/jenkins/jenkins-slave/workspace/river-qa-refactoring/trunk/qa/src/com/sun/jini/test/share/simulator.policy
NonActGrp-out: org.apache.river.api.security.PolicyUtils$ExpansionFailedException: Unknown
key: reggie
NonActGrp-out: org.apache.river.api.security.PolicyUtils$ExpansionFailedException: Unknown
key: reggie
NonActGrp-out: 	at org.apache.river.api.security.PolicyUtils.expand(PolicyUtils.java:167)
NonActGrp-out: 	at org.apache.river.api.security.DefaultPolicyParser.resolveGrant(DefaultPolicyParser.java:234)
NonActGrp-out: 	at org.apache.river.api.security.DefaultPolicyParser.parse(DefaultPolicyParser.java:140)
NonActGrp-out: 	at org.apache.river.api.security.ConcurrentPolicyFile$2.run(ConcurrentPolicyFile.java:415)
NonActGrp-out: 	at org.apache.river.api.security.ConcurrentPolicyFile$2.run(ConcurrentPolicyFile.java:401)
NonActGrp-out: 	at java.security.AccessController.doPrivileged(Native Method)
NonActGrp-out: 	at org.apache.river.api.security.ConcurrentPolicyFile.initialize(ConcurrentPolicyFile.java:400)
NonActGrp-out: 	at org.apache.river.api.security.ConcurrentPolicyFile.<init>(ConcurrentPolicyFile.java:234)
NonActGrp-out: 	at org.apache.river.api.security.ConcurrentPolicyFile.<init>(ConcurrentPolicyFile.java:214)
NonActGrp-out: 	at sun.reflect.NativeConstructorAccessorImpl.newInstance0(Native Method)
NonActGrp-out: 	at sun.reflect.NativeConstructorAccessorImpl.newInstance(NativeConstructorAccessorImpl.java:39)
NonActGrp-out: 	at sun.reflect.DelegatingConstructorAccessorImpl.newInstance(DelegatingConstructorAccessorImpl.java:27)
NonActGrp-out: 	at java.lang.reflect.Constructor.newInstance(Constructor.java:513)
NonActGrp-out: 	at java.lang.Class.newInstance0(Class.java:355)
NonActGrp-out: 	at java.lang.Class.newInstance(Class.java:308)
NonActGrp-out: 	at net.jini.security.policy.PolicyFileProvider.<init>(PolicyFileProvider.java:196)
NonActGrp-out: 	at com.sun.jini.start.NonActivatableServiceDescriptor.create(NonActivatableServiceDescriptor.java:626)
NonActGrp-out: 	at com.sun.jini.qa.harness.NonActivatableGroupImpl$GroupImpl.startService(NonActivatableGroupImpl.java:182)
NonActGrp-out: 	at sun.reflect.NativeMethodAccessorImpl.invoke0(Native Method)
NonActGrp-out: 	at sun.reflect.NativeMethodAccessorImpl.invoke(NativeMethodAccessorImpl.java:39)
NonActGrp-out: 	at sun.reflect.DelegatingMethodAccessorImpl.invoke(DelegatingMethodAccessorImpl.java:25)
NonActGrp-out: 	at java.lang.reflect.Method.invoke(Method.java:597)
NonActGrp-out: 	at sun.rmi.server.UnicastServerRef.dispatch(UnicastServerRef.java:305)
NonActGrp-out: 	at sun.rmi.transport.Transport$1.run(Transport.java:159)
NonActGrp-out: 	at java.security.AccessController.doPrivileged(Native Method)
NonActGrp-out: 	at sun.rmi.transport.Transport.serviceCall(Transport.java:155)
NonActGrp-out: 	at sun.rmi.transport.tcp.TCPTransport.handleMessages(TCPTransport.java:535)
NonActGrp-out: 	at sun.rmi.transport.tcp.TCPTransport$ConnectionHandler.run0(TCPTransport.java:790)
NonActGrp-out: 	at sun.rmi.transport.tcp.TCPTransport$ConnectionHandler.run(TCPTransport.java:649)
NonActGrp-out: 	at java.util.concurrent.ThreadPoolExecutor$Worker.runTask(ThreadPoolExecutor.java:886)
NonActGrp-out: 	at java.util.concurrent.ThreadPoolExecutor$Worker.run(ThreadPoolExecutor.java:908)
NonActGrp-out: 	at java.lang.Thread.run(Thread.java:662)
NonActGrp-out: Problem parsing policy: file:/home/jenkins/jenkins-slave/workspace/river-qa-refactoring/trunk/qa/src/com/sun/jini/test/share/simulator.policy
NonActGrp-out: org.apache.river.api.security.PolicyUtils$ExpansionFailedException: Unknown
key: group
NonActGrp-out: org.apache.river.api.security.PolicyUtils$ExpansionFailedException: Unknown
key: group
NonActGrp-out: 	at org.apache.river.api.security.PolicyUtils.expand(PolicyUtils.java:167)
NonActGrp-out: 	at org.apache.river.api.security.DefaultPolicyParser.resolveGrant(DefaultPolicyParser.java:234)
NonActGrp-out: 	at org.apache.river.api.security.DefaultPolicyParser.parse(DefaultPolicyParser.java:140)
NonActGrp-out: 	at org.apache.river.api.security.ConcurrentPolicyFile$2.run(ConcurrentPolicyFile.java:415)
NonActGrp-out: 	at org.apache.river.api.security.ConcurrentPolicyFile$2.run(ConcurrentPolicyFile.java:401)
NonActGrp-out: 	at java.security.AccessController.doPrivileged(Native Method)
NonActGrp-out: 	at org.apache.river.api.security.ConcurrentPolicyFile.initialize(ConcurrentPolicyFile.java:400)
NonActGrp-out: 	at org.apache.river.api.security.ConcurrentPolicyFile.<init>(ConcurrentPolicyFile.java:234)
NonActGrp-out: 	at org.apache.river.api.security.ConcurrentPolicyFile.<init>(ConcurrentPolicyFile.java:214)
NonActGrp-out: 	at sun.reflect.NativeConstructorAccessorImpl.newInstance0(Native Method)
NonActGrp-out: 	at sun.reflect.NativeConstructorAccessorImpl.newInstance(NativeConstructorAccessorImpl.java:39)
NonActGrp-out: 	at sun.reflect.DelegatingConstructorAccessorImpl.newInstance(DelegatingConstructorAccessorImpl.java:27)
NonActGrp-out: 	at java.lang.reflect.Constructor.newInstance(Constructor.java:513)
NonActGrp-out: 	at java.lang.Class.newInstance0(Class.java:355)
NonActGrp-out: 	at java.lang.Class.newInstance(Class.java:308)
NonActGrp-out: 	at net.jini.security.policy.PolicyFileProvider.<init>(PolicyFileProvider.java:196)
NonActGrp-out: 	at com.sun.jini.start.NonActivatableServiceDescriptor.create(NonActivatableServiceDescriptor.java:626)
NonActGrp-out: 	at com.sun.jini.qa.harness.NonActivatableGroupImpl$GroupImpl.startService(NonActivatableGroupImpl.java:182)
NonActGrp-out: 	at sun.reflect.NativeMethodAccessorImpl.invoke0(Native Method)
NonActGrp-out: 	at sun.reflect.NativeMethodAccessorImpl.invoke(NativeMethodAccessorImpl.java:39)
NonActGrp-out: 	at sun.reflect.DelegatingMethodAccessorImpl.invoke(DelegatingMethodAccessorImpl.java:25)
NonActGrp-out: 	at java.lang.reflect.Method.invoke(Method.java:597)
NonActGrp-out: 	at sun.rmi.server.UnicastServerRef.dispatch(UnicastServerRef.java:305)
NonActGrp-out: 	at sun.rmi.transport.Transport$1.run(Transport.java:159)
NonActGrp-out: 	at java.security.AccessController.doPrivileged(Native Method)
NonActGrp-out: 	at sun.rmi.transport.Transport.serviceCall(Transport.java:155)
NonActGrp-out: 	at sun.rmi.transport.tcp.TCPTransport.handleMessages(TCPTransport.java:535)
NonActGrp-out: 	at sun.rmi.transport.tcp.TCPTransport$ConnectionHandler.run0(TCPTransport.java:790)
NonActGrp-out: 	at sun.rmi.transport.tcp.TCPTransport$ConnectionHandler.run(TCPTransport.java:649)
NonActGrp-out: 	at java.util.concurrent.ThreadPoolExecutor$Worker.runTask(ThreadPoolExecutor.java:886)
NonActGrp-out: 	at java.util.concurrent.ThreadPoolExecutor$Worker.run(ThreadPoolExecutor.java:908)
NonActGrp-out: 	at java.lang.Thread.run(Thread.java:662)
NonActGrp-out: Problem parsing policy: file:/home/jenkins/jenkins-slave/workspace/river-qa-refactoring/trunk/qa/src/com/sun/jini/test/share/simulator.policy
NonActGrp-out: org.apache.river.api.security.PolicyUtils$ExpansionFailedException: Unknown
key: norm
NonActGrp-out: org.apache.river.api.security.PolicyUtils$ExpansionFailedException: Unknown
key: norm
NonActGrp-out: 	at org.apache.river.api.security.PolicyUtils.expand(PolicyUtils.java:167)
NonActGrp-out: 	at org.apache.river.api.security.DefaultPolicyParser.resolveGrant(DefaultPolicyParser.java:234)
NonActGrp-out: 	at org.apache.river.api.security.DefaultPolicyParser.parse(DefaultPolicyParser.java:140)
NonActGrp-out: 	at org.apache.river.api.security.ConcurrentPolicyFile$2.run(ConcurrentPolicyFile.java:415)
NonActGrp-out: 	at org.apache.river.api.security.ConcurrentPolicyFile$2.run(ConcurrentPolicyFile.java:401)
NonActGrp-out: 	at java.security.AccessController.doPrivileged(Native Method)
NonActGrp-out: 	at org.apache.river.api.security.ConcurrentPolicyFile.initialize(ConcurrentPolicyFile.java:400)
NonActGrp-out: 	at org.apache.river.api.security.ConcurrentPolicyFile.<init>(ConcurrentPolicyFile.java:234)
NonActGrp-out: 	at org.apache.river.api.security.ConcurrentPolicyFile.<init>(ConcurrentPolicyFile.java:214)
NonActGrp-out: 	at sun.reflect.NativeConstructorAccessorImpl.newInstance0(Native Method)
NonActGrp-out: 	at sun.reflect.NativeConstructorAccessorImpl.newInstance(NativeConstructorAccessorImpl.java:39)
NonActGrp-out: 	at sun.reflect.DelegatingConstructorAccessorImpl.newInstance(DelegatingConstructorAccessorImpl.java:27)
NonActGrp-out: 	at java.lang.reflect.Constructor.newInstance(Constructor.java:513)
NonActGrp-out: 	at java.lang.Class.newInstance0(Class.java:355)
NonActGrp-out: 	at java.lang.Class.newInstance(Class.java:308)
NonActGrp-out: 	at net.jini.security.policy.PolicyFileProvider.<init>(PolicyFileProvider.java:196)
NonActGrp-out: 	at com.sun.jini.start.NonActivatableServiceDescriptor.create(NonActivatableServiceDescriptor.java:626)
NonActGrp-out: 	at com.sun.jini.qa.harness.NonActivatableGroupImpl$GroupImpl.startService(NonActivatableGroupImpl.java:182)
NonActGrp-out: 	at sun.reflect.NativeMethodAccessorImpl.invoke0(Native Method)
NonActGrp-out: 	at sun.reflect.NativeMethodAccessorImpl.invoke(NativeMethodAccessorImpl.java:39)
NonActGrp-out: 	at sun.reflect.DelegatingMethodAccessorImpl.invoke(DelegatingMethodAccessorImpl.java:25)
NonActGrp-out: 	at java.lang.reflect.Method.invoke(Method.java:597)
NonActGrp-out: 	at sun.rmi.server.UnicastServerRef.dispatch(UnicastServerRef.java:305)
NonActGrp-out: 	at sun.rmi.transport.Transport$1.run(Transport.java:159)
NonActGrp-out: 	at java.security.AccessController.doPrivileged(Native Method)
NonActGrp-out: 	at sun.rmi.transport.Transport.serviceCall(Transport.java:155)
NonActGrp-out: 	at sun.rmi.transport.tcp.TCPTransport.handleMessages(TCPTransport.java:535)
NonActGrp-out: 	at sun.rmi.transport.tcp.TCPTransport$ConnectionHandler.run0(TCPTransport.java:790)
NonActGrp-out: 	at sun.rmi.transport.tcp.TCPTransport$ConnectionHandler.run(TCPTransport.java:649)
NonActGrp-out: 	at java.util.concurrent.ThreadPoolExecutor$Worker.runTask(ThreadPoolExecutor.java:886)
NonActGrp-out: 	at java.util.concurrent.ThreadPoolExecutor$Worker.run(ThreadPoolExecutor.java:908)
NonActGrp-out: 	at java.lang.Thread.run(Thread.java:662)
QATestEnvironment.tearDown FINE: Destroying remaining managed services
AdminManager.destroyService FINE: destroying service: class com.sun.jini.qa.harness.NonActivatableGroupImpl$GroupImpl_Stub
AdminManager.destroyService FINE: destroying service: class com.sun.jini.tool.ClassServer
Mar 11, 2013 6:01:42 PM com.sun.jini.tool.ClassServer terminate
INFO: ClassServer terminated [port 9081]
AdminManager.destroyService FINE: destroying service: class com.sun.jini.tool.ClassServer
Mar 11, 2013 6:01:42 PM com.sun.jini.tool.ClassServer terminate
INFO: ClassServer terminated [port 9081]
Mar 11, 2013 6:01:42 PM com.sun.jini.tool.ClassServer terminate
INFO: ClassServer terminated [port 9080]
AdminManager.destroyService FINE: destroying service: class com.sun.jini.tool.ClassServer
Mar 11, 2013 6:01:42 PM com.sun.jini.tool.ClassServer terminate
INFO: ClassServer terminated [port 9080]
Mar 11, 2013 6:01:42 PM com.sun.jini.tool.ClassServer terminate
INFO: ClassServer terminated [port 9082]
Mar 11, 2013 6:01:42 PM com.sun.jini.tool.ClassServer terminate
INFO: ClassServer terminated [port 9082]
com.sun.jini.qa.harness.TestException: Problem creating service for net.jini.core.lookup.ServiceRegistrar;
nested exception is:
	Error occurred in server thread; nested exception is:
	java.lang.NoClassDefFoundError: net/jini/lookup/DiscoveryAdmin
	at com.sun.jini.qa.harness.NonActivatableServiceStarterAdmin.start(NonActivatableServiceStarterAdmin.java:157)
	at com.sun.jini.qa.harness.AdminManager.startService(AdminManager.java:639)
	at com.sun.jini.qa.harness.AdminManager.startService(AdminManager.java:660)
	at com.sun.jini.qa.harness.AdminManager.startLookupService(AdminManager.java:679)
	at com.sun.jini.test.share.DiscoveryProtocolSimulator.<init>(DiscoveryProtocolSimulator.java:240)
	at com.sun.jini.test.share.LookupServices.startLookup(LookupServices.java:533)
	at com.sun.jini.test.share.LookupServices.startInitLookups(LookupServices.java:396)
	at com.sun.jini.test.share.BaseQATest.startInitLookups(BaseQATest.java:1473)
	at com.sun.jini.test.share.BaseQATest.construct(BaseQATest.java:1078)
	at com.sun.jini.test.spec.lookupdiscovery.AbstractBaseTest.construct(AbstractBaseTest.java:78)
	at com.sun.jini.test.spec.lookupdiscovery.Discovered.construct(Discovered.java:70)
	at com.sun.jini.qa.harness.MasterTest.doTest(MasterTest.java:220)
	at com.sun.jini.qa.harness.MasterTest.main(MasterTest.java:144)
Caused by: java.rmi.ServerError: Error occurred in server thread; nested exception is:
	java.lang.NoClassDefFoundError: net/jini/lookup/DiscoveryAdmin
	at sun.rmi.server.UnicastServerRef.dispatch(UnicastServerRef.java:333)
	at sun.rmi.transport.Transport$1.run(Transport.java:159)
	at java.security.AccessController.doPrivileged(Native Method)
	at sun.rmi.transport.Transport.serviceCall(Transport.java:155)
	at sun.rmi.transport.tcp.TCPTransport.handleMessages(TCPTransport.java:535)
	at sun.rmi.transport.tcp.TCPTransport$ConnectionHandler.run0(TCPTransport.java:790)
	at sun.rmi.transport.tcp.TCPTransport$ConnectionHandler.run(TCPTransport.java:649)
	at java.util.concurrent.ThreadPoolExecutor$Worker.runTask(ThreadPoolExecutor.java:886)
	at java.util.concurrent.ThreadPoolExecutor$Worker.run(ThreadPoolExecutor.java:908)
	at java.lang.Thread.run(Thread.java:662)
	at sun.rmi.transport.StreamRemoteCall.exceptionReceivedFromServer(StreamRemoteCall.java:255)
	at sun.rmi.transport.StreamRemoteCall.executeCall(StreamRemoteCall.java:233)
	at sun.rmi.server.UnicastRef.invoke(UnicastRef.java:142)
	at com.sun.jini.qa.harness.NonActivatableGroupImpl$GroupImpl_Stub.startService(Unknown Source)
	at com.sun.jini.qa.harness.NonActivatableServiceStarterAdmin.start(NonActivatableServiceStarterAdmin.java:148)
	... 12 more
Caused by: java.lang.NoClassDefFoundError: net/jini/lookup/DiscoveryAdmin
	at java.lang.ClassLoader.defineClass1(Native Method)
	at java.lang.ClassLoader.defineClassCond(ClassLoader.java:631)
	at java.lang.ClassLoader.defineClass(ClassLoader.java:615)
	at java.security.SecureClassLoader.defineClass(SecureClassLoader.java:141)
	at java.net.URLClassLoader.defineClass(URLClassLoader.java:283)
	at java.net.URLClassLoader.access$000(URLClassLoader.java:58)
	at java.net.URLClassLoader$1.run(URLClassLoader.java:197)
	at java.security.AccessController.doPrivileged(Native Method)
	at java.net.URLClassLoader.findClass(URLClassLoader.java:190)
	at java.lang.ClassLoader.loadClass(ClassLoader.java:306)
	at net.jini.loader.pref.PreferredClassLoader.loadClass(PreferredClassLoader.java:984)
	at java.lang.ClassLoader.loadClass(ClassLoader.java:247)
	at java.lang.ClassLoader.defineClass1(Native Method)
	at java.lang.ClassLoader.defineClassCond(ClassLoader.java:631)
	at java.lang.ClassLoader.defineClass(ClassLoader.java:615)
	at java.security.SecureClassLoader.defineClass(SecureClassLoader.java:141)
	at java.net.URLClassLoader.defineClass(URLClassLoader.java:283)
	at java.net.URLClassLoader.access$000(URLClassLoader.java:58)
	at java.net.URLClassLoader$1.run(URLClassLoader.java:197)
	at java.security.AccessController.doPrivileged(Native Method)
	at java.net.URLClassLoader.findClass(URLClassLoader.java:190)
	at java.lang.ClassLoader.loadClass(ClassLoader.java:306)
	at net.jini.loader.pref.PreferredClassLoader.loadClass(PreferredClassLoader.java:984)
	at java.lang.ClassLoader.loadClass(ClassLoader.java:247)
	at java.lang.Class.forName0(Native Method)
	at java.lang.Class.forName(Class.java:247)
	at com.sun.jini.start.NonActivatableServiceDescriptor.create(NonActivatableServiceDescriptor.java:649)
	at com.sun.jini.qa.harness.NonActivatableGroupImpl$GroupImpl.startService(NonActivatableGroupImpl.java:182)
	at sun.reflect.NativeMethodAccessorImpl.invoke0(Native Method)
	at sun.reflect.NativeMethodAccessorImpl.invoke(NativeMethodAccessorImpl.java:39)
	at sun.reflect.DelegatingMethodAccessorImpl.invoke(DelegatingMethodAccessorImpl.java:25)
	at java.lang.reflect.Method.invoke(Method.java:597)
	at sun.rmi.server.UnicastServerRef.dispatch(UnicastServerRef.java:305)
	at sun.rmi.transport.Transport$1.run(Transport.java:159)
	at java.security.AccessController.doPrivileged(Native Method)
	at sun.rmi.transport.Transport.serviceCall(Transport.java:155)
	at sun.rmi.transport.tcp.TCPTransport.handleMessages(TCPTransport.java:535)
	at sun.rmi.transport.tcp.TCPTransport$ConnectionHandler.run0(TCPTransport.java:790)
	at sun.rmi.transport.tcp.TCPTransport$ConnectionHandler.run(TCPTransport.java:649)
	at java.util.concurrent.ThreadPoolExecutor$Worker.runTask(ThreadPoolExecutor.java:886)
	at java.util.concurrent.ThreadPoolExecutor$Worker.run(ThreadPoolExecutor.java:908)
	at java.lang.Thread.run(Thread.java:662)
Caused by: java.lang.ClassNotFoundException: net.jini.lookup.DiscoveryAdmin
	at java.net.URLClassLoader$1.run(URLClassLoader.java:202)
	at java.security.AccessController.doPrivileged(Native Method)
	at java.net.URLClassLoader.findClass(URLClassLoader.java:190)
	at java.lang.ClassLoader.loadClass(ClassLoader.java:306)
	at net.jini.loader.pref.PreferredClassLoader.loadClass(PreferredClassLoader.java:984)
	at java.lang.ClassLoader.loadClass(ClassLoader.java:247)
	... 42 more
MasterTest.doTest INFO:
============================ CALLING TEARDOWN() =============================

QATestEnvironment.tearDown FINE: Destroying remaining managed services

TIME: 6:01:42 PM

Test process was destroyed and returned code 1
com/sun/jini/test/spec/lookupdiscovery/DiscardUnreachable.td
Test Failed: Construct Failed: com.sun.jini.qa.harness.TestException: Problem creating service
for net.jini.core.lookup.ServiceRegistrar; nested exception is:
	Error occurred in server thread; nested exception is:
	java.lang.NoClassDefFoundError: net/jini/lookup/DiscoveryAdmin




Mime
View raw message