river-dev mailing list archives

Site index · List index
Message view « Date » · « Thread »
Top « Date » · « Thread »
From Apache Jenkins Server <jenk...@builds.apache.org>
Subject Build failed in Jenkins: river-qa-refactor-windows #29
Date Sun, 03 Mar 2013 07:30:10 GMT
See <https://builds.apache.org/job/river-qa-refactor-windows/29/changes>

Changes:

[peter_firmstone] Fix UriString normalisation, related to test failure of com/sun/jini/test/impl/start/CodebaseTest.td
on OSX.

Refactor Distributed, renamed SerialFactory to SerialReflectionFactory to more accurately
describe function.

Improved performance of SerialReflectionFactory, by serialising primitive Object parameters
as primitives instead of objects.

[peter_firmstone] Fix UriString normalisation, related to test failure of com/sun/jini/test/impl/start/CodebaseTest.td
on OSX.

------------------------------------------
[...truncated 8737 lines...]
     [java] com/sun/jini/test/spec/javaspace/conformance/snapshot/SnapshotTransactionMultipleTakeIfExistsNO_WAITTest.td
     [java] Test Failed: runTestOtherVM failed: java.io.IOException: The pipe is being closed
     [java] -----------------------------------------
     [java] com/sun/jini/test/spec/javaspace/conformance/snapshot/SnapshotTransactionMultipleTakeIfExistsTest.td
     [java] Test Failed: runTestOtherVM failed: java.io.IOException: The pipe is being closed
     [java] -----------------------------------------
     [java] com/sun/jini/test/spec/javaspace/conformance/snapshot/SnapshotTransactionMultipleTakeNO_WAITTest.td
     [java] Test Failed: runTestOtherVM failed: java.io.IOException: The pipe is being closed
     [java] -----------------------------------------
     [java] com/sun/jini/test/spec/javaspace/conformance/snapshot/SnapshotTransactionMultipleTakeTest.td
     [java] Test Failed: runTestOtherVM failed: java.io.IOException: The pipe is being closed
     [java] -----------------------------------------
     [java] com/sun/jini/test/spec/javaspace/conformance/snapshot/SnapshotTransactionNotifyLeaseANYTest.td
     [java] Test Failed: runTestOtherVM failed: java.io.IOException: The pipe is being closed
     [java] -----------------------------------------
     [java] com/sun/jini/test/spec/javaspace/conformance/snapshot/SnapshotTransactionNotifyLeaseFOREVERTest.td
     [java] Test Failed: runTestOtherVM failed: java.io.IOException: The pipe is being closed
     [java] -----------------------------------------
     [java] com/sun/jini/test/spec/javaspace/conformance/snapshot/SnapshotTransactionNotifyNegativeLeaseTest.td
     [java] Test Failed: runTestOtherVM failed: java.io.IOException: The pipe is being closed
     [java] -----------------------------------------
     [java] com/sun/jini/test/spec/javaspace/conformance/snapshot/SnapshotTransactionNotifyTest.td
     [java] Test Failed: runTestOtherVM failed: java.io.IOException: The pipe is being closed
     [java] -----------------------------------------
     [java] com/sun/jini/test/spec/javaspace/conformance/snapshot/SnapshotTransactionReadIfExistsNO_WAITTest.td
     [java] Test Failed: runTestOtherVM failed: java.io.IOException: The pipe is being closed
     [java] -----------------------------------------
     [java] com/sun/jini/test/spec/javaspace/conformance/snapshot/SnapshotTransactionReadIfExistsTakeTest.td
     [java] Test Failed: runTestOtherVM failed: java.io.IOException: The pipe is being closed
     [java] -----------------------------------------
     [java] com/sun/jini/test/spec/javaspace/conformance/snapshot/SnapshotTransactionReadIfExistsTest.td
     [java] Test Failed: runTestOtherVM failed: java.io.IOException: The pipe is being closed
     [java] -----------------------------------------
     [java] com/sun/jini/test/spec/javaspace/conformance/snapshot/SnapshotTransactionReadIfExistsWaitTest.td
     [java] Test Failed: runTestOtherVM failed: java.io.IOException: The pipe is being closed
     [java] -----------------------------------------
     [java] com/sun/jini/test/spec/javaspace/conformance/snapshot/SnapshotTransactionReadNO_WAITTest.td
     [java] Test Failed: runTestOtherVM failed: java.io.IOException: The pipe is being closed
     [java] -----------------------------------------
     [java] com/sun/jini/test/spec/javaspace/conformance/snapshot/SnapshotTransactionReadTakeTest.td
     [java] Test Failed: runTestOtherVM failed: java.io.IOException: The pipe is being closed
     [java] -----------------------------------------
     [java] com/sun/jini/test/spec/javaspace/conformance/snapshot/SnapshotTransactionReadTest.td
     [java] Test Failed: runTestOtherVM failed: java.io.IOException: The pipe is being closed
     [java] -----------------------------------------
     [java] com/sun/jini/test/spec/javaspace/conformance/snapshot/SnapshotTransactionReadWaitTest.td
     [java] Test Failed: runTestOtherVM failed: java.io.IOException: The pipe is being closed
     [java] -----------------------------------------
     [java] com/sun/jini/test/spec/javaspace/conformance/snapshot/SnapshotTransactionTakeIfExistsNO_WAITTest.td
     [java] Test Failed: runTestOtherVM failed: java.io.IOException: The pipe is being closed
     [java] -----------------------------------------
     [java] com/sun/jini/test/spec/javaspace/conformance/snapshot/SnapshotTransactionTakeIfExistsReadTest.td
     [java] Test Failed: runTestOtherVM failed: java.io.IOException: The pipe is being closed
     [java] -----------------------------------------
     [java] com/sun/jini/test/spec/javaspace/conformance/snapshot/SnapshotTransactionTakeIfExistsTest.td
     [java] Test Failed: runTestOtherVM failed: java.io.IOException: The pipe is being closed
     [java] -----------------------------------------
     [java] com/sun/jini/test/spec/javaspace/conformance/snapshot/SnapshotTransactionTakeIfExistsWaitTest.td
     [java] Test Failed: runTestOtherVM failed: java.io.IOException: The pipe is being closed
     [java] -----------------------------------------
     [java] com/sun/jini/test/spec/javaspace/conformance/snapshot/SnapshotTransactionTakeNO_WAITTest.td
     [java] Test Failed: runTestOtherVM failed: java.io.IOException: The pipe is being closed
     [java] -----------------------------------------
     [java] com/sun/jini/test/spec/javaspace/conformance/snapshot/SnapshotTransactionTakeReadTest.td
     [java] Test Failed: runTestOtherVM failed: java.io.IOException: The pipe is being closed
     [java] -----------------------------------------
     [java] com/sun/jini/test/spec/javaspace/conformance/snapshot/SnapshotTransactionTakeTest.td
     [java] Test Failed: runTestOtherVM failed: java.io.IOException: The pipe is being closed
     [java] -----------------------------------------
     [java] com/sun/jini/test/spec/javaspace/conformance/snapshot/SnapshotTransactionTakeWaitTest.td
     [java] Test Failed: runTestOtherVM failed: java.io.IOException: The pipe is being closed
     [java] -----------------------------------------
     [java] com/sun/jini/test/spec/javaspace/conformance/snapshot/SnapshotTransactionWriteLeaseANYTest.td
     [java] Test Failed: runTestOtherVM failed: java.io.IOException: The pipe is being closed
     [java] -----------------------------------------
     [java] com/sun/jini/test/spec/javaspace/conformance/snapshot/SnapshotTransactionWriteLeaseFOREVERTest.td
     [java] Test Failed: runTestOtherVM failed: java.io.IOException: The pipe is being closed
     [java] -----------------------------------------
     [java] com/sun/jini/test/spec/javaspace/conformance/snapshot/SnapshotTransactionWriteNegativeLeaseTest.td
     [java] Test Failed: runTestOtherVM failed: java.io.IOException: The pipe is being closed
     [java] -----------------------------------------
     [java] com/sun/jini/test/spec/javaspace/conformance/snapshot/SnapshotTransactionWriteTakeIfExistsNotifyTest.td
     [java] Test Failed: runTestOtherVM failed: java.io.IOException: The pipe is being closed
     [java] -----------------------------------------
     [java] com/sun/jini/test/spec/javaspace/conformance/snapshot/SnapshotTransactionWriteTakeIfExistsTest.td
     [java] Test Failed: runTestOtherVM failed: java.io.IOException: The pipe is being closed
     [java] -----------------------------------------
     [java] com/sun/jini/test/spec/javaspace/conformance/snapshot/SnapshotTransactionWriteTakeNotifyTest.td
     [java] Test Failed: runTestOtherVM failed: java.io.IOException: The pipe is being closed
     [java] -----------------------------------------
     [java] com/sun/jini/test/spec/javaspace/conformance/snapshot/SnapshotTransactionWriteTakeTest.td
     [java] Test Failed: runTestOtherVM failed: java.io.IOException: The pipe is being closed
     [java] -----------------------------------------
     [java] com/sun/jini/test/spec/javaspace/conformance/snapshot/SnapshotTransactionWriteTest.td
     [java] Test Failed: runTestOtherVM failed: java.io.IOException: The pipe is being closed
     [java] -----------------------------------------
     [java] com/sun/jini/test/spec/javaspace/conformance/snapshot/SnapshotWriteLeaseANYTest.td
     [java] Test Failed: runTestOtherVM failed: java.io.IOException: The pipe is being closed
     [java] -----------------------------------------
     [java] com/sun/jini/test/spec/javaspace/conformance/snapshot/SnapshotWriteLeaseFOREVERTest.td
     [java] Test Failed: runTestOtherVM failed: java.io.IOException: The pipe is being closed
     [java] -----------------------------------------
     [java] com/sun/jini/test/spec/javaspace/conformance/snapshot/SnapshotWriteNegativeLeaseTest.td
     [java] Test Failed: runTestOtherVM failed: java.io.IOException: The pipe is being closed
     [java] -----------------------------------------
     [java] com/sun/jini/test/spec/javaspace/conformance/snapshot/SnapshotWriteTest.td
     [java] Test Failed: runTestOtherVM failed: java.io.IOException: The pipe is being closed
     [java] -----------------------------------------
     [java] com/sun/jini/test/impl/mahalo/AdminIFShutdownTest.td
     [java] Test Failed: runTestOtherVM failed: java.io.IOException: The pipe is being closed
     [java] -----------------------------------------
     [java] com/sun/jini/test/impl/mahalo/AdminIFTest.td
     [java] Test Failed: runTestOtherVM failed: java.io.IOException: The pipe is being closed
     [java] -----------------------------------------
     [java] com/sun/jini/test/impl/mahalo/LeaseExpireCancelTest.td
     [java] Test Failed: runTestOtherVM failed: java.io.IOException: The pipe is being closed
     [java] -----------------------------------------
     [java] com/sun/jini/test/impl/mahalo/LeaseExpireRenewTest.td
     [java] Test Failed: runTestOtherVM failed: java.io.IOException: The pipe is being closed
     [java] -----------------------------------------
     [java] com/sun/jini/test/impl/mahalo/LeaseMapTest.td
     [java] Test Failed: runTestOtherVM failed: java.io.IOException: The pipe is being closed
     [java] -----------------------------------------
     [java] com/sun/jini/test/impl/mahalo/LeaseTest.td
     [java] Test Failed: runTestOtherVM failed: java.io.IOException: The pipe is being closed
     [java] -----------------------------------------
     [java] com/sun/jini/test/impl/mahalo/MahaloCreateShutdownTest.td
     [java] Test Failed: runTestOtherVM failed: java.io.IOException: The pipe is being closed
     [java] -----------------------------------------
     [java] com/sun/jini/test/impl/mahalo/MahaloIFTest.td
     [java] Test Failed: runTestOtherVM failed: java.io.IOException: The pipe is being closed
     [java] -----------------------------------------
     [java] com/sun/jini/test/impl/mahalo/MahaloImplReadyStateTest.td
     [java] Test Skipped: verifiers are: com.sun.jini.test.impl.mercury.ActivatableMercuryVerifier
com.sun.jini.qa.harness.SkipConfigTestVerifier
     [java] -----------------------------------------
     [java] com/sun/jini/test/impl/mahalo/NestableServerTransactionCreatedToStringTest.td
     [java] Test Failed: runTestOtherVM failed: java.io.IOException: The pipe is being closed
     [java] -----------------------------------------
     [java] com/sun/jini/test/impl/mahalo/NestableTransactionCreatedToStringTest.td
     [java] Test Failed: runTestOtherVM failed: java.io.IOException: The pipe is being closed
     [java] -----------------------------------------
     [java] com/sun/jini/test/impl/mahalo/PrepareAndCommitExceptionTest.td
     [java] Test Failed: runTestOtherVM failed: java.io.IOException: The pipe is being closed
     [java] -----------------------------------------
     [java] com/sun/jini/test/impl/mahalo/PrepareAndCommitExceptionTest2.td
     [java] Test Failed: runTestOtherVM failed: java.io.IOException: The pipe is being closed
     [java] -----------------------------------------
     [java] com/sun/jini/test/impl/mahalo/PrepareAndCommitExceptionTest3.td
     [java] Test Failed: runTestOtherVM failed: java.io.IOException: The pipe is being closed
     [java] -----------------------------------------
     [java] com/sun/jini/test/impl/mahalo/PrepareAndCommitExceptionTest4.td
     [java] Test Failed: runTestOtherVM failed: java.io.IOException: The pipe is being closed
     [java] -----------------------------------------
     [java] com/sun/jini/test/impl/mahalo/PrepareAndCommitExceptionTest5.td
     [java] Test Failed: runTestOtherVM failed: java.io.IOException: The pipe is being closed
     [java] -----------------------------------------
     [java] com/sun/jini/test/impl/mahalo/RandomStressTest.td
     [java] Test Failed: runTestOtherVM failed: java.io.IOException: The pipe is being closed
     [java] -----------------------------------------
     [java] com/sun/jini/test/impl/mahalo/ServerTransactionEqualityTest.td
     [java] Test Failed: runTestOtherVM failed: java.io.IOException: The pipe is being closed
     [java] -----------------------------------------
     [java] com/sun/jini/test/impl/mahalo/ServerTransactionToStringTest.td
     [java] Test Failed: runTestOtherVM failed: java.io.IOException: The pipe is being closed
     [java] -----------------------------------------
     [java] com/sun/jini/test/impl/mahalo/TransactionCreatedToStringTest.td
     [java] Test Failed: runTestOtherVM failed: java.io.IOException: The pipe is being closed
     [java] -----------------------------------------
     [java] com/sun/jini/test/impl/mahalo/TransactionManagerCreatedToStringTest.td
     [java] Test Failed: runTestOtherVM failed: java.io.IOException: The pipe is being closed
     [java] -----------------------------------------
     [java] com/sun/jini/test/impl/mahalo/TxnMgrImplNullActivationConfigEntries.td
     [java] Test Skipped: verifiers are: com.sun.jini.test.impl.mahalo.ActivatableMahaloVerifier
     [java] -----------------------------------------
     [java] com/sun/jini/test/impl/mahalo/TxnMgrImplNullConfigEntries.td
     [java] Test Failed: runTestOtherVM failed: java.io.IOException: The pipe is being closed
     [java] -----------------------------------------
     [java] com/sun/jini/test/impl/mahalo/TxnMgrImplNullRecoveredLocators.td
     [java] Test Skipped: verifiers are: com.sun.jini.test.impl.mahalo.ActivatableMahaloVerifier
     [java] -----------------------------------------
     [java] com/sun/jini/test/impl/mahalo/TxnMgrProxyEqualityTest.td
     [java] Test Failed: runTestOtherVM failed: java.io.IOException: The pipe is being closed
     [java] -----------------------------------------
     [java] com/sun/jini/test/spec/txnmanager/AsynchAbortOnCommitTest.td
     [java] Test Failed: runTestOtherVM failed: java.io.IOException: The pipe is being closed
     [java] -----------------------------------------
     [java] com/sun/jini/test/spec/txnmanager/AsynchAbortOnPrepareTest.td
     [java] Test Failed: runTestOtherVM failed: java.io.IOException: The pipe is being closed
     [java] -----------------------------------------
     [java] com/sun/jini/test/spec/txnmanager/CommitExpiredTest.td
     [java] Test Failed: runTestOtherVM failed: java.io.IOException: The pipe is being closed
     [java] -----------------------------------------
     [java] com/sun/jini/test/spec/txnmanager/CommitTimeoutTest.td
     [java] Test Failed: runTestOtherVM failed: java.io.IOException: The pipe is being closed
     [java] -----------------------------------------
     [java] com/sun/jini/test/spec/txnmanager/GetStateTest.td
     [java] Test Failed: runTestOtherVM failed: java.io.IOException: The pipe is being closed
     [java] -----------------------------------------
     [java] com/sun/jini/test/spec/txnmanager/JoinIdempotentTest.td
     [java] Test Failed: runTestOtherVM failed: java.io.IOException: The pipe is being closed
     [java] -----------------------------------------
     [java] com/sun/jini/test/spec/txnmanager/JoinWhileActiveTest.td
     [java] Test Failed: runTestOtherVM failed: java.io.IOException: The pipe is being closed
     [java] -----------------------------------------
     [java] com/sun/jini/test/spec/txnmanager/ManyParticipantsTest.td
     [java] Test Failed: runTestOtherVM failed: java.io.IOException: The pipe is being closed
     [java] -----------------------------------------
     [java] com/sun/jini/test/spec/txnmanager/PrepareTimeoutTest.td
     [java] Test Failed: runTestOtherVM failed: java.io.IOException: The pipe is being closed
     [java] -----------------------------------------
     [java] com/sun/jini/test/spec/txnmanager/RollBackErrorTest.td
     [java] Test Failed: runTestOtherVM failed: java.io.IOException: The pipe is being closed
     [java] -----------------------------------------
     [java] com/sun/jini/test/spec/txnmanager/RollForwardErrorTest.td
     [java] Test Failed: runTestOtherVM failed: java.io.IOException: The pipe is being closed
     [java] -----------------------------------------
     [java] com/sun/jini/test/spec/txnmanager/TwoPhaseTest.td
     [java] Test Failed: runTestOtherVM failed: java.io.IOException: The pipe is being closed
     [java] -----------------------------------------
     [java] 
     [java] # of tests started   = 1412
     [java] # of tests completed = 1412
     [java] # of tests skipped   = 46
     [java] # of tests passed    = 530
     [java] # of tests failed    = 882
     [java] 
     [java] -----------------------------------------
     [java] 
     [java]    Date finished:
     [java]       Sun Mar 03 07:29:37 GMT 2013
     [java]    Time elapsed:
     [java]       19681 seconds
     [java] 
     [java] Java Result: 1

collect-result:
     [copy] Copying 1 file to <https://builds.apache.org/job/river-qa-refactor-windows/ws/trunk\qa\result>
     [copy] Copying 1 file to <https://builds.apache.org/job/river-qa-refactor-windows/ws/trunk\qa\result>
      [zip] Building zip: <https://builds.apache.org/job/river-qa-refactor-windows/ws/trunk\qa\result\qaresults-amd64-Windows>
Server 2008-1.6.0_27.zip

BUILD FAILED
<https://builds.apache.org/job/river-qa-refactor-windows/ws/trunk\build.xml>:2093: The
following error occurred while executing this line:
<https://builds.apache.org/job/river-qa-refactor-windows/ws/trunk\qa\build.xml>:406:
The following error occurred while executing this line:
<https://builds.apache.org/job/river-qa-refactor-windows/ws/trunk\qa\build.xml>:380:
condition satisfied

Total time: 337 minutes 37 seconds
Process leaked file descriptors. See http://wiki.jenkins-ci.org/display/JENKINS/Spawning+processes+from+build
for more information
Build step 'Invoke Ant' marked build as failure
Archiving artifacts

Mime
View raw message