river-dev mailing list archives

Site index · List index
Message view « Date » · « Thread »
Top « Date » · « Thread »
From Apache Jenkins Server <jenk...@builds.apache.org>
Subject Build failed in Jenkins: river-qa-refactoring-solaris #32
Date Tue, 26 Feb 2013 16:53:24 GMT
See <https://builds.apache.org/job/river-qa-refactoring-solaris/32/changes>

Changes:

[peter_firmstone] Ensure action fields are populated before publishing Permission objects.

[peter_firmstone] Refactoring: delete commented out code, rename field

[peter_firmstone] Modifications to ensure safe publication of Permission after parsing.

[peter_firmstone] Ensure AggregatePolicyProvider blocks during modification.

------------------------------------------
[...truncated 11213 lines...]
     [java] -----------------------------------------
     [java] com/sun/jini/test/impl/mahalo/AdminIFTest.td
     [java] Test Failed: Test Failed: com.sun.jini.qa.harness.TestException: Exception has
been caught in specifyServices: Problem creating service for net.jini.core.transaction.server.TransactionManager;
nested exception is: 
     [java] 	Failed to start the shared nonactivatable group; nested exception is: 
     [java] 	NonActivatableGroupAdmin: Failed to exec the group; nested exception is: 
     [java] 	null
     [java] 
     [java] -----------------------------------------
     [java] com/sun/jini/test/impl/mahalo/LeaseExpireCancelTest.td
     [java] Test Failed: Test Failed: com.sun.jini.qa.harness.TestException: Exception has
been caught in specifyServices: Problem creating service for net.jini.core.transaction.server.TransactionManager;
nested exception is: 
     [java] 	Failed to start the shared nonactivatable group; nested exception is: 
     [java] 	NonActivatableGroupAdmin: Failed to exec the group; nested exception is: 
     [java] 	null
     [java] 
     [java] -----------------------------------------
     [java] com/sun/jini/test/impl/mahalo/LeaseExpireRenewTest.td
     [java] Test Failed: Test Failed: com.sun.jini.qa.harness.TestException: Exception has
been caught in specifyServices: Problem creating service for net.jini.core.transaction.server.TransactionManager;
nested exception is: 
     [java] 	Failed to start the shared nonactivatable group; nested exception is: 
     [java] 	NonActivatableGroupAdmin: Failed to exec the group; nested exception is: 
     [java] 	null
     [java] 
     [java] -----------------------------------------
     [java] com/sun/jini/test/impl/mahalo/LeaseMapTest.td
     [java] Test Failed: Test Failed: com.sun.jini.qa.harness.TestException: Exception has
been caught in specifyServices: Problem creating service for net.jini.core.transaction.server.TransactionManager;
nested exception is: 
     [java] 	Failed to start the shared nonactivatable group; nested exception is: 
     [java] 	NonActivatableGroupAdmin: Failed to exec the group; nested exception is: 
     [java] 	null
     [java] 
     [java] -----------------------------------------
     [java] com/sun/jini/test/impl/mahalo/LeaseTest.td
     [java] Test Failed: Test Failed: com.sun.jini.qa.harness.TestException: Exception has
been caught in specifyServices: Problem creating service for net.jini.core.transaction.server.TransactionManager;
nested exception is: 
     [java] 	Failed to start the shared nonactivatable group; nested exception is: 
     [java] 	NonActivatableGroupAdmin: Failed to exec the group; nested exception is: 
     [java] 	null
     [java] 
     [java] -----------------------------------------
     [java] com/sun/jini/test/impl/mahalo/MahaloCreateShutdownTest.td
     [java] Test Passed: OK
     [java] 
     [java] -----------------------------------------
     [java] com/sun/jini/test/impl/mahalo/MahaloIFTest.td
     [java] Test Passed: OK
     [java] 
     [java] -----------------------------------------
     [java] com/sun/jini/test/impl/mahalo/MahaloImplReadyStateTest.td
     [java] Test Skipped: verifiers are: com.sun.jini.test.impl.mercury.ActivatableMercuryVerifier
com.sun.jini.qa.harness.SkipConfigTestVerifier
     [java] -----------------------------------------
     [java] com/sun/jini/test/impl/mahalo/NestableServerTransactionCreatedToStringTest.td
     [java] Test Passed: OK
     [java] 
     [java] -----------------------------------------
     [java] com/sun/jini/test/impl/mahalo/NestableTransactionCreatedToStringTest.td
     [java] Test Passed: OK
     [java] 
     [java] -----------------------------------------
     [java] com/sun/jini/test/impl/mahalo/PrepareAndCommitExceptionTest.td
     [java] Test Failed: Test Failed: com.sun.jini.qa.harness.TestException: Exception has
been caught in specifyServices: Problem creating service for net.jini.core.transaction.server.TransactionManager;
nested exception is: 
     [java] 	Failed to start the shared nonactivatable group; nested exception is: 
     [java] 	NonActivatableGroupAdmin: Failed to exec the group; nested exception is: 
     [java] 	null
     [java] 
     [java] -----------------------------------------
     [java] com/sun/jini/test/impl/mahalo/PrepareAndCommitExceptionTest2.td
     [java] Test Failed: Test Failed: com.sun.jini.qa.harness.TestException: Exception has
been caught in specifyServices: Problem creating service for net.jini.core.transaction.server.TransactionManager;
nested exception is: 
     [java] 	Failed to start the shared nonactivatable group; nested exception is: 
     [java] 	NonActivatableGroupAdmin: Failed to exec the group; nested exception is: 
     [java] 	null
     [java] 
     [java] -----------------------------------------
     [java] com/sun/jini/test/impl/mahalo/PrepareAndCommitExceptionTest3.td
     [java] Test Failed: Test Failed: com.sun.jini.qa.harness.TestException: Exception has
been caught in specifyServices: Problem creating service for net.jini.core.transaction.server.TransactionManager;
nested exception is: 
     [java] 	Failed to start the shared nonactivatable group; nested exception is: 
     [java] 	NonActivatableGroupAdmin: Failed to exec the group; nested exception is: 
     [java] 	null
     [java] 
     [java] -----------------------------------------
     [java] com/sun/jini/test/impl/mahalo/PrepareAndCommitExceptionTest4.td
     [java] Test Failed: Test Failed: com.sun.jini.qa.harness.TestException: Exception has
been caught in specifyServices: Problem creating service for net.jini.core.transaction.server.TransactionManager;
nested exception is: 
     [java] 	Failed to start the shared nonactivatable group; nested exception is: 
     [java] 	NonActivatableGroupAdmin: Failed to exec the group; nested exception is: 
     [java] 	null
     [java] 
     [java] -----------------------------------------
     [java] com/sun/jini/test/impl/mahalo/PrepareAndCommitExceptionTest5.td
     [java] Test Failed: Test Failed: com.sun.jini.qa.harness.TestException: Exception has
been caught in specifyServices: Problem creating service for net.jini.core.transaction.server.TransactionManager;
nested exception is: 
     [java] 	Failed to start the shared nonactivatable group; nested exception is: 
     [java] 	NonActivatableGroupAdmin: Failed to exec the group; nested exception is: 
     [java] 	null
     [java] 
     [java] -----------------------------------------
     [java] com/sun/jini/test/impl/mahalo/RandomStressTest.td
     [java] Test Failed: Test Failed: com.sun.jini.qa.harness.TestException: Exception has
been caught in specifyServices: Problem creating service for net.jini.core.transaction.server.TransactionManager;
nested exception is: 
     [java] 	Failed to start the shared nonactivatable group; nested exception is: 
     [java] 	NonActivatableGroupAdmin: Failed to exec the group; nested exception is: 
     [java] 	null
     [java] 
     [java] -----------------------------------------
     [java] com/sun/jini/test/impl/mahalo/ServerTransactionEqualityTest.td
     [java] Test Failed: Test Failed: com.sun.jini.qa.harness.TestException: Exception has
been caught in specifyServices: Problem creating service for net.jini.core.transaction.server.TransactionManager;
nested exception is: 
     [java] 	Failed to start the shared nonactivatable group; nested exception is: 
     [java] 	NonActivatableGroupAdmin: Failed to exec the group; nested exception is: 
     [java] 	null
     [java] 
     [java] -----------------------------------------
     [java] com/sun/jini/test/impl/mahalo/ServerTransactionToStringTest.td
     [java] Test Failed: Test Failed: com.sun.jini.qa.harness.TestException: Exception has
been caught in specifyServices: Problem creating service for net.jini.core.transaction.server.TransactionManager;
nested exception is: 
     [java] 	Failed to start the shared nonactivatable group; nested exception is: 
     [java] 	NonActivatableGroupAdmin: Failed to exec the group; nested exception is: 
     [java] 	null
     [java] 
     [java] -----------------------------------------
     [java] com/sun/jini/test/impl/mahalo/TransactionCreatedToStringTest.td
     [java] Test Passed: OK
     [java] 
     [java] -----------------------------------------
     [java] com/sun/jini/test/impl/mahalo/TransactionManagerCreatedToStringTest.td
     [java] Test Passed: OK
     [java] 
     [java] -----------------------------------------
     [java] com/sun/jini/test/impl/mahalo/TxnMgrImplNullActivationConfigEntries.td
     [java] Test Skipped: verifiers are: com.sun.jini.test.impl.mahalo.ActivatableMahaloVerifier
     [java] -----------------------------------------
     [java] com/sun/jini/test/impl/mahalo/TxnMgrImplNullConfigEntries.td
     [java] Test Failed: Test Failed: com.sun.jini.qa.harness.TestException: Service failed
due to non-configuration relatedexception.
     [java] 
     [java] -----------------------------------------
     [java] com/sun/jini/test/impl/mahalo/TxnMgrImplNullRecoveredLocators.td
     [java] Test Skipped: verifiers are: com.sun.jini.test.impl.mahalo.ActivatableMahaloVerifier
     [java] -----------------------------------------
     [java] com/sun/jini/test/impl/mahalo/TxnMgrProxyEqualityTest.td
     [java] Test Failed: Test Failed: com.sun.jini.qa.harness.TestException: Exception has
been caught in specifyServices: Problem creating service for net.jini.core.transaction.server.TransactionManager;
nested exception is: 
     [java] 	Failed to start the shared nonactivatable group; nested exception is: 
     [java] 	NonActivatableGroupAdmin: Failed to exec the group; nested exception is: 
     [java] 	null
     [java] 
     [java] -----------------------------------------
     [java] com/sun/jini/test/spec/txnmanager/AsynchAbortOnCommitTest.td
     [java] Test Failed: Test Failed: com.sun.jini.qa.harness.TestException: Exception has
been caught in specifyServices: Problem creating service for net.jini.core.transaction.server.TransactionManager;
nested exception is: 
     [java] 	Failed to start the shared nonactivatable group; nested exception is: 
     [java] 	NonActivatableGroupAdmin: Failed to exec the group; nested exception is: 
     [java] 	null
     [java] 
     [java] -----------------------------------------
     [java] com/sun/jini/test/spec/txnmanager/AsynchAbortOnPrepareTest.td
     [java] Test Failed: Test Failed: com.sun.jini.qa.harness.TestException: Exception has
been caught in specifyServices: Problem creating service for net.jini.core.transaction.server.TransactionManager;
nested exception is: 
     [java] 	Failed to start the shared nonactivatable group; nested exception is: 
     [java] 	NonActivatableGroupAdmin: Failed to exec the group; nested exception is: 
     [java] 	null
     [java] 
     [java] -----------------------------------------
     [java] com/sun/jini/test/spec/txnmanager/CommitExpiredTest.td
     [java] Test Failed: Test Failed: com.sun.jini.qa.harness.TestException: Exception has
been caught in specifyServices: Problem creating service for net.jini.core.transaction.server.TransactionManager;
nested exception is: 
     [java] 	Failed to start the shared nonactivatable group; nested exception is: 
     [java] 	NonActivatableGroupAdmin: Failed to exec the group; nested exception is: 
     [java] 	null
     [java] 
     [java] -----------------------------------------
     [java] com/sun/jini/test/spec/txnmanager/CommitTimeoutTest.td
     [java] Test Failed: Test Failed: com.sun.jini.qa.harness.TestException: Exception has
been caught in specifyServices: Problem creating service for net.jini.core.transaction.server.TransactionManager;
nested exception is: 
     [java] 	Failed to start the shared nonactivatable group; nested exception is: 
     [java] 	NonActivatableGroupAdmin: Failed to exec the group; nested exception is: 
     [java] 	null
     [java] 
     [java] -----------------------------------------
     [java] com/sun/jini/test/spec/txnmanager/GetStateTest.td
     [java] Test Failed: Test Failed: com.sun.jini.qa.harness.TestException: Exception has
been caught in specifyServices: Problem creating service for net.jini.core.transaction.server.TransactionManager;
nested exception is: 
     [java] 	Failed to start the shared nonactivatable group; nested exception is: 
     [java] 	NonActivatableGroupAdmin: Failed to exec the group; nested exception is: 
     [java] 	null
     [java] 
     [java] -----------------------------------------
     [java] com/sun/jini/test/spec/txnmanager/JoinIdempotentTest.td
     [java] Test Failed: Test Failed: com.sun.jini.qa.harness.TestException: Exception has
been caught in specifyServices: Problem creating service for net.jini.core.transaction.server.TransactionManager;
nested exception is: 
     [java] 	Failed to start the shared nonactivatable group; nested exception is: 
     [java] 	NonActivatableGroupAdmin: Failed to exec the group; nested exception is: 
     [java] 	null
     [java] 
     [java] -----------------------------------------
     [java] com/sun/jini/test/spec/txnmanager/JoinWhileActiveTest.td
     [java] Test Failed: Test Failed: com.sun.jini.qa.harness.TestException: Exception has
been caught in specifyServices: Problem creating service for net.jini.core.transaction.server.TransactionManager;
nested exception is: 
     [java] 	Failed to start the shared nonactivatable group; nested exception is: 
     [java] 	NonActivatableGroupAdmin: Failed to exec the group; nested exception is: 
     [java] 	null
     [java] 
     [java] -----------------------------------------
     [java] com/sun/jini/test/spec/txnmanager/ManyParticipantsTest.td
     [java] Test Failed: Test Failed: com.sun.jini.qa.harness.TestException: Exception has
been caught in specifyServices: Problem creating service for net.jini.core.transaction.server.TransactionManager;
nested exception is: 
     [java] 	Failed to start the shared nonactivatable group; nested exception is: 
     [java] 	NonActivatableGroupAdmin: Failed to exec the group; nested exception is: 
     [java] 	null
     [java] 
     [java] -----------------------------------------
     [java] com/sun/jini/test/spec/txnmanager/PrepareTimeoutTest.td
     [java] Test Failed: Test Failed: com.sun.jini.qa.harness.TestException: Exception has
been caught in specifyServices: Problem creating service for net.jini.core.transaction.server.TransactionManager;
nested exception is: 
     [java] 	Failed to start the shared nonactivatable group; nested exception is: 
     [java] 	NonActivatableGroupAdmin: Failed to exec the group; nested exception is: 
     [java] 	null
     [java] 
     [java] -----------------------------------------
     [java] com/sun/jini/test/spec/txnmanager/RollBackErrorTest.td
     [java] Test Failed: Test Failed: com.sun.jini.qa.harness.TestException: Exception has
been caught in specifyServices: Problem creating service for net.jini.core.transaction.server.TransactionManager;
nested exception is: 
     [java] 	Failed to start the shared nonactivatable group; nested exception is: 
     [java] 	NonActivatableGroupAdmin: Failed to exec the group; nested exception is: 
     [java] 	null
     [java] 
     [java] -----------------------------------------
     [java] com/sun/jini/test/spec/txnmanager/RollForwardErrorTest.td
     [java] Test Failed: Test Failed: com.sun.jini.qa.harness.TestException: Exception has
been caught in specifyServices: Problem creating service for net.jini.core.transaction.server.TransactionManager;
nested exception is: 
     [java] 	Failed to start the shared nonactivatable group; nested exception is: 
     [java] 	NonActivatableGroupAdmin: Failed to exec the group; nested exception is: 
     [java] 	null
     [java] 
     [java] -----------------------------------------
     [java] com/sun/jini/test/spec/txnmanager/TwoPhaseTest.td
     [java] Test Failed: Test Failed: com.sun.jini.qa.harness.TestException: Exception has
been caught in specifyServices: Problem creating service for net.jini.core.transaction.server.TransactionManager;
nested exception is: 
     [java] 	Failed to start the shared nonactivatable group; nested exception is: 
     [java] 	NonActivatableGroupAdmin: Failed to exec the group; nested exception is: 
     [java] 	null
     [java] 
     [java] -----------------------------------------
     [java] 
     [java] # of tests started   = 1412
     [java] # of tests completed = 1412
     [java] # of tests skipped   = 46
     [java] # of tests passed    = 591
     [java] # of tests failed    = 821
     [java] 
     [java] -----------------------------------------
     [java] 
     [java]    Date finished:
     [java]       Tue Feb 26 16:53:59 GMT+00:00 2013
     [java]    Time elapsed:
     [java]       17226 seconds
     [java] 
     [java] Java Result: 1

collect-result:
     [copy] Copying 1 file to /zonestorage/hudson_solaris/home/hudson/hudson-slave/workspace/river-qa-refactoring-solaris/trunk/qa/result
     [copy] Copying 1 file to /zonestorage/hudson_solaris/home/hudson/hudson-slave/workspace/river-qa-refactoring-solaris/trunk/qa/result
      [zip] Building zip: /zonestorage/hudson_solaris/home/hudson/hudson-slave/workspace/river-qa-refactoring-solaris/trunk/qa/result/qaresults-x86-SunOS-1.6.0_26.zip

BUILD FAILED
/zonestorage/hudson_solaris/home/hudson/hudson-slave/workspace/river-qa-refactoring-solaris/trunk/build.xml:2093:
The following error occurred while executing this line:
/zonestorage/hudson_solaris/home/hudson/hudson-slave/workspace/river-qa-refactoring-solaris/trunk/qa/build.xml:406:
The following error occurred while executing this line:
/zonestorage/hudson_solaris/home/hudson/hudson-slave/workspace/river-qa-refactoring-solaris/trunk/qa/build.xml:380:
condition satisfied

Total time: 295 minutes 55 seconds
Build step 'Invoke Ant' marked build as failure
Archiving artifacts

Mime
View raw message