river-dev mailing list archives

Site index · List index
Message view « Date » · « Thread »
Top « Date » · « Thread »
From Apache Jenkins Server <jenk...@builds.apache.org>
Subject Build failed in Jenkins: river-qa-refactor-jdk7 #1
Date Sun, 02 Dec 2012 08:28:01 GMT
See <https://builds.apache.org/job/river-qa-refactor-jdk7/1/>

------------------------------------------
[...truncated 9096 lines...]
    [junit] Tests run: 3, Failures: 0, Errors: 0, Time elapsed: 0.037 sec
    [junit] 
    [junit] ------------- Standard Output ---------------
    [junit] implies
    [junit] get
    [junit] getPermission
    [junit] ------------- ---------------- ---------------
    [junit] Testsuite: org.apache.river.api.security.DelegateSecurityManagerTest
    [junit] Tests run: 1, Failures: 0, Errors: 0, Time elapsed: 0.034 sec
    [junit] 
    [junit] ------------- Standard Output ---------------
    [junit] checkPermission
    [junit] ------------- ---------------- ---------------
    [junit] Testsuite: org.apache.river.api.security.PermissionCollectionTest
    [junit] Tests run: 2, Failures: 0, Errors: 0, Time elapsed: 0.007 sec
    [junit] 
    [junit] Testsuite: org.apache.river.api.security.PermissionGrantTest
    [junit] Tests run: 166, Failures: 14, Errors: 0, Time elapsed: 0.233 sec
    [junit] 
    [junit] Testcase: test34(org.apache.river.api.security.PermissionGrantTest):	FAILED
    [junit] 
    [junit] junit.framework.AssertionFailedError: 
    [junit] 	at org.apache.river.api.security.PermissionGrantTest.test34(PermissionGrantTest.java:244)
    [junit] 
    [junit] 
    [junit] Testcase: test38(org.apache.river.api.security.PermissionGrantTest):	FAILED
    [junit] 
    [junit] junit.framework.AssertionFailedError: 
    [junit] 	at org.apache.river.api.security.PermissionGrantTest.test38(PermissionGrantTest.java:260)
    [junit] 
    [junit] 
    [junit] Testcase: test59(org.apache.river.api.security.PermissionGrantTest):	FAILED
    [junit] 
    [junit] junit.framework.AssertionFailedError: 
    [junit] 	at org.apache.river.api.security.PermissionGrantTest.test59(PermissionGrantTest.java:348)
    [junit] 
    [junit] 
    [junit] Testcase: test63(org.apache.river.api.security.PermissionGrantTest):	FAILED
    [junit] 
    [junit] junit.framework.AssertionFailedError: 
    [junit] 	at org.apache.river.api.security.PermissionGrantTest.test63(PermissionGrantTest.java:364)
    [junit] 
    [junit] 
    [junit] Testcase: test85(org.apache.river.api.security.PermissionGrantTest):	FAILED
    [junit] 
    [junit] junit.framework.AssertionFailedError: 
    [junit] 	at org.apache.river.api.security.PermissionGrantTest.test85(PermissionGrantTest.java:452)
    [junit] 
    [junit] 
    [junit] Testcase: test89(org.apache.river.api.security.PermissionGrantTest):	FAILED
    [junit] 
    [junit] junit.framework.AssertionFailedError: 
    [junit] 	at org.apache.river.api.security.PermissionGrantTest.test89(PermissionGrantTest.java:468)
    [junit] 
    [junit] 
    [junit] Testcase: test111(org.apache.river.api.security.PermissionGrantTest):	FAILED
    [junit] 
    [junit] junit.framework.AssertionFailedError: 
    [junit] 	at org.apache.river.api.security.PermissionGrantTest.test111(PermissionGrantTest.java:556)
    [junit] 
    [junit] 
    [junit] Testcase: test115(org.apache.river.api.security.PermissionGrantTest):	FAILED
    [junit] 
    [junit] junit.framework.AssertionFailedError: 
    [junit] 	at org.apache.river.api.security.PermissionGrantTest.test115(PermissionGrantTest.java:572)
    [junit] 
    [junit] 
    [junit] Testcase: test137(org.apache.river.api.security.PermissionGrantTest):	FAILED
    [junit] 
    [junit] junit.framework.AssertionFailedError: 
    [junit] 	at org.apache.river.api.security.PermissionGrantTest.test137(PermissionGrantTest.java:660)
    [junit] 
    [junit] 
    [junit] Testcase: test141(org.apache.river.api.security.PermissionGrantTest):	FAILED
    [junit] 
    [junit] junit.framework.AssertionFailedError: 
    [junit] 	at org.apache.river.api.security.PermissionGrantTest.test141(PermissionGrantTest.java:676)
    [junit] 
    [junit] 
    [junit] Testcase: test145(org.apache.river.api.security.PermissionGrantTest):	FAILED
    [junit] 
    [junit] junit.framework.AssertionFailedError: 
    [junit] 	at org.apache.river.api.security.PermissionGrantTest.test145(PermissionGrantTest.java:692)
    [junit] 
    [junit] 
    [junit] Testcase: test147(org.apache.river.api.security.PermissionGrantTest):	FAILED
    [junit] 
    [junit] junit.framework.AssertionFailedError: 
    [junit] 	at org.apache.river.api.security.PermissionGrantTest.test147(PermissionGrantTest.java:700)
    [junit] 
    [junit] 
    [junit] Testcase: test163(org.apache.river.api.security.PermissionGrantTest):	FAILED
    [junit] 
    [junit] junit.framework.AssertionFailedError: 
    [junit] 	at org.apache.river.api.security.PermissionGrantTest.test163(PermissionGrantTest.java:764)
    [junit] 
    [junit] 
    [junit] Testcase: test168(org.apache.river.api.security.PermissionGrantTest):	FAILED
    [junit] 
    [junit] junit.framework.AssertionFailedError: 
    [junit] 	at org.apache.river.api.security.PermissionGrantTest.test168(PermissionGrantTest.java:780)
    [junit] 
    [junit] 
    [junit] Test org.apache.river.api.security.PermissionGrantTest FAILED
    [junit] Testsuite: org.apache.river.api.security.Permissions_ImplTest
    [junit] Tests run: 1, Failures: 0, Errors: 0, Time elapsed: 0.004 sec
    [junit] 
    [junit] Testsuite: org.apache.river.api.security.PolicyEntryTest
    [junit] Tests run: 2, Failures: 0, Errors: 0, Time elapsed: 0.004 sec
    [junit] 
    [junit] Testsuite: org.apache.river.api.security.PolicyUtilsTest
    [junit] Tests run: 12, Failures: 0, Errors: 0, Time elapsed: 1.467 sec
    [junit] 
    [junit] ------------- Standard Output ---------------
    [junit] http://foo1.bar.com
    [junit] http://foo2.bar.com
    [junit] ------------- ---------------- ---------------
    [junit] ------------- Standard Error -----------------
    [junit] Error detecting security policy location: java.net.MalformedURLException: no protocol:
slkjdfhk/svfv*&^
    [junit] Error detecting security policy location: java.net.MalformedURLException: no protocol:
dlkfjvb3lk5jt
    [junit] java.util.MissingResourceException: Can't find bundle for base name org.apache.river.api.security.messages,
locale en_US
    [junit] Error detecting security policy location: org.apache.river.api.security.PolicyUtils$ExpansionFailedException:
security.14F
    [junit] Error detecting security policy location: org.apache.river.api.security.PolicyUtils$ExpansionFailedException:
security.14F
    [junit] ------------- ---------------- ---------------
    [junit] Testsuite: org.apache.river.api.security.PrincipalGrantTest
    [junit] Tests run: 5, Failures: 0, Errors: 0, Time elapsed: 0.016 sec
    [junit] 
    [junit] ------------- Standard Output ---------------
    [junit] equals
    [junit] implies
    [junit] getBuilderTemplate
    [junit] getPermissions
    [junit] Serialization test
    [junit] ------------- ---------------- ---------------
    [junit] Testsuite: org.apache.river.api.security.SegmentTest
    [junit] Tests run: 4, Failures: 0, Errors: 0, Time elapsed: 0.01 sec
    [junit] 
    [junit] ------------- Standard Output ---------------
    [junit] Test nested divideAndReplace
    [junit] {java.ext.dirs=tests:foo:bar:${jini.home}, river.apache.org=/opt/src/river, jini.home=${river.apache.org}}
    [junit] file:${{java.ext.dirs}}/*
    [junit] file:tests/*
    [junit] file:foo/*
    [junit] file:bar/*
    [junit] file:${river.apache.org}/*
    [junit] Test duplicate nested divideAndReplace
    [junit] {java.ext.dirs=tests:foo:bar:${jini.home}, river.apache.org=/opt/src/river, jini.home=${river.apache.org}}
    [junit] file:${{java.ext.dirs}}/*
    [junit] file:tests/*
    [junit] file:foo/*
    [junit] file:bar/*
    [junit] file:/opt/src/river/*
    [junit] Test divideAndReplace
    [junit] {java.ext.dirs=tests:foo:bar:${jini.home}, river.apache.org=/opt/src/river, jini.home=${river.apache.org}}
    [junit] file:${jini.home}/*
    [junit] file:${river.apache.org}/*
    [junit] Test divideAndReplace
    [junit] {java.ext.dirs=tests:foo:bar:${jini.home}, river.apache.org=/opt/src/river, jini.home=${river.apache.org}}
    [junit] file:${{java.ext.dirs}}/*
    [junit] file:tests/*
    [junit] file:foo/*
    [junit] file:bar/*
    [junit] file:${jini.home}/*
    [junit] ------------- ---------------- ---------------
    [junit] Testsuite: org.apache.river.api.security.URIGrantTest
    [junit] Tests run: 2, Failures: 0, Errors: 0, Time elapsed: 0.007 sec
    [junit] 
    [junit] ------------- Standard Output ---------------
    [junit] Test implies
    [junit] file:/C:/USERS/PETER/DOCUMENTS/NETBEANSPROJECTS/PETERCONCURRENTPOLICY/QA/-
    [junit] file:/C:/USERS/PETER/DOCUMENTS/NETBEANSPROJECTS/PETERCONCURRENTPOLICY/QA/LIB/JINIHARNESS.JAR
    [junit] true
    [junit] Test implies ProtectionDomain
    [junit] ------------- ---------------- ---------------
    [junit] Testsuite: org.apache.river.impl.net.UriStringTest
    [junit] Tests run: 3, Failures: 0, Errors: 0, Time elapsed: 0.007 sec
    [junit] 
    [junit] ------------- Standard Output ---------------
    [junit] escapeIllegalCharacters
    [junit] test escape
    [junit] URI Normalisation Test
    [junit] ------------- ---------------- ---------------

hudson-ci:

BUILD SUCCESSFUL
Total time: 5 minutes 20 seconds
Archiving artifacts
ERROR: No artifacts found that match the file pattern "qa/result/*.zip". Configuration error?
ERROR: 'qa/result/*.zip' doesn't match anything: 'qa' exists but not 'qa/result/*.zip'
Build step 'Archive the artifacts' changed build result to FAILURE
Recording test results
ERROR: Failed to archive test reports
hudson.util.IOException2: remote file operation failed: <https://builds.apache.org/job/river-qa-refactor-jdk7/ws/>
at hudson.remoting.Channel@1be2a9f5:ubuntu3
	at hudson.FilePath.act(FilePath.java:848)
	at hudson.FilePath.act(FilePath.java:825)
	at hudson.tasks.junit.JUnitParser.parse(JUnitParser.java:87)
	at hudson.tasks.junit.JUnitResultArchiver.parse(JUnitResultArchiver.java:122)
	at hudson.tasks.junit.JUnitResultArchiver.perform(JUnitResultArchiver.java:134)
	at hudson.tasks.BuildStepMonitor$1.perform(BuildStepMonitor.java:19)
	at hudson.model.AbstractBuild$AbstractBuildExecution.perform(AbstractBuild.java:804)
	at hudson.model.AbstractBuild$AbstractBuildExecution.performAllBuildSteps(AbstractBuild.java:779)
	at hudson.model.Build$BuildExecution.post2(Build.java:183)
	at hudson.model.AbstractBuild$AbstractBuildExecution.post(AbstractBuild.java:726)
	at hudson.model.Run.execute(Run.java:1543)
	at hudson.model.FreeStyleBuild.run(FreeStyleBuild.java:46)
	at hudson.model.ResourceController.execute(ResourceController.java:88)
	at hudson.model.Executor.run(Executor.java:236)
Caused by: hudson.util.IOException2: Failed to read <https://builds.apache.org/job/river-qa-refactor-jdk7/ws/KEYS>
Is this really a JUnit report file? Your configuration must be matching too many files
	at hudson.tasks.junit.TestResult.parse(TestResult.java:235)
	at hudson.tasks.junit.TestResult.parse(TestResult.java:163)
	at hudson.tasks.junit.TestResult.parse(TestResult.java:140)
	at hudson.tasks.junit.TestResult.<init>(TestResult.java:116)
	at hudson.tasks.junit.JUnitParser$ParseResultCallable.invoke(JUnitParser.java:117)
	at hudson.tasks.junit.JUnitParser$ParseResultCallable.invoke(JUnitParser.java:90)
	at hudson.FilePath$FileCallableWrapper.call(FilePath.java:2309)
	at hudson.remoting.UserRequest.perform(UserRequest.java:118)
	at hudson.remoting.UserRequest.perform(UserRequest.java:48)
	at hudson.remoting.Request$2.run(Request.java:326)
	at hudson.remoting.InterceptingExecutorService$1.call(InterceptingExecutorService.java:72)
	at java.util.concurrent.FutureTask$Sync.innerRun(FutureTask.java:334)
	at java.util.concurrent.FutureTask.run(FutureTask.java:166)
	at java.util.concurrent.ThreadPoolExecutor.runWorker(ThreadPoolExecutor.java:1110)
	at java.util.concurrent.ThreadPoolExecutor$Worker.run(ThreadPoolExecutor.java:603)
	at java.lang.Thread.run(Thread.java:679)
Caused by: org.dom4j.DocumentException: Error on line 2 of document file://<https://builds.apache.org/job/river-qa-refactor-jdk7/ws/KEYS>
: Content is not allowed in prolog. Nested exception: Content is not allowed in prolog.
	at org.dom4j.io.SAXReader.read(SAXReader.java:482)
	at org.dom4j.io.SAXReader.read(SAXReader.java:264)
	at hudson.tasks.junit.SuiteResult.parse(SuiteResult.java:129)
	at hudson.tasks.junit.TestResult.parse(TestResult.java:227)
	... 15 more
Caused by: org.xml.sax.SAXParseException; systemId: file://<https://builds.apache.org/job/river-qa-refactor-jdk7/ws/KEYS;>
lineNumber: 2; columnNumber: 1; Content is not allowed in prolog.
	at com.sun.org.apache.xerces.internal.util.ErrorHandlerWrapper.createSAXParseException(ErrorHandlerWrapper.java:198)
	at com.sun.org.apache.xerces.internal.util.ErrorHandlerWrapper.fatalError(ErrorHandlerWrapper.java:177)
	at com.sun.org.apache.xerces.internal.impl.XMLErrorReporter.reportError(XMLErrorReporter.java:391)
	at com.sun.org.apache.xerces.internal.impl.XMLScanner.reportFatalError(XMLScanner.java:1404)
	at com.sun.org.apache.xerces.internal.impl.XMLDocumentScannerImpl$PrologDriver.next(XMLDocumentScannerImpl.java:1014)
	at com.sun.org.apache.xerces.internal.impl.XMLDocumentScannerImpl.next(XMLDocumentScannerImpl.java:625)
	at com.sun.org.apache.xerces.internal.impl.XMLNSDocumentScannerImpl.next(XMLNSDocumentScannerImpl.java:116)
	at com.sun.org.apache.xerces.internal.impl.XMLDocumentFragmentScannerImpl.scanDocument(XMLDocumentFragmentScannerImpl.java:488)
	at com.sun.org.apache.xerces.internal.parsers.XML11Configuration.parse(XML11Configuration.java:819)
	at com.sun.org.apache.xerces.internal.parsers.XML11Configuration.parse(XML11Configuration.java:748)
	at com.sun.org.apache.xerces.internal.parsers.XMLParser.parse(XMLParser.java:123)
	at com.sun.org.apache.xerces.internal.parsers.AbstractSAXParser.parse(AbstractSAXParser.java:1208)
	at com.sun.org.apache.xerces.internal.jaxp.SAXParserImpl$JAXPSAXParser.parse(SAXParserImpl.java:525)
	at org.dom4j.io.SAXReader.read(SAXReader.java:465)
	... 18 more
Publishing Javadoc

Mime
View raw message