river-dev mailing list archives

Site index · List index
Message view « Date » · « Thread »
Top « Date » · « Thread »
From Apache Jenkins Server <jenk...@builds.apache.org>
Subject Build failed in Jenkins: River-QA-ubuntu-jdk7 #59
Date Sun, 11 Nov 2012 17:50:04 GMT
See <https://builds.apache.org/job/River-QA-ubuntu-jdk7/59/changes>

Changes:

[peter_firmstone] Catch BindException caused by TIME_WAIT, sleep and retry, to avoid test
failure on ARM architecture.

[peter_firmstone] Preparation for River 2.2.1 release.

[peter_firmstone] Enable Reggie to handle a ServerSocket caught in the 4 minute TCP 2MSL TIME_WAIT
state, can be safely interrupted.

This should fix failing tests on ARM platform.

------------------------------------------
[...truncated 8927 lines...]
     [java] -----------------------------------------
     [java] com/sun/jini/test/spec/javaspace/conformance/snapshot/SnapshotTransactionTakeWaitTest.td
     [java] Test Failed: Setup Failed: com.sun.jini.qa.harness.TestException: Exception instantiating
class server com.sun.jini.tool.ClassServer; nested exception is: 
     [java] 	null
     [java] 
     [java] -----------------------------------------
     [java] com/sun/jini/test/spec/javaspace/conformance/snapshot/SnapshotTransactionWriteLeaseANYTest.td
     [java] Test Failed: Setup Failed: com.sun.jini.qa.harness.TestException: Exception instantiating
class server com.sun.jini.tool.ClassServer; nested exception is: 
     [java] 	null
     [java] 
     [java] -----------------------------------------
     [java] com/sun/jini/test/spec/javaspace/conformance/snapshot/SnapshotTransactionWriteLeaseFOREVERTest.td
     [java] Test Failed: Setup Failed: com.sun.jini.qa.harness.TestException: Exception instantiating
class server com.sun.jini.tool.ClassServer; nested exception is: 
     [java] 	null
     [java] 
     [java] -----------------------------------------
     [java] com/sun/jini/test/spec/javaspace/conformance/snapshot/SnapshotTransactionWriteNegativeLeaseTest.td
     [java] Test Failed: Setup Failed: com.sun.jini.qa.harness.TestException: Exception instantiating
class server com.sun.jini.tool.ClassServer; nested exception is: 
     [java] 	null
     [java] 
     [java] -----------------------------------------
     [java] com/sun/jini/test/spec/javaspace/conformance/snapshot/SnapshotTransactionWriteTakeIfExistsNotifyTest.td
     [java] Test Failed: Setup Failed: com.sun.jini.qa.harness.TestException: Exception instantiating
class server com.sun.jini.tool.ClassServer; nested exception is: 
     [java] 	null
     [java] 
     [java] -----------------------------------------
     [java] com/sun/jini/test/spec/javaspace/conformance/snapshot/SnapshotTransactionWriteTakeIfExistsTest.td
     [java] Test Failed: Setup Failed: com.sun.jini.qa.harness.TestException: Exception instantiating
class server com.sun.jini.tool.ClassServer; nested exception is: 
     [java] 	null
     [java] 
     [java] -----------------------------------------
     [java] com/sun/jini/test/spec/javaspace/conformance/snapshot/SnapshotTransactionWriteTakeNotifyTest.td
     [java] Test Failed: Setup Failed: com.sun.jini.qa.harness.TestException: Exception instantiating
class server com.sun.jini.tool.ClassServer; nested exception is: 
     [java] 	null
     [java] 
     [java] -----------------------------------------
     [java] com/sun/jini/test/spec/javaspace/conformance/snapshot/SnapshotTransactionWriteTakeTest.td
     [java] Test Failed: Setup Failed: com.sun.jini.qa.harness.TestException: Exception instantiating
class server com.sun.jini.tool.ClassServer; nested exception is: 
     [java] 	null
     [java] 
     [java] -----------------------------------------
     [java] com/sun/jini/test/spec/javaspace/conformance/snapshot/SnapshotTransactionWriteTest.td
     [java] Test Failed: Setup Failed: com.sun.jini.qa.harness.TestException: Exception instantiating
class server com.sun.jini.tool.ClassServer; nested exception is: 
     [java] 	null
     [java] 
     [java] -----------------------------------------
     [java] com/sun/jini/test/spec/javaspace/conformance/snapshot/SnapshotWriteLeaseANYTest.td
     [java] Test Failed: Setup Failed: com.sun.jini.qa.harness.TestException: Exception instantiating
class server com.sun.jini.tool.ClassServer; nested exception is: 
     [java] 	null
     [java] 
     [java] -----------------------------------------
     [java] com/sun/jini/test/spec/javaspace/conformance/snapshot/SnapshotWriteLeaseFOREVERTest.td
     [java] Test Failed: Setup Failed: com.sun.jini.qa.harness.TestException: Exception instantiating
class server com.sun.jini.tool.ClassServer; nested exception is: 
     [java] 	null
     [java] 
     [java] -----------------------------------------
     [java] com/sun/jini/test/spec/javaspace/conformance/snapshot/SnapshotWriteNegativeLeaseTest.td
     [java] Test Failed: Setup Failed: com.sun.jini.qa.harness.TestException: Exception instantiating
class server com.sun.jini.tool.ClassServer; nested exception is: 
     [java] 	null
     [java] 
     [java] -----------------------------------------
     [java] com/sun/jini/test/spec/javaspace/conformance/snapshot/SnapshotWriteTest.td
     [java] Test Failed: Setup Failed: com.sun.jini.qa.harness.TestException: Exception instantiating
class server com.sun.jini.tool.ClassServer; nested exception is: 
     [java] 	null
     [java] 
     [java] -----------------------------------------
     [java] com/sun/jini/test/impl/mahalo/AdminIFShutdownTest.td
     [java] Test Failed: Setup Failed: com.sun.jini.qa.harness.TestException: Exception instantiating
class server com.sun.jini.tool.ClassServer; nested exception is: 
     [java] 	null
     [java] 
     [java] -----------------------------------------
     [java] com/sun/jini/test/impl/mahalo/AdminIFTest.td
     [java] Test Failed: Setup Failed: com.sun.jini.qa.harness.TestException: Exception instantiating
class server com.sun.jini.tool.ClassServer; nested exception is: 
     [java] 	null
     [java] 
     [java] -----------------------------------------
     [java] com/sun/jini/test/impl/mahalo/LeaseExpireCancelTest.td
     [java] Test Failed: Setup Failed: com.sun.jini.qa.harness.TestException: Exception instantiating
class server com.sun.jini.tool.ClassServer; nested exception is: 
     [java] 	null
     [java] 
     [java] -----------------------------------------
     [java] com/sun/jini/test/impl/mahalo/LeaseExpireRenewTest.td
     [java] Test Failed: Setup Failed: com.sun.jini.qa.harness.TestException: Exception instantiating
class server com.sun.jini.tool.ClassServer; nested exception is: 
     [java] 	null
     [java] 
     [java] -----------------------------------------
     [java] com/sun/jini/test/impl/mahalo/LeaseMapTest.td
     [java] Test Failed: Setup Failed: com.sun.jini.qa.harness.TestException: Exception instantiating
class server com.sun.jini.tool.ClassServer; nested exception is: 
     [java] 	null
     [java] 
     [java] -----------------------------------------
     [java] com/sun/jini/test/impl/mahalo/LeaseTest.td
     [java] Test Failed: Setup Failed: com.sun.jini.qa.harness.TestException: Exception instantiating
class server com.sun.jini.tool.ClassServer; nested exception is: 
     [java] 	null
     [java] 
     [java] -----------------------------------------
     [java] com/sun/jini/test/impl/mahalo/MahaloCreateShutdownTest.td
     [java] Test Failed: Setup Failed: com.sun.jini.qa.harness.TestException: Exception instantiating
class server com.sun.jini.tool.ClassServer; nested exception is: 
     [java] 	null
     [java] 
     [java] -----------------------------------------
     [java] com/sun/jini/test/impl/mahalo/MahaloIFTest.td
     [java] Test Passed: OK
     [java] 
     [java] -----------------------------------------
     [java] com/sun/jini/test/impl/mahalo/MahaloImplReadyStateTest.td
     [java] Test Skipped: verifiers are: com.sun.jini.test.impl.mercury.ActivatableMercuryVerifier
com.sun.jini.qa.harness.SkipConfigTestVerifier
     [java] -----------------------------------------
     [java] com/sun/jini/test/impl/mahalo/NestableServerTransactionCreatedToStringTest.td
     [java] Test Passed: OK
     [java] 
     [java] -----------------------------------------
     [java] com/sun/jini/test/impl/mahalo/NestableTransactionCreatedToStringTest.td
     [java] Test Passed: OK
     [java] 
     [java] -----------------------------------------
     [java] com/sun/jini/test/impl/mahalo/PrepareAndCommitExceptionTest.td
     [java] Test Passed: OK
     [java] 
     [java] -----------------------------------------
     [java] com/sun/jini/test/impl/mahalo/PrepareAndCommitExceptionTest2.td
     [java] Test Passed: OK
     [java] 
     [java] -----------------------------------------
     [java] com/sun/jini/test/impl/mahalo/PrepareAndCommitExceptionTest3.td
     [java] Test Passed: OK
     [java] 
     [java] -----------------------------------------
     [java] com/sun/jini/test/impl/mahalo/PrepareAndCommitExceptionTest4.td
     [java] Test Passed: OK
     [java] 
     [java] -----------------------------------------
     [java] com/sun/jini/test/impl/mahalo/PrepareAndCommitExceptionTest5.td
     [java] Test Passed: OK
     [java] 
     [java] -----------------------------------------
     [java] com/sun/jini/test/impl/mahalo/RandomStressTest.td
     [java] Test Passed: OK
     [java] 
     [java] -----------------------------------------
     [java] com/sun/jini/test/impl/mahalo/ServerTransactionEqualityTest.td
     [java] Test Passed: OK
     [java] 
     [java] -----------------------------------------
     [java] com/sun/jini/test/impl/mahalo/ServerTransactionToStringTest.td
     [java] Test Passed: OK
     [java] 
     [java] -----------------------------------------
     [java] com/sun/jini/test/impl/mahalo/TransactionCreatedToStringTest.td
     [java] Test Passed: OK
     [java] 
     [java] -----------------------------------------
     [java] com/sun/jini/test/impl/mahalo/TransactionManagerCreatedToStringTest.td
     [java] Test Passed: OK
     [java] 
     [java] -----------------------------------------
     [java] com/sun/jini/test/impl/mahalo/TxnMgrImplNullActivationConfigEntries.td
     [java] Test Skipped: verifiers are: com.sun.jini.test.impl.mahalo.ActivatableMahaloVerifier
     [java] -----------------------------------------
     [java] com/sun/jini/test/impl/mahalo/TxnMgrImplNullConfigEntries.td
     [java] Test Passed: OK
     [java] 
     [java] -----------------------------------------
     [java] com/sun/jini/test/impl/mahalo/TxnMgrImplNullRecoveredLocators.td
     [java] Test Skipped: verifiers are: com.sun.jini.test.impl.mahalo.ActivatableMahaloVerifier
     [java] -----------------------------------------
     [java] com/sun/jini/test/impl/mahalo/TxnMgrProxyEqualityTest.td
     [java] Test Passed: OK
     [java] 
     [java] -----------------------------------------
     [java] com/sun/jini/test/spec/txnmanager/AsynchAbortOnCommitTest.td
     [java] Test Passed: OK
     [java] 
     [java] -----------------------------------------
     [java] com/sun/jini/test/spec/txnmanager/AsynchAbortOnPrepareTest.td
     [java] Test Passed: OK
     [java] 
     [java] -----------------------------------------
     [java] com/sun/jini/test/spec/txnmanager/CommitExpiredTest.td
     [java] Test Passed: OK
     [java] 
     [java] -----------------------------------------
     [java] com/sun/jini/test/spec/txnmanager/CommitTimeoutTest.td
     [java] Test Passed: OK
     [java] 
     [java] -----------------------------------------
     [java] com/sun/jini/test/spec/txnmanager/GetStateTest.td
     [java] Test Passed: OK
     [java] 
     [java] -----------------------------------------
     [java] com/sun/jini/test/spec/txnmanager/JoinIdempotentTest.td
     [java] Test Passed: OK
     [java] 
     [java] -----------------------------------------
     [java] com/sun/jini/test/spec/txnmanager/JoinWhileActiveTest.td
     [java] Test Passed: OK
     [java] 
     [java] -----------------------------------------
     [java] com/sun/jini/test/spec/txnmanager/ManyParticipantsTest.td
     [java] Test Passed: OK
     [java] 
     [java] -----------------------------------------
     [java] com/sun/jini/test/spec/txnmanager/PrepareTimeoutTest.td
     [java] Test Passed: OK
     [java] 
     [java] -----------------------------------------
     [java] com/sun/jini/test/spec/txnmanager/RollBackErrorTest.td
     [java] Test Passed: OK
     [java] 
     [java] -----------------------------------------
     [java] com/sun/jini/test/spec/txnmanager/RollForwardErrorTest.td
     [java] Test Passed: OK
     [java] 
     [java] -----------------------------------------
     [java] com/sun/jini/test/spec/txnmanager/TwoPhaseTest.td
     [java] Test Passed: OK
     [java] 
     [java] -----------------------------------------
     [java] 
     [java] # of tests started   = 1411
     [java] # of tests completed = 1411
     [java] # of tests skipped   = 47
     [java] # of tests passed    = 1345
     [java] # of tests failed    = 66
     [java] 
     [java] -----------------------------------------
     [java] 
     [java]    Date finished:
     [java]       Sun Nov 11 17:49:55 UTC 2012
     [java]    Time elapsed:
     [java]       60450 seconds
     [java] 
     [java] Java Result: 1

collect-result:
     [copy] Copying 1 file to <https://builds.apache.org/job/River-QA-ubuntu-jdk7/ws/qa/result>
     [copy] Copying 1 file to <https://builds.apache.org/job/River-QA-ubuntu-jdk7/ws/qa/result>
      [zip] Building zip: <https://builds.apache.org/job/River-QA-ubuntu-jdk7/59/artifact/qa/result/qaresults-amd64-Linux-1.7.0_04.zip>

BUILD FAILED
<https://builds.apache.org/job/River-QA-ubuntu-jdk7/ws/build.xml>:2094: The following
error occurred while executing this line:
<https://builds.apache.org/job/River-QA-ubuntu-jdk7/ws/qa/build.xml>:406: The following
error occurred while executing this line:
<https://builds.apache.org/job/River-QA-ubuntu-jdk7/ws/qa/build.xml>:380: condition
satisfied

Total time: 1,012 minutes 20 seconds
Build step 'Invoke Ant' marked build as failure
[locks-and-latches] Releasing all the locks
[locks-and-latches] All the locks released
Archiving artifacts

Mime
View raw message