river-dev mailing list archives

Site index · List index
Message view « Date » · « Thread »
Top « Date » · « Thread »
From Apache Jenkins Server <jenk...@builds.apache.org>
Subject Build failed in Jenkins: River-QA-matrix » loader,JDK 1.7 (latest),Ubuntu #13
Date Sat, 15 Sep 2012 13:29:38 GMT
See <https://builds.apache.org/job/River-QA-matrix/./category=loader,jdk=JDK%201.7%20(latest),label=Ubuntu/13/>

------------------------------------------
[...truncated 3986 lines...]
     [java] -----------------------------------------
     [java] com/sun/jini/test/spec/loader/pref/preferredClassProvider/LoadClassesFile.td
     [java] Test Failed: Test Failed: com.sun.jini.qa.harness.TestException: RMIClassLoader.loadClass(file://<https://builds.apache.org/job/River-QA-matrix/./category=loader,jdk=JDK%201.7%20(latest),label=Ubuntu/ws/build/qa/lib/qa1-loader-pref.jar,>
com.sun.jini.test.spec.loader.util.classes.Class01, defaultLoader)
     [java]   throws: java.net.MalformedURLException: URI is not absolute
     [java]   expected: preferred class
     [java] 
     [java] -----------------------------------------
     [java] com/sun/jini/test/spec/loader/pref/preferredClassProvider/LoadClassesFileCann.td
     [java] Test Failed: Test Failed: com.sun.jini.qa.harness.TestException: RMIClassLoader.loadClass(file://<https://builds.apache.org/job/River-QA-matrix/./category=loader,jdk=JDK%201.7%20(latest),label=Ubuntu/ws/build/qa/lib/qa1-loader-pref.jar,>
com.sun.jini.test.spec.loader.util.classes.Class01, defaultLoader)
     [java]   throws: java.net.MalformedURLException: URI is not absolute
     [java]   expected: preferred class
     [java] 
     [java] -----------------------------------------
     [java] com/sun/jini/test/spec/loader/pref/preferredClassProvider/LoadClassesFileDlperm.td
     [java] Test Failed: Test Failed: com.sun.jini.qa.harness.TestException: RMIClassLoader.loadClass(file://<https://builds.apache.org/job/River-QA-matrix/./category=loader,jdk=JDK%201.7%20(latest),label=Ubuntu/ws/build/qa/lib/qa1-loader-pref.jar,>
com.sun.jini.test.spec.loader.util.classes.Class01, defaultLoader)
     [java]   throws: java.net.MalformedURLException: URI is not absolute
     [java]   expected: preferred class
     [java] 
     [java] -----------------------------------------
     [java] com/sun/jini/test/spec/loader/pref/preferredClassProvider/LoadClassesFileDlpermCann.td
     [java] Test Failed: Test Failed: com.sun.jini.qa.harness.TestException: RMIClassLoader.loadClass(file://<https://builds.apache.org/job/River-QA-matrix/./category=loader,jdk=JDK%201.7%20(latest),label=Ubuntu/ws/build/qa/lib/qa1-loader-pref.jar,>
com.sun.jini.test.spec.loader.util.classes.Class01, defaultLoader)
     [java]   throws: java.net.MalformedURLException: URI is not absolute
     [java]   expected: preferred class
     [java] 
     [java] -----------------------------------------
     [java] com/sun/jini/test/spec/loader/pref/preferredClassProvider/LoadClassesHttp.td
     [java] Test Passed: OK
     [java] 
     [java] -----------------------------------------
     [java] com/sun/jini/test/spec/loader/pref/preferredClassProvider/LoadClassesHttpCann.td
     [java] Test Passed: OK
     [java] 
     [java] -----------------------------------------
     [java] com/sun/jini/test/spec/loader/pref/preferredClassProvider/LoadClassesHttpDlperm.td
     [java] Test Passed: OK
     [java] 
     [java] -----------------------------------------
     [java] com/sun/jini/test/spec/loader/pref/preferredClassProvider/LoadClassesHttpDlpermCann.td
     [java] Test Passed: OK
     [java] 
     [java] -----------------------------------------
     [java] com/sun/jini/test/spec/loader/pref/preferredClassProvider/LoadClassesMalformedURL.td
     [java] Test Passed: OK
     [java] 
     [java] -----------------------------------------
     [java] com/sun/jini/test/spec/loader/pref/preferredClassProvider/LoadClassesMalformedURLCann.td
     [java] Test Passed: OK
     [java] 
     [java] -----------------------------------------
     [java] com/sun/jini/test/spec/loader/pref/preferredClassProvider/LoadClassesMalformedURLDlperm.td
     [java] Test Passed: OK
     [java] 
     [java] -----------------------------------------
     [java] com/sun/jini/test/spec/loader/pref/preferredClassProvider/LoadClassesMalformedURLDlpermCann.td
     [java] Test Passed: OK
     [java] 
     [java] -----------------------------------------
     [java] com/sun/jini/test/spec/loader/pref/preferredClassProvider/LoadClassesMalformedURLDlpermNullCodebase.td
     [java] Test Skipped: verifiers are: com.sun.jini.qa.harness.SkipTestVerifier
     [java] -----------------------------------------
     [java] com/sun/jini/test/spec/loader/pref/preferredClassProvider/LoadClassesMalformedURLDlpermSimpleann.td
     [java] Test Skipped: verifiers are: com.sun.jini.qa.harness.SkipTestVerifier
     [java] -----------------------------------------
     [java] com/sun/jini/test/spec/loader/pref/preferredClassProvider/LoadClassesMalformedURLNullCodebase.td
     [java] Test Skipped: verifiers are: com.sun.jini.qa.harness.SkipTestVerifier
     [java] -----------------------------------------
     [java] com/sun/jini/test/spec/loader/pref/preferredClassProvider/LoadClassesMalformedURLSimpleann.td
     [java] Test Skipped: verifiers are: com.sun.jini.qa.harness.SkipTestVerifier
     [java] -----------------------------------------
     [java] com/sun/jini/test/spec/loader/pref/preferredClassProvider/LoadClassesSecurityExceptionFile.td
     [java] Test Failed: Test Failed: com.sun.jini.qa.harness.TestException: RMIClassLoader.loadClass(file://<https://builds.apache.org/job/River-QA-matrix/./category=loader,jdk=JDK%201.7%20(latest),label=Ubuntu/ws/build/qa/lib/qa1-loader-pref.jar,>
com.sun.jini.test.spec.loader.util.classes.Class01, defaultLoader)
     [java]   throws: java.net.MalformedURLException: URI is not absolute
     [java]   expected: SecurityException
     [java] 
     [java] -----------------------------------------
     [java] com/sun/jini/test/spec/loader/pref/preferredClassProvider/LoadClassesSecurityExceptionFileCann.td
     [java] Test Failed: Test Failed: com.sun.jini.qa.harness.TestException: RMIClassLoader.loadClass(file://<https://builds.apache.org/job/River-QA-matrix/./category=loader,jdk=JDK%201.7%20(latest),label=Ubuntu/ws/build/qa/lib/qa1-loader-pref.jar,>
com.sun.jini.test.spec.loader.util.classes.Class01, defaultLoader)
     [java]   throws: java.net.MalformedURLException: URI is not absolute
     [java]   expected: SecurityException
     [java] 
     [java] -----------------------------------------
     [java] com/sun/jini/test/spec/loader/pref/preferredClassProvider/LoadClassesSecurityExceptionHttp.td
     [java] Test Passed: OK
     [java] 
     [java] -----------------------------------------
     [java] com/sun/jini/test/spec/loader/pref/preferredClassProvider/LoadClassesSecurityExceptionHttpCann.td
     [java] Test Passed: OK
     [java] 
     [java] -----------------------------------------
     [java] com/sun/jini/test/spec/loader/pref/preferredClassProvider/LoadProxyClassesClassNotFoundFile.td
     [java] Test Failed: Test Failed: com.sun.jini.qa.harness.TestException: 
     [java] RMIClassLoader.loadProxyClass(file://<https://builds.apache.org/job/River-QA-matrix/./category=loader,jdk=JDK%201.7%20(latest),label=Ubuntu/ws/build/qa/lib/qa1-loader-pref.jar,>
com.sun.jini.test.spec.loader.util.classes.Interface_541579232, defaultLoader)
     [java]   throws: java.net.MalformedURLException: URI is not absolute
     [java]   expected: ClassNotFoundException
     [java] 
     [java] -----------------------------------------
     [java] com/sun/jini/test/spec/loader/pref/preferredClassProvider/LoadProxyClassesClassNotFoundFileCann.td
     [java] Test Failed: Test Failed: com.sun.jini.qa.harness.TestException: 
     [java] RMIClassLoader.loadProxyClass(file://<https://builds.apache.org/job/River-QA-matrix/./category=loader,jdk=JDK%201.7%20(latest),label=Ubuntu/ws/build/qa/lib/qa1-loader-pref.jar,>
com.sun.jini.test.spec.loader.util.classes.Interface_-1350456864, defaultLoader)
     [java]   throws: java.net.MalformedURLException: URI is not absolute
     [java]   expected: ClassNotFoundException
     [java] 
     [java] -----------------------------------------
     [java] com/sun/jini/test/spec/loader/pref/preferredClassProvider/LoadProxyClassesClassNotFoundFileDlperm.td
     [java] Test Failed: Test Failed: com.sun.jini.qa.harness.TestException: 
     [java] RMIClassLoader.loadProxyClass(file://<https://builds.apache.org/job/River-QA-matrix/./category=loader,jdk=JDK%201.7%20(latest),label=Ubuntu/ws/build/qa/lib/qa1-loader-pref.jar,>
com.sun.jini.test.spec.loader.util.classes.Interface_-532853037, defaultLoader)
     [java]   throws: java.net.MalformedURLException: URI is not absolute
     [java]   expected: ClassNotFoundException
     [java] 
     [java] -----------------------------------------
     [java] com/sun/jini/test/spec/loader/pref/preferredClassProvider/LoadProxyClassesClassNotFoundFileDlpermCann.td
     [java] Test Failed: Test Failed: com.sun.jini.qa.harness.TestException: 
     [java] RMIClassLoader.loadProxyClass(file://<https://builds.apache.org/job/River-QA-matrix/./category=loader,jdk=JDK%201.7%20(latest),label=Ubuntu/ws/build/qa/lib/qa1-loader-pref.jar,>
com.sun.jini.test.spec.loader.util.classes.Interface_-1760552070, defaultLoader)
     [java]   throws: java.net.MalformedURLException: URI is not absolute
     [java]   expected: ClassNotFoundException
     [java] 
     [java] -----------------------------------------
     [java] com/sun/jini/test/spec/loader/pref/preferredClassProvider/LoadProxyClassesClassNotFoundHttp.td
     [java] Test Passed: OK
     [java] 
     [java] -----------------------------------------
     [java] com/sun/jini/test/spec/loader/pref/preferredClassProvider/LoadProxyClassesClassNotFoundHttpCann.td
     [java] Test Passed: OK
     [java] 
     [java] -----------------------------------------
     [java] com/sun/jini/test/spec/loader/pref/preferredClassProvider/LoadProxyClassesClassNotFoundHttpDlperm.td
     [java] Test Passed: OK
     [java] 
     [java] -----------------------------------------
     [java] com/sun/jini/test/spec/loader/pref/preferredClassProvider/LoadProxyClassesClassNotFoundHttpDlpermCann.td
     [java] Test Passed: OK
     [java] 
     [java] -----------------------------------------
     [java] com/sun/jini/test/spec/loader/pref/preferredClassProvider/LoadProxyClassesFile.td
     [java] Test Failed: Test Failed: com.sun.jini.qa.harness.TestException: 
     [java] RMIClassLoader.loadClass(file://<https://builds.apache.org/job/River-QA-matrix/./category=loader,jdk=JDK%201.7%20(latest),label=Ubuntu/ws/build/qa/lib/qa1-loader-pref.jar,>
com.sun.jini.test.spec.loader.util.classes.Interface01, defaultLoader)
     [java]   throws: java.net.MalformedURLException: URI is not absolute
     [java]   expected: com.sun.jini.test.spec.loader.util.classes.Interface01 interface
     [java] 
     [java] -----------------------------------------
     [java] com/sun/jini/test/spec/loader/pref/preferredClassProvider/LoadProxyClassesFileCann.td
     [java] Test Failed: Test Failed: com.sun.jini.qa.harness.TestException: 
     [java] RMIClassLoader.loadClass(file://<https://builds.apache.org/job/River-QA-matrix/./category=loader,jdk=JDK%201.7%20(latest),label=Ubuntu/ws/build/qa/lib/qa1-loader-pref.jar,>
com.sun.jini.test.spec.loader.util.classes.Interface01, defaultLoader)
     [java]   throws: java.net.MalformedURLException: URI is not absolute
     [java]   expected: com.sun.jini.test.spec.loader.util.classes.Interface01 interface
     [java] 
     [java] -----------------------------------------
     [java] com/sun/jini/test/spec/loader/pref/preferredClassProvider/LoadProxyClassesFileDlperm.td
     [java] Test Failed: Test Failed: com.sun.jini.qa.harness.TestException: 
     [java] RMIClassLoader.loadClass(file://<https://builds.apache.org/job/River-QA-matrix/./category=loader,jdk=JDK%201.7%20(latest),label=Ubuntu/ws/build/qa/lib/qa1-loader-pref.jar,>
com.sun.jini.test.spec.loader.util.classes.Interface01, defaultLoader)
     [java]   throws: java.net.MalformedURLException: URI is not absolute
     [java]   expected: com.sun.jini.test.spec.loader.util.classes.Interface01 interface
     [java] 
     [java] -----------------------------------------
     [java] com/sun/jini/test/spec/loader/pref/preferredClassProvider/LoadProxyClassesFileDlpermCann.td
     [java] Test Failed: Test Failed: com.sun.jini.qa.harness.TestException: 
     [java] RMIClassLoader.loadClass(file://<https://builds.apache.org/job/River-QA-matrix/./category=loader,jdk=JDK%201.7%20(latest),label=Ubuntu/ws/build/qa/lib/qa1-loader-pref.jar,>
com.sun.jini.test.spec.loader.util.classes.Interface01, defaultLoader)
     [java]   throws: java.net.MalformedURLException: URI is not absolute
     [java]   expected: com.sun.jini.test.spec.loader.util.classes.Interface01 interface
     [java] 
     [java] -----------------------------------------
     [java] com/sun/jini/test/spec/loader/pref/preferredClassProvider/LoadProxyClassesHttp.td
     [java] Test Passed: OK
     [java] 
     [java] -----------------------------------------
     [java] com/sun/jini/test/spec/loader/pref/preferredClassProvider/LoadProxyClassesHttpCann.td
     [java] Test Passed: OK
     [java] 
     [java] -----------------------------------------
     [java] com/sun/jini/test/spec/loader/pref/preferredClassProvider/LoadProxyClassesHttpDlperm.td
     [java] Test Passed: OK
     [java] 
     [java] -----------------------------------------
     [java] com/sun/jini/test/spec/loader/pref/preferredClassProvider/LoadProxyClassesHttpDlpermCann.td
     [java] Test Passed: OK
     [java] 
     [java] -----------------------------------------
     [java] com/sun/jini/test/spec/loader/pref/preferredClassProvider/LoadProxyClassesMalformedURL.td
     [java] Test Passed: OK
     [java] 
     [java] -----------------------------------------
     [java] com/sun/jini/test/spec/loader/pref/preferredClassProvider/LoadProxyClassesMalformedURLCann.td
     [java] Test Passed: OK
     [java] 
     [java] -----------------------------------------
     [java] com/sun/jini/test/spec/loader/pref/preferredClassProvider/LoadProxyClassesMalformedURLCannNullCodebase.td
     [java] Test Skipped: verifiers are: com.sun.jini.qa.harness.SkipTestVerifier
     [java] -----------------------------------------
     [java] com/sun/jini/test/spec/loader/pref/preferredClassProvider/LoadProxyClassesMalformedURLDlperm.td
     [java] Test Passed: OK
     [java] 
     [java] -----------------------------------------
     [java] com/sun/jini/test/spec/loader/pref/preferredClassProvider/LoadProxyClassesMalformedURLDlpermCann.td
     [java] Test Passed: OK
     [java] 
     [java] -----------------------------------------
     [java] com/sun/jini/test/spec/loader/pref/preferredClassProvider/LoadProxyClassesMalformedURLDlpermCannNullCodebase.td
     [java] Test Skipped: verifiers are: com.sun.jini.qa.harness.SkipTestVerifier
     [java] -----------------------------------------
     [java] com/sun/jini/test/spec/loader/pref/preferredClassProvider/LoadProxyClassesMalformedURLDlpermNullCodebase.td
     [java] Test Skipped: verifiers are: com.sun.jini.qa.harness.SkipTestVerifier
     [java] -----------------------------------------
     [java] com/sun/jini/test/spec/loader/pref/preferredClassProvider/LoadProxyClassesMalformedURLNullCodebase.td
     [java] Test Skipped: verifiers are: com.sun.jini.qa.harness.SkipTestVerifier
     [java] -----------------------------------------
     [java] com/sun/jini/test/spec/loader/pref/requireDlPermProvider/LoadClassesFile.td
     [java] Test Failed: Test Failed: com.sun.jini.qa.harness.TestException: RMIClassLoader.loadClass(file://<https://builds.apache.org/job/River-QA-matrix/./category=loader,jdk=JDK%201.7%20(latest),label=Ubuntu/ws/build/qa/lib/qa1-loader-pref.jar,>
com.sun.jini.test.spec.loader.util.classes.Class01, defaultLoader)
     [java]   throws: java.net.MalformedURLException: URI is not absolute
     [java]   expected: preferred class
     [java] 
     [java] -----------------------------------------
     [java] com/sun/jini/test/spec/loader/pref/requireDlPermProvider/LoadClassesHttp.td
     [java] Test Passed: OK
     [java] 
     [java] -----------------------------------------
     [java] com/sun/jini/test/spec/loader/pref/requireDlPermProvider/LoadClassesSecurityExceptionFile.td
     [java] Test Failed: Test Failed: com.sun.jini.qa.harness.TestException: RMIClassLoader.loadClass(file://<https://builds.apache.org/job/River-QA-matrix/./category=loader,jdk=JDK%201.7%20(latest),label=Ubuntu/ws/build/qa/lib/qa1-loader-pref.jar,>
com.sun.jini.test.spec.loader.util.classes.Class01, defaultLoader)
     [java]   throws: java.net.MalformedURLException: URI is not absolute
     [java]   expected: SecurityException
     [java] 
     [java] -----------------------------------------
     [java] com/sun/jini/test/spec/loader/pref/requireDlPermProvider/LoadClassesSecurityExceptionHttp.td
     [java] Test Passed: OK
     [java] 
     [java] -----------------------------------------
     [java] 
     [java] # of tests started   = 100
     [java] # of tests completed = 100
     [java] # of tests skipped   = 10
     [java] # of tests passed    = 66
     [java] # of tests failed    = 34
     [java] 
     [java] -----------------------------------------
     [java] 
     [java]    Date finished:
     [java]       Sat Sep 15 13:29:38 UTC 2012
     [java]    Time elapsed:
     [java]       568 seconds
     [java] 
     [java] Java Result: 1

collect-result:

BUILD FAILED
<https://builds.apache.org/job/River-QA-matrix/./category=loader,jdk=JDK%201.7%20(latest),label=Ubuntu/ws/build.xml>:51:
The following error occurred while executing this line:
<https://builds.apache.org/job/River-QA-matrix/./category=loader,jdk=JDK%201.7%20(latest),label=Ubuntu/ws/build/qa/build.xml>:380:
condition satisfied

Total time: 9 minutes 49 seconds
Build step 'Invoke Ant' marked build as failure

Mime
View raw message