river-dev mailing list archives

Site index · List index
Message view « Date » · « Thread »
Top « Date » · « Thread »
From Apache Jenkins Server <jenk...@builds.apache.org>
Subject Build failed in Jenkins: River-QA-matrix » JDK 1.7 (latest),Ubuntu,com-sun-jini-test-impl-end2end-End2EndTestHTTPS.td #20
Date Mon, 17 Sep 2012 06:21:56 GMT
See <https://builds.apache.org/job/River-QA-matrix/./jdk=JDK%201.7%20(latest),label=Ubuntu,test=com-sun-jini-test-impl-end2end-End2EndTestHTTPS.td/20/>

------------------------------------------
Started by upstream project "River-QA-matrix" build number 20
Building remotely on ubuntu3 in workspace <https://builds.apache.org/job/River-QA-matrix/./jdk=JDK%201.7%20(latest),label=Ubuntu,test=com-sun-jini-test-impl-end2end-End2EndTestHTTPS.td/ws/>
Checking out a fresh workspace because there's no workspace at /x1/jenkins/jenkins-slave/workspace/River-QA-matrix/jdk/JDK
1.7 (latest)/label/Ubuntu/test/com-sun-jini-test-impl-end2end-End2EndTestHTTPS.td
Cleaning local Directory .
Checking out http://svn.apache.org/repos/asf/river/jtsk/trunk/qa-matrix
A         build.xml
 U        .
At revision 1386448
[locks-and-latches] Checking to see if we really have the locks
[locks-and-latches] Could not get all the locks... sleeping for 1 minute
[locks-and-latches] Have all the locks, build can start
[com-sun-jini-test-impl-end2end-End2EndTestHTTPS.td] $ /home/hudson/tools/ant/apache-ant-1.7.0/bin/ant
-Dtest=com-sun-jini-test-impl-end2end-End2EndTestHTTPS.td -Dlabel=Ubuntu "-Djdk=JDK 1.7 (latest)"
Buildfile: build.xml

init-prod:
[echoproperties] #Ant properties
[echoproperties] #Mon Sep 17 06:21:44 UTC 2012
[echoproperties] ant.core.lib=/home/hudson/tools/ant/apache-ant-1.7.0/lib/ant.jar
[echoproperties] ant.file=/x1/jenkins/jenkins-slave/workspace/River-QA-matrix/jdk/JDK 1.7
(latest)/label/Ubuntu/test/com-sun-jini-test-impl-end2end-End2EndTestHTTPS.td/build.xml
[echoproperties] ant.file.river-qa-matrix=/x1/jenkins/jenkins-slave/workspace/River-QA-matrix/jdk/JDK
1.7 (latest)/label/Ubuntu/test/com-sun-jini-test-impl-end2end-End2EndTestHTTPS.td/build.xml
[echoproperties] ant.home=/home/hudson/tools/ant/apache-ant-1.7.0
[echoproperties] ant.java.version=1.6
[echoproperties] ant.library.dir=/home/hudson/tools/ant/apache-ant-1.7.0/lib
[echoproperties] ant.project.name=river-qa-matrix
[echoproperties] ant.version=Apache Ant version 1.7.0 compiled on December 13 2006
[echoproperties] awt.toolkit=sun.awt.X11.XToolkit
[echoproperties] basedir=/x1/jenkins/jenkins-slave/workspace/River-QA-matrix/jdk/JDK 1.7 (latest)/label/Ubuntu/test/com-sun-jini-test-impl-end2end-End2EndTestHTTPS.td
[echoproperties] file.encoding=ANSI_X3.4-1968
[echoproperties] file.encoding.pkg=sun.io
[echoproperties] file.separator=/
[echoproperties] java.awt.graphicsenv=sun.awt.X11GraphicsEnvironment
[echoproperties] java.awt.printerjob=sun.print.PSPrinterJob
[echoproperties] java.class.path=/home/hudson/tools/ant/apache-ant-1.7.0/lib/ant-launcher.jar\:/home/hudson/tools/ant/apache-ant-1.7.0/lib/ant-launcher.jar\:/home/hudson/tools/ant/apache-ant-1.7.0/lib/ant-stylebook.jar\:/home/hudson/tools/ant/apache-ant-1.7.0/lib/ant-apache-resolver.jar\:/home/hudson/tools/ant/apache-ant-1.7.0/lib/xml-apis.jar\:/home/hudson/tools/ant/apache-ant-1.7.0/lib/ant-apache-bcel.jar\:/home/hudson/tools/ant/apache-ant-1.7.0/lib/ant-jsch.jar\:/home/hudson/tools/ant/apache-ant-1.7.0/lib/ant-jmf.jar\:/home/hudson/tools/ant/apache-ant-1.7.0/lib/ant-apache-oro.jar\:/home/hudson/tools/ant/apache-ant-1.7.0/lib/ant-netrexx.jar\:/home/hudson/tools/ant/apache-ant-1.7.0/lib/ant-nodeps.jar\:/home/hudson/tools/ant/apache-ant-1.7.0/lib/ant-testutil.jar\:/home/hudson/tools/ant/apache-ant-1.7.0/lib/ant-starteam.jar\:/home/hudson/tools/ant/apache-ant-1.7.0/lib/ant-trax.jar\:/home/hudson/tools/ant/apache-ant-1.7.0/lib/ant-javamail.jar\:/home/hudson/tools/ant/apache-ant-1.7.0/lib/ant.jar\:/home/hudson/tools/ant/apache-ant-1.7.0/lib/xercesImpl.jar\:/home/hudson/tools/ant/apache-ant-1.7.0/lib/ant-junit.jar\:/home/hudson/tools/ant/apache-ant-1.7.0/lib/ant-swing.jar\:/home/hudson/tools/ant/apache-ant-1.7.0/lib/ant-commons-net.jar\:/home/hudson/tools/ant/apache-ant-1.7.0/lib/ant-jdepend.jar\:/home/hudson/tools/ant/apache-ant-1.7.0/lib/ant-commons-logging.jar\:/home/hudson/tools/ant/apache-ant-1.7.0/lib/ant-apache-bsf.jar\:/home/hudson/tools/ant/apache-ant-1.7.0/lib/ant-weblogic.jar\:/home/hudson/tools/ant/apache-ant-1.7.0/lib/ant-apache-log4j.jar\:/home/hudson/tools/ant/apache-ant-1.7.0/lib/ant-jai.jar\:/home/hudson/tools/ant/apache-ant-1.7.0/lib/ant-apache-regexp.jar\:/home/hudson/tools/ant/apache-ant-1.7.0/lib/ant-antlr.jar\:/x1/jenkins/tools/java/jdk1.7.0_04/lib/tools.jar
[echoproperties] java.class.version=51.0
[echoproperties] java.endorsed.dirs=/x1/jenkins/tools/java/jdk1.7.0_04/jre/lib/endorsed
[echoproperties] java.ext.dirs=/x1/jenkins/tools/java/jdk1.7.0_04/jre/lib/ext\:/usr/java/packages/lib/ext
[echoproperties] java.home=/x1/jenkins/tools/java/jdk1.7.0_04/jre
[echoproperties] java.io.tmpdir=/tmp
[echoproperties] java.library.path=/x1/jenkins/tools/java/jdk1.7.0_04/jre/lib/amd64/server\:/x1/jenkins/tools/java/jdk1.7.0_04/jre/lib/amd64\:/x1/jenkins/tools/java/jdk1.7.0_04/jre/../lib/amd64\:/usr/lib/jvm/java-6-sun-1.6.0.26/jre/lib/amd64/server\:/usr/lib/jvm/java-6-sun-1.6.0.26/jre/lib/amd64\:/usr/lib/jvm/java-6-sun-1.6.0.26/jre/../lib/amd64\:/usr/java/packages/lib/amd64\:/usr/lib64\:/lib64\:/lib\:/usr/lib
[echoproperties] java.runtime.name=Java(TM) SE Runtime Environment
[echoproperties] java.runtime.version=1.7.0_04-b20
[echoproperties] java.specification.name=Java Platform API Specification
[echoproperties] java.specification.vendor=Oracle Corporation
[echoproperties] java.specification.version=1.7
[echoproperties] java.vendor=Oracle Corporation
[echoproperties] java.vendor.url=http\://java.oracle.com/
[echoproperties] java.vendor.url.bug=http\://bugreport.sun.com/bugreport/
[echoproperties] java.version=1.7.0_04
[echoproperties] java.vm.info=mixed mode
[echoproperties] java.vm.name=Java HotSpot(TM) 64-Bit Server VM
[echoproperties] java.vm.specification.name=Java Virtual Machine Specification
[echoproperties] java.vm.specification.vendor=Oracle Corporation
[echoproperties] java.vm.specification.version=1.7
[echoproperties] java.vm.vendor=Oracle Corporation
[echoproperties] java.vm.version=23.0-b21
[echoproperties] jdk=JDK 1.7 (latest)
[echoproperties] label=Ubuntu
[echoproperties] line.separator=\n
[echoproperties] os.arch=amd64
[echoproperties] os.name=Linux
[echoproperties] os.version=2.6.32-41-server
[echoproperties] path.separator=\:
[echoproperties] sun.arch.data.model=64
[echoproperties] sun.boot.class.path=/x1/jenkins/tools/java/jdk1.7.0_04/jre/lib/resources.jar\:/x1/jenkins/tools/java/jdk1.7.0_04/jre/lib/rt.jar\:/x1/jenkins/tools/java/jdk1.7.0_04/jre/lib/sunrsasign.jar\:/x1/jenkins/tools/java/jdk1.7.0_04/jre/lib/jsse.jar\:/x1/jenkins/tools/java/jdk1.7.0_04/jre/lib/jce.jar\:/x1/jenkins/tools/java/jdk1.7.0_04/jre/lib/charsets.jar\:/x1/jenkins/tools/java/jdk1.7.0_04/jre/lib/jfr.jar\:/x1/jenkins/tools/java/jdk1.7.0_04/jre/classes
[echoproperties] sun.boot.library.path=/x1/jenkins/tools/java/jdk1.7.0_04/jre/lib/amd64
[echoproperties] sun.cpu.endian=little
[echoproperties] sun.cpu.isalist=
[echoproperties] sun.io.unicode.encoding=UnicodeLittle
[echoproperties] sun.java.command=org.apache.tools.ant.launch.Launcher -cp  -Dtest\=com-sun-jini-test-impl-end2end-End2EndTestHTTPS.td
-Dlabel\=Ubuntu -Djdk\=JDK 1.7 (latest)
[echoproperties] sun.java.launcher=SUN_STANDARD
[echoproperties] sun.jnu.encoding=ANSI_X3.4-1968
[echoproperties] sun.management.compiler=HotSpot 64-Bit Tiered Compilers
[echoproperties] sun.os.patch.level=unknown
[echoproperties] test=com-sun-jini-test-impl-end2end-End2EndTestHTTPS.td
[echoproperties] user.country=US
[echoproperties] user.dir=/x1/jenkins/jenkins-slave/workspace/River-QA-matrix/jdk/JDK 1.7
(latest)/label/Ubuntu/test/com-sun-jini-test-impl-end2end-End2EndTestHTTPS.td
[echoproperties] user.home=/home/jenkins
[echoproperties] user.language=en
[echoproperties] user.name=jenkins
[echoproperties] user.timezone=

qa-tree:
    [mkdir] Created dir: /x1/jenkins/jenkins-slave/workspace/River-QA-matrix/jdk/JDK 1.7 (latest)/label/Ubuntu/test/com-sun-jini-test-impl-end2end-End2EndTestHTTPS.td/tmp
      [get] Getting: https://builds.apache.org/job/River-QA-tree/lastSuccessfulBuild/artifact/jtsk/trunk/build/qa-tree.zip
      [get] To: /x1/jenkins/jenkins-slave/workspace/River-QA-matrix/jdk/JDK 1.7 (latest)/label/Ubuntu/test/com-sun-jini-test-impl-end2end-End2EndTestHTTPS.td/tmp/qa-tree.zip
    [unzip] Expanding: /x1/jenkins/jenkins-slave/workspace/River-QA-matrix/jdk/JDK 1.7 (latest)/label/Ubuntu/test/com-sun-jini-test-impl-end2end-End2EndTestHTTPS.td/tmp/qa-tree.zip
into /x1/jenkins/jenkins-slave/workspace/River-QA-matrix/jdk/JDK 1.7 (latest)/label/Ubuntu/test/com-sun-jini-test-impl-end2end-End2EndTestHTTPS.td/build

qa-run-test:

james-brown:
    [mkdir] Created dir: /x1/jenkins/jenkins-slave/workspace/River-QA-matrix/jdk/JDK 1.7 (latest)/label/Ubuntu/test/com-sun-jini-test-impl-end2end-End2EndTestHTTPS.td/build/qa/soul
    [touch] Creating /x1/jenkins/jenkins-slave/workspace/River-QA-matrix/jdk/JDK 1.7 (latest)/label/Ubuntu/test/com-sun-jini-test-impl-end2end-End2EndTestHTTPS.td/build/qa/soul/soul.201209170621049052

run-tests:
     [java] 
     [java] -----------------------------------------
     [java] CONFIGURATION FILE:
     [java] 
     [java]    /x1/jenkins/jenkins-slave/workspace/River-QA-matrix/jdk/JDK 1.7 (latest)/label/Ubuntu/test/com-sun-jini-test-impl-end2end-End2EndTestHTTPS.td/build/qa/src/com/sun/jini/test/resources/qaHarness.prop
     [java] 
     [java] -----------------------------------------
     [java] SETTING UP THE TEST LIST:
     [java] 
     [java]    Adding test: com/sun/jini/test/impl/end2end/End2EndTestHTTPS.td
     [java] 
     [java] -----------------------------------------
     [java] GENERAL HARNESS CONFIGURATION INFORMATION:
     [java] 
     [java]    Date started:
     [java]       Mon Sep 17 06:21:50 UTC 2012
     [java]    Installation directory of the JSK:
     [java]       com.sun.jini.jsk.home=/x1/jenkins/jenkins-slave/workspace/River-QA-matrix/jdk/JDK
1.7 (latest)/label/Ubuntu/test/com-sun-jini-test-impl-end2end-End2EndTestHTTPS.td/build
     [java]    Installation directory of the harness:
     [java]       com.sun.jini.qa.home=/x1/jenkins/jenkins-slave/workspace/River-QA-matrix/jdk/JDK
1.7 (latest)/label/Ubuntu/test/com-sun-jini-test-impl-end2end-End2EndTestHTTPS.td/build/qa
     [java]    Categories being tested:
     [java]       categories=No Categories
     [java] -----------------------------------------
     [java] ENVIRONMENT PROPERTIES:
     [java] 
     [java]    JVM information:
     [java]       Java HotSpot(TM) 64-Bit Server VM, 23.0-b21, 64 bit VM mode
     [java]       Oracle Corporation
     [java]    OS information:
     [java]       Linux, 2.6.32-41-server, amd64
     [java] 
     [java] -----------------------------------------
     [java] STARTING TO RUN THE TESTS
     [java] 
     [java] 
     [java] Running com/sun/jini/test/impl/end2end/End2EndTestHTTPS.td
     [java] Time is Mon Sep 17 06:21:50 UTC 2012
     [java] Starting test in separate process with command:
     [java] /x1/jenkins/tools/java/jdk1.7.0_04/jre/bin/java -Djava.security.manager=org.apache.river.api.security.CombinerSecurityManager
-Djava.security.policy=file:/x1/jenkins/jenkins-slave/workspace/River-QA-matrix/jdk/JDK%201.7%20(latest)/label/Ubuntu/test/com-sun-jini-test-impl-end2end-End2EndTestHTTPS.td/build/qa/harness/policy/defaulttest.policy
-cp '/x1/jenkins/jenkins-slave/workspace/River-QA-matrix/jdk/JDK 1.7 (latest)/label/Ubuntu/test/com-sun-jini-test-impl-end2end-End2EndTestHTTPS.td/build/qa/lib/jiniharness.jar:/x1/jenkins/jenkins-slave/workspace/River-QA-matrix/jdk/JDK
1.7 (latest)/label/Ubuntu/test/com-sun-jini-test-impl-end2end-End2EndTestHTTPS.td/build/qa/lib/jinitests.jar:/x1/jenkins/jenkins-slave/workspace/River-QA-matrix/jdk/JDK
1.7 (latest)/label/Ubuntu/test/com-sun-jini-test-impl-end2end-End2EndTestHTTPS.td/build/lib/jsk-platform.jar:/x1/jenkins/jenkins-slave/workspace/River-QA-matrix/jdk/JDK
1.7 (latest)/label/Ubuntu/test/com-sun-jini-test-impl-end2end-End2EndTestHTTPS.td/build/lib/jsk-lib.jar:/x1/jenkins/jenkins-slave/workspace/River-QA-matrix/jdk/JDK
1.7 (latest)/label/Ubuntu/test/com-sun-jini-test-impl-end2end-End2EndTestHTTPS.td/build/lib/high-scale-lib.jar:/x1/jenkins/jenkins-slave/workspace/River-QA-matrix/jdk/JDK
1.7 (latest)/label/Ubuntu/test/com-sun-jini-test-impl-end2end-End2EndTestHTTPS.td/build/lib/reference-collections-1.0.1.jar'
'-Djava.ext.dirs=/x1/jenkins/tools/java/jdk1.7.0_04/jre/lib/ext:/usr/java/packages/lib/ext:/x1/jenkins/jenkins-slave/workspace/River-QA-matrix/jdk/JDK
1.7 (latest)/label/Ubuntu/test/com-sun-jini-test-impl-end2end-End2EndTestHTTPS.td/build/qa/lib-ext:/x1/jenkins/jenkins-slave/workspace/River-QA-matrix/jdk/JDK
1.7 (latest)/label/Ubuntu/test/com-sun-jini-test-impl-end2end-End2EndTestHTTPS.td/build/lib-ext'
-Dcom.sun.jini.jsk.port=9080 -Dcom.sun.jini.qa.port=9081 '-Dcom.sun.jini.jsk.home=/x1/jenkins/jenkins-slave/workspace/River-QA-matrix/jdk/JDK
1.7 (latest)/label/Ubuntu/test/com-sun-jini-test-impl-end2end-End2EndTestHTTPS.td/build' '-Dcom.sun.jini.qa.home=/x1/jenkins/jenkins-slave/workspace/River-QA-matrix/jdk/JDK
1.7 (latest)/label/Ubuntu/test/com-sun-jini-test-impl-end2end-End2EndTestHTTPS.td/build/qa'
'-Dcom.sun.jini.qa.harness.harnessJar=/x1/jenkins/jenkins-slave/workspace/River-QA-matrix/jdk/JDK
1.7 (latest)/label/Ubuntu/test/com-sun-jini-test-impl-end2end-End2EndTestHTTPS.td/build/qa/lib/jiniharness.jar'
'-Dcom.sun.jini.qa.harness.testJar=/x1/jenkins/jenkins-slave/workspace/River-QA-matrix/jdk/JDK
1.7 (latest)/label/Ubuntu/test/com-sun-jini-test-impl-end2end-End2EndTestHTTPS.td/build/qa/lib/jinitests.jar'
-Dcom.sun.jini.qa.harness.runjiniserver=true -Dcom.sun.jini.qa.harness.runkitserver=true -Djava.security.properties=file:/x1/jenkins/jenkins-slave/workspace/River-QA-matrix/jdk/JDK%201.7%20(latest)/label/Ubuntu/test/com-sun-jini-test-impl-end2end-End2EndTestHTTPS.td/build/qa/harness/trust/dynamic-policy.properties
-Dcom.sun.jini.qa.harness.testhosts= '-Djava.util.logging.config.file=/x1/jenkins/jenkins-slave/workspace/River-QA-matrix/jdk/JDK
1.7 (latest)/label/Ubuntu/test/com-sun-jini-test-impl-end2end-End2EndTestHTTPS.td/build/qa/src/com/sun/jini/test/resources/qa1.logging'
'-Dcom.sun.jini.test.home=/x1/jenkins/jenkins-slave/workspace/River-QA-matrix/jdk/JDK 1.7
(latest)/label/Ubuntu/test/com-sun-jini-test-impl-end2end-End2EndTestHTTPS.td/build/qa' -Dcom.sun.jini.test.port=9082
-Dcom.sun.jini.qa.harness.policies=file:/x1/jenkins/jenkins-slave/workspace/River-QA-matrix/jdk/JDK%201.7%20(latest)/label/Ubuntu/test/com-sun-jini-test-impl-end2end-End2EndTestHTTPS.td/build/qa/src/com/sun/jini/test/resources/jinitest.policy
'-Djava.ext.dirs=/x1/jenkins/tools/java/jdk1.7.0_04/jre/lib/ext:/usr/java/packages/lib/ext:/x1/jenkins/jenkins-slave/workspace/River-QA-matrix/jdk/JDK
1.7 (latest)/label/Ubuntu/test/com-sun-jini-test-impl-end2end-End2EndTestHTTPS.td/build/qa/lib-ext:/x1/jenkins/jenkins-slave/workspace/River-QA-matrix/jdk/JDK
1.7 (latest)/label/Ubuntu/test/com-sun-jini-test-impl-end2end-End2EndTestHTTPS.td/build/lib-ext'
-Djava.security.policy=file:/x1/jenkins/jenkins-slave/workspace/River-QA-matrix/jdk/JDK%201.7%20(latest)/label/Ubuntu/test/com-sun-jini-test-impl-end2end-End2EndTestHTTPS.td/build/qa/harness/policy/all.policy
com.sun.jini.qa.harness.MasterTest com/sun/jini/test/impl/end2end/End2EndTestHTTPS.td 
     [java] 
     [java] TIME: 6:21:50 AM
     [java] 
     [java] MasterTest.doTest INFO: 
     [java] ============================== CALLING SETUP() ==============================
     [java] 
     [java] -DserverDSADN=CN=serverDSA 
     [java] -Djava.security.policy=file:/x1/jenkins/jenkins-slave/workspace/River-QA-matrix/jdk/JDK%201.7%20(latest)/label/Ubuntu/test/com-sun-jini-test-impl-end2end-End2EndTestHTTPS.td/build/qa/src/com/sun/jini/test/impl/end2end/policies/end2end.policy

     [java] -DserverCodebase=file:/x1/jenkins/jenkins-slave/workspace/River-QA-matrix/jdk/JDK%201.7%20(latest)/label/Ubuntu/test/com-sun-jini-test-impl-end2end-End2EndTestHTTPS.td/build/qa/lib/qa1-end2end.jar

     [java] -DkeyStoreFile=/x1/jenkins/jenkins-slave/workspace/River-QA-matrix/jdk/JDK 1.7
(latest)/label/Ubuntu/test/com-sun-jini-test-impl-end2end-End2EndTestHTTPS.td/build/qa/src/com/sun/jini/test/impl/end2end/resources/keystore

     [java] -DthreadCount=1 
     [java] -DserverRSADN=CN=serverRSA 
     [java] -Dend2end.logArgs=boundaries,failures,finalStatistics 
     [java] -Dend2end.coverage=50 
     [java] -DserverKeytabLocation=/x1/jenkins/jenkins-slave/workspace/River-QA-matrix/jdk/JDK
1.7 (latest)/label/Ubuntu/test/com-sun-jini-test-impl-end2end-End2EndTestHTTPS.td/build/qa/harness/trust/aggregateKeytab

     [java] -Djavax.net.ssl.keyStore=/x1/jenkins/jenkins-slave/workspace/River-QA-matrix/jdk/JDK
1.7 (latest)/label/Ubuntu/test/com-sun-jini-test-impl-end2end-End2EndTestHTTPS.td/build/qa/src/com/sun/jini/test/impl/end2end/resources/keystore

     [java] -DclientRSA2Alias=clientRSA2 
     [java] -Djavax.net.ssl.keyStorePassword=keypass 
     [java] -DclientDSA2Alias=clientDSA2 
     [java] -Djavax.net.ssl.trustStore=/x1/jenkins/jenkins-slave/workspace/River-QA-matrix/jdk/JDK
1.7 (latest)/label/Ubuntu/test/com-sun-jini-test-impl-end2end-End2EndTestHTTPS.td/build/qa/src/com/sun/jini/test/impl/end2end/resources/keystore

     [java] -DcodebaseDirectory=/x1/jenkins/jenkins-slave/workspace/River-QA-matrix/jdk/JDK
1.7 (latest)/label/Ubuntu/test/com-sun-jini-test-impl-end2end-End2EndTestHTTPS.td/build/qa/lib

     [java] -Dcom.sun.jini.jsk.jars=/x1/jenkins/jenkins-slave/workspace/River-QA-matrix/jdk/JDK
1.7 (latest)/label/Ubuntu/test/com-sun-jini-test-impl-end2end-End2EndTestHTTPS.td/build/lib

     [java] -DclientDSA2DN=CN=clientDSA2 
     [java] -Dsun.rmi.transport.switchConstraintsFloor=10 
     [java] -DclientDSA1DN=CN=clientDSA1 
     [java] -DclientKeytabLocation=/x1/jenkins/jenkins-slave/workspace/River-QA-matrix/jdk/JDK
1.7 (latest)/label/Ubuntu/test/com-sun-jini-test-impl-end2end-End2EndTestHTTPS.td/build/qa/harness/trust/aggregateKeytab

     [java] -DclientRSA2DN=CN=clientRSA2 
     [java] -Dcom.sun.jini.test.jars=/x1/jenkins/jenkins-slave/workspace/River-QA-matrix/jdk/JDK
1.7 (latest)/label/Ubuntu/test/com-sun-jini-test-impl-end2end-End2EndTestHTTPS.td/build/qa/lib

     [java] -DkerberosServer=qa-e2e-server@DAVIS.JINI.SUN.COM 
     [java] -DclientCodebase=file:/x1/jenkins/jenkins-slave/workspace/River-QA-matrix/jdk/JDK%201.7%20(latest)/label/Ubuntu/test/com-sun-jini-test-impl-end2end-End2EndTestHTTPS.td/build/qa/lib/qa1-end2end.jar

     [java] -DserverDSAAlias=serverDSA 
     [java] -DkeyStorePasswordFile=/x1/jenkins/jenkins-slave/workspace/River-QA-matrix/jdk/JDK
1.7 (latest)/label/Ubuntu/test/com-sun-jini-test-impl-end2end-End2EndTestHTTPS.td/build/qa/src/com/sun/jini/test/impl/end2end/resources/keystore.password

     [java] -DserverRSAlias=serverRSA 
     [java] -DtestClassPath=/x1/jenkins/jenkins-slave/workspace/River-QA-matrix/jdk/JDK 1.7
(latest)/label/Ubuntu/test/com-sun-jini-test-impl-end2end-End2EndTestHTTPS.td/build/lib/jsk-platform.jar:lib/qa1-wrapper.jar:lib/qa1-end2end.jar

     [java] -Djava.security.auth.login.config=file:/x1/jenkins/jenkins-slave/workspace/River-QA-matrix/jdk/JDK%201.7%20(latest)/label/Ubuntu/test/com-sun-jini-test-impl-end2end-End2EndTestHTTPS.td/build/qa/src/com/sun/jini/test/impl/end2end/e2etest/Driver.login

     [java] -DclientRSA1DN=CN=clientRSA1 
     [java] -DclientRSA1Alias=clientRSA1 
     [java] -DkerberosClient=qa-e2e-client@DAVIS.JINI.SUN.COM 
     [java] -DclientDSA1Alias=clientDSA1 
     [java] -Djavax.net.ssl.trustStorePassword=keypass 
     [java] -Djavax.security.auth.useSubjectCredsOnly=false 
     [java] -Djava.rmi.server.codebase=file:/x1/jenkins/jenkins-slave/workspace/River-QA-matrix/jdk/JDK%201.7%20(latest)/label/Ubuntu/test/com-sun-jini-test-impl-end2end-End2EndTestHTTPS.td/build/qa/lib/qa1-end2end.jar

     [java] MasterTest.doTest INFO: 
     [java] =============================== CALLING RUN() ===============================
     [java] 
     [java] /x1/jenkins/tools/java/jdk1.7.0_04/jre/bin/java -DserverDSADN=CN=serverDSA -Djava.security.policy=file:/x1/jenkins/jenkins-slave/workspace/River-QA-matrix/jdk/JDK%201.7%20(latest)/label/Ubuntu/test/com-sun-jini-test-impl-end2end-End2EndTestHTTPS.td/build/qa/src/com/sun/jini/test/impl/end2end/policies/end2end.policy
-DserverCodebase=file:/x1/jenkins/jenkins-slave/workspace/River-QA-matrix/jdk/JDK%201.7%20(latest)/label/Ubuntu/test/com-sun-jini-test-impl-end2end-End2EndTestHTTPS.td/build/qa/lib/qa1-end2end.jar
-DkeyStoreFile=/x1/jenkins/jenkins-slave/workspace/River-QA-matrix/jdk/JDK 1.7 (latest)/label/Ubuntu/test/com-sun-jini-test-impl-end2end-End2EndTestHTTPS.td/build/qa/src/com/sun/jini/test/impl/end2end/resources/keystore
-DthreadCount=1 -DserverRSADN=CN=serverRSA -Dend2end.logArgs=boundaries,failures,finalStatistics
-Dend2end.coverage=50 -DserverKeytabLocation=/x1/jenkins/jenkins-slave/workspace/River-QA-matrix/jdk/JDK
1.7 (latest)/label/Ubuntu/test/com-sun-jini-test-impl-end2end-End2EndTestHTTPS.td/build/qa/harness/trust/aggregateKeytab
-Djavax.net.ssl.keyStore=/x1/jenkins/jenkins-slave/workspace/River-QA-matrix/jdk/JDK 1.7 (latest)/label/Ubuntu/test/com-sun-jini-test-impl-end2end-End2EndTestHTTPS.td/build/qa/src/com/sun/jini/test/impl/end2end/resources/keystore
-DclientRSA2Alias=clientRSA2 -Djavax.net.ssl.keyStorePassword=keypass -DclientDSA2Alias=clientDSA2
-Djavax.net.ssl.trustStore=/x1/jenkins/jenkins-slave/workspace/River-QA-matrix/jdk/JDK 1.7
(latest)/label/Ubuntu/test/com-sun-jini-test-impl-end2end-End2EndTestHTTPS.td/build/qa/src/com/sun/jini/test/impl/end2end/resources/keystore
-DcodebaseDirectory=/x1/jenkins/jenkins-slave/workspace/River-QA-matrix/jdk/JDK 1.7 (latest)/label/Ubuntu/test/com-sun-jini-test-impl-end2end-End2EndTestHTTPS.td/build/qa/lib
-Dcom.sun.jini.jsk.jars=/x1/jenkins/jenkins-slave/workspace/River-QA-matrix/jdk/JDK 1.7 (latest)/label/Ubuntu/test/com-sun-jini-test-impl-end2end-End2EndTestHTTPS.td/build/lib
-DclientDSA2DN=CN=clientDSA2 -Dsun.rmi.transport.switchConstraintsFloor=10 -DclientDSA1DN=CN=clientDSA1
-DclientKeytabLocation=/x1/jenkins/jenkins-slave/workspace/River-QA-matrix/jdk/JDK 1.7 (latest)/label/Ubuntu/test/com-sun-jini-test-impl-end2end-End2EndTestHTTPS.td/build/qa/harness/trust/aggregateKeytab
-DclientRSA2DN=CN=clientRSA2 -Dcom.sun.jini.test.jars=/x1/jenkins/jenkins-slave/workspace/River-QA-matrix/jdk/JDK
1.7 (latest)/label/Ubuntu/test/com-sun-jini-test-impl-end2end-End2EndTestHTTPS.td/build/qa/lib
-DkerberosServer=qa-e2e-server@DAVIS.JINI.SUN.COM -DclientCodebase=file:/x1/jenkins/jenkins-slave/workspace/River-QA-matrix/jdk/JDK%201.7%20(latest)/label/Ubuntu/test/com-sun-jini-test-impl-end2end-End2EndTestHTTPS.td/build/qa/lib/qa1-end2end.jar
-DserverDSAAlias=serverDSA -DkeyStorePasswordFile=/x1/jenkins/jenkins-slave/workspace/River-QA-matrix/jdk/JDK
1.7 (latest)/label/Ubuntu/test/com-sun-jini-test-impl-end2end-End2EndTestHTTPS.td/build/qa/src/com/sun/jini/test/impl/end2end/resources/keystore.password
-DserverRSAlias=serverRSA -DtestClassPath=/x1/jenkins/jenkins-slave/workspace/River-QA-matrix/jdk/JDK
1.7 (latest)/label/Ubuntu/test/com-sun-jini-test-impl-end2end-End2EndTestHTTPS.td/build/lib/jsk-platform.jar:lib/qa1-wrapper.jar:lib/qa1-end2end.jar
-Djava.security.auth.login.config=file:/x1/jenkins/jenkins-slave/workspace/River-QA-matrix/jdk/JDK%201.7%20(latest)/label/Ubuntu/test/com-sun-jini-test-impl-end2end-End2EndTestHTTPS.td/build/qa/src/com/sun/jini/test/impl/end2end/e2etest/Driver.login
-DclientRSA1DN=CN=clientRSA1 -DclientRSA1Alias=clientRSA1 -DkerberosClient=qa-e2e-client@DAVIS.JINI.SUN.COM
-DclientDSA1Alias=clientDSA1 -Djavax.net.ssl.trustStorePassword=keypass -Djavax.security.auth.useSubjectCredsOnly=false
-Djava.rmi.server.codebase=file:/x1/jenkins/jenkins-slave/workspace/River-QA-matrix/jdk/JDK%201.7%20(latest)/label/Ubuntu/test/com-sun-jini-test-impl-end2end-End2EndTestHTTPS.td/build/qa/lib/qa1-end2end.jar
-Dend2end.https=true  -cp /x1/jenkins/jenkins-slave/workspace/River-QA-matrix/jdk/JDK 1.7
(latest)/label/Ubuntu/test/com-sun-jini-test-impl-end2end-End2EndTestHTTPS.td/build/lib/jsk-platform.jar:lib/qa1-wrapper.jar:lib/qa1-end2end.jar
com.sun.jini.test.impl.end2end.e2etest.End2EndTest
     [java] Error: Could not find or load main class 1.7
     [java] com.sun.jini.qa.harness.TestException: Test did not complete see details at /tmp/end2end_565184879395323958_output/end2end.error
and /tmp/end2end_565184879395323958_output/end2end.output
     [java] 	at com.sun.jini.test.impl.end2end.e2etest.Driver.processResults(Driver.java:198)
     [java] 	at com.sun.jini.test.impl.end2end.e2etest.Driver.run(Driver.java:99)
     [java] 	at com.sun.jini.qa.harness.MasterTest.doTest(MasterTest.java:254)
     [java] 	at com.sun.jini.qa.harness.MasterTest.main(MasterTest.java:144)
     [java] MasterTest.doTest INFO: 
     [java] ============================ CALLING TEARDOWN() =============================
     [java] 
     [java] 
     [java] TIME: 6:21:51 AM
     [java] 
     [java] Test process was destroyed and returned code 1
     [java] com/sun/jini/test/impl/end2end/End2EndTestHTTPS.td
     [java] Test Failed: Test Failed: com.sun.jini.qa.harness.TestException: Test did not
complete see details at /tmp/end2end_565184879395323958_output/end2end.error and /tmp/end2end_565184879395323958_output/end2end.output
     [java] 
     [java] 
     [java] -----------------------------------------
     [java] 
     [java] SUMMARY =================================
     [java] 
     [java] com/sun/jini/test/impl/end2end/End2EndTestHTTPS.td
     [java] Test Failed: Test Failed: com.sun.jini.qa.harness.TestException: Test did not
complete see details at /tmp/end2end_565184879395323958_output/end2end.error and /tmp/end2end_565184879395323958_output/end2end.output
     [java] 
     [java] -----------------------------------------
     [java] 
     [java] # of tests started   = 1
     [java] # of tests completed = 1
     [java] # of tests passed    = 0
     [java] # of tests failed    = 1
     [java] 
     [java] -----------------------------------------
     [java] 
     [java]    Date finished:
     [java]       Mon Sep 17 06:21:56 UTC 2012
     [java]    Time elapsed:
     [java]       5 seconds
     [java] 
     [java] Java Result: 1

collect-result:

BUILD FAILED
/x1/jenkins/jenkins-slave/workspace/River-QA-matrix/jdk/JDK 1.7 (latest)/label/Ubuntu/test/com-sun-jini-test-impl-end2end-End2EndTestHTTPS.td/build.xml:74:
The following error occurred while executing this line:
/x1/jenkins/jenkins-slave/workspace/River-QA-matrix/jdk/JDK 1.7 (latest)/label/Ubuntu/test/com-sun-jini-test-impl-end2end-End2EndTestHTTPS.td/build/qa/build.xml:357:
condition satisfied

Total time: 12 seconds
Build step 'Invoke Ant' marked build as failure
[locks-and-latches] Releasing all the locks
[locks-and-latches] All the locks released

Mime
View raw message