river-dev mailing list archives

Site index · List index
Message view « Date » · « Thread »
Top « Date » · « Thread »
From Apache Jenkins Server <jenk...@builds.apache.org>
Subject Build failed in Jenkins: River-QA-matrix » JDK 1.7 (latest),Ubuntu,com-sun-jini-test-spec-loader-pref-preferredClassProvider-GetClassLoaderSecurityExceptionFileCann.td #18
Date Sat, 15 Sep 2012 20:58:47 GMT
See <https://builds.apache.org/job/River-QA-matrix/./jdk=JDK%201.7%20(latest),label=Ubuntu,test=com-sun-jini-test-spec-loader-pref-preferredClassProvider-GetClassLoaderSecurityExceptionFileCann.td/18/>

------------------------------------------
Started by upstream project "River-QA-matrix" build number 18
Building remotely on ubuntu4 in workspace <https://builds.apache.org/job/River-QA-matrix/./jdk=JDK%201.7%20(latest),label=Ubuntu,test=com-sun-jini-test-spec-loader-pref-preferredClassProvider-GetClassLoaderSecurityExceptionFileCann.td/ws/>
Checking out a fresh workspace because there's no workspace at <https://builds.apache.org/job/River-QA-matrix/./jdk=JDK%201.7%20(latest),label=Ubuntu,test=com-sun-jini-test-spec-loader-pref-preferredClassProvider-GetClassLoaderSecurityExceptionFileCann.td/ws/>
Cleaning local Directory .
Checking out http://svn.apache.org/repos/asf/river/jtsk/trunk/qa-matrix
A         build.xml
 U        .
At revision 1385090
[com-sun-jini-test-spec-loader-pref-preferredClassProvider-GetClassLoaderSecurityExceptionFileCann.td]
$ /home/hudson/tools/ant/apache-ant-1.7.0/bin/ant -Dtest=com-sun-jini-test-spec-loader-pref-preferredClassProvider-GetClassLoaderSecurityExceptionFileCann.td
-Dlabel=Ubuntu "-Djdk=JDK 1.7 (latest)"
Buildfile: build.xml

init-prod:
[echoproperties] #Ant properties
[echoproperties] #Sat Sep 15 20:58:14 UTC 2012
[echoproperties] ant.core.lib=/home/hudson/tools/ant/apache-ant-1.7.0/lib/ant.jar
[echoproperties] ant.file=<https://builds.apache.org/job/River-QA-matrix/./jdk=JDK%201.7%20(latest),label=Ubuntu,test=com-sun-jini-test-spec-loader-pref-preferredClassProvider-GetClassLoaderSecurityExceptionFileCann.td/ws/build.xml>
[echoproperties] ant.file.river-qa-matrix=<https://builds.apache.org/job/River-QA-matrix/./jdk=JDK%201.7%20(latest),label=Ubuntu,test=com-sun-jini-test-spec-loader-pref-preferredClassProvider-GetClassLoaderSecurityExceptionFileCann.td/ws/build.xml>
[echoproperties] ant.home=/home/hudson/tools/ant/apache-ant-1.7.0
[echoproperties] ant.java.version=1.6
[echoproperties] ant.library.dir=/home/hudson/tools/ant/apache-ant-1.7.0/lib
[echoproperties] ant.project.name=river-qa-matrix
[echoproperties] ant.version=Apache Ant version 1.7.0 compiled on December 13 2006
[echoproperties] awt.toolkit=sun.awt.X11.XToolkit
[echoproperties] basedir=<https://builds.apache.org/job/River-QA-matrix/./jdk=JDK%201.7%20(latest),label=Ubuntu,test=com-sun-jini-test-spec-loader-pref-preferredClassProvider-GetClassLoaderSecurityExceptionFileCann.td/ws/>
[echoproperties] file.encoding=ANSI_X3.4-1968
[echoproperties] file.encoding.pkg=sun.io
[echoproperties] file.separator=/
[echoproperties] java.awt.graphicsenv=sun.awt.X11GraphicsEnvironment
[echoproperties] java.awt.printerjob=sun.print.PSPrinterJob
[echoproperties] java.class.path=/home/hudson/tools/ant/apache-ant-1.7.0/lib/ant-launcher.jar\:/home/hudson/tools/ant/apache-ant-1.7.0/lib/ant-apache-resolver.jar\:/home/hudson/tools/ant/apache-ant-1.7.0/lib/ant-apache-bcel.jar\:/home/hudson/tools/ant/apache-ant-1.7.0/lib/ant-netrexx.jar\:/home/hudson/tools/ant/apache-ant-1.7.0/lib/ant-commons-net.jar\:/home/hudson/tools/ant/apache-ant-1.7.0/lib/ant-javamail.jar\:/home/hudson/tools/ant/apache-ant-1.7.0/lib/ant-commons-logging.jar\:/home/hudson/tools/ant/apache-ant-1.7.0/lib/ant-launcher.jar\:/home/hudson/tools/ant/apache-ant-1.7.0/lib/ant-trax.jar\:/home/hudson/tools/ant/apache-ant-1.7.0/lib/ant-apache-bsf.jar\:/home/hudson/tools/ant/apache-ant-1.7.0/lib/ant-testutil.jar\:/home/hudson/tools/ant/apache-ant-1.7.0/lib/ant-jdepend.jar\:/home/hudson/tools/ant/apache-ant-1.7.0/lib/ant-stylebook.jar\:/home/hudson/tools/ant/apache-ant-1.7.0/lib/xml-apis.jar\:/home/hudson/tools/ant/apache-ant-1.7.0/lib/ant-apache-oro.jar\:/home/hudson/tools/ant/apache-ant-1.7.0/lib/ant.jar\:/home/hudson/tools/ant/apache-ant-1.7.0/lib/ant-swing.jar\:/home/hudson/tools/ant/apache-ant-1.7.0/lib/ant-apache-log4j.jar\:/home/hudson/tools/ant/apache-ant-1.7.0/lib/ant-junit.jar\:/home/hudson/tools/ant/apache-ant-1.7.0/lib/ant-nodeps.jar\:/home/hudson/tools/ant/apache-ant-1.7.0/lib/ant-apache-regexp.jar\:/home/hudson/tools/ant/apache-ant-1.7.0/lib/ant-jsch.jar\:/home/hudson/tools/ant/apache-ant-1.7.0/lib/ant-starteam.jar\:/home/hudson/tools/ant/apache-ant-1.7.0/lib/ant-jai.jar\:/home/hudson/tools/ant/apache-ant-1.7.0/lib/ant-antlr.jar\:/home/hudson/tools/ant/apache-ant-1.7.0/lib/ant-jmf.jar\:/home/hudson/tools/ant/apache-ant-1.7.0/lib/ant-weblogic.jar\:/home/hudson/tools/ant/apache-ant-1.7.0/lib/xercesImpl.jar\:/home/jenkins/tools/java/jdk1.7.0_04/lib/tools.jar
[echoproperties] java.class.version=51.0
[echoproperties] java.endorsed.dirs=/home/jenkins/tools/java/jdk1.7.0_04/jre/lib/endorsed
[echoproperties] java.ext.dirs=/home/jenkins/tools/java/jdk1.7.0_04/jre/lib/ext\:/usr/java/packages/lib/ext
[echoproperties] java.home=/home/jenkins/tools/java/jdk1.7.0_04/jre
[echoproperties] java.io.tmpdir=/tmp
[echoproperties] java.library.path=/home/jenkins/tools/java/jdk1.7.0_04/jre/lib/amd64/server\:/home/jenkins/tools/java/jdk1.7.0_04/jre/lib/amd64\:/home/jenkins/tools/java/jdk1.7.0_04/jre/../lib/amd64\:/usr/lib/jvm/java-6-openjdk/jre/lib/amd64/server\:/usr/lib/jvm/java-6-openjdk/jre/lib/amd64\:/usr/lib/jvm/java-6-openjdk/jre/../lib/amd64\:/usr/java/packages/lib/amd64\:/usr/lib64\:/lib64\:/lib\:/usr/lib
[echoproperties] java.runtime.name=Java(TM) SE Runtime Environment
[echoproperties] java.runtime.version=1.7.0_04-b20
[echoproperties] java.specification.name=Java Platform API Specification
[echoproperties] java.specification.vendor=Oracle Corporation
[echoproperties] java.specification.version=1.7
[echoproperties] java.vendor=Oracle Corporation
[echoproperties] java.vendor.url=http\://java.oracle.com/
[echoproperties] java.vendor.url.bug=http\://bugreport.sun.com/bugreport/
[echoproperties] java.version=1.7.0_04
[echoproperties] java.vm.info=mixed mode
[echoproperties] java.vm.name=Java HotSpot(TM) 64-Bit Server VM
[echoproperties] java.vm.specification.name=Java Virtual Machine Specification
[echoproperties] java.vm.specification.vendor=Oracle Corporation
[echoproperties] java.vm.specification.version=1.7
[echoproperties] java.vm.vendor=Oracle Corporation
[echoproperties] java.vm.version=23.0-b21
[echoproperties] jdk=JDK 1.7 (latest)
[echoproperties] label=Ubuntu
[echoproperties] line.separator=\n
[echoproperties] os.arch=amd64
[echoproperties] os.name=Linux
[echoproperties] os.version=2.6.32-41-server
[echoproperties] path.separator=\:
[echoproperties] sun.arch.data.model=64
[echoproperties] sun.boot.class.path=/home/jenkins/tools/java/jdk1.7.0_04/jre/lib/resources.jar\:/home/jenkins/tools/java/jdk1.7.0_04/jre/lib/rt.jar\:/home/jenkins/tools/java/jdk1.7.0_04/jre/lib/sunrsasign.jar\:/home/jenkins/tools/java/jdk1.7.0_04/jre/lib/jsse.jar\:/home/jenkins/tools/java/jdk1.7.0_04/jre/lib/jce.jar\:/home/jenkins/tools/java/jdk1.7.0_04/jre/lib/charsets.jar\:/home/jenkins/tools/java/jdk1.7.0_04/jre/lib/jfr.jar\:/home/jenkins/tools/java/jdk1.7.0_04/jre/classes
[echoproperties] sun.boot.library.path=/home/jenkins/tools/java/jdk1.7.0_04/jre/lib/amd64
[echoproperties] sun.cpu.endian=little
[echoproperties] sun.cpu.isalist=
[echoproperties] sun.io.unicode.encoding=UnicodeLittle
[echoproperties] sun.java.command=org.apache.tools.ant.launch.Launcher -cp  -Dtest\=com-sun-jini-test-spec-loader-pref-preferredClassProvider-GetClassLoaderSecurityExceptionFileCann.td
-Dlabel\=Ubuntu -Djdk\=JDK 1.7 (latest)
[echoproperties] sun.java.launcher=SUN_STANDARD
[echoproperties] sun.jnu.encoding=ANSI_X3.4-1968
[echoproperties] sun.management.compiler=HotSpot 64-Bit Tiered Compilers
[echoproperties] sun.os.patch.level=unknown
[echoproperties] test=com-sun-jini-test-spec-loader-pref-preferredClassProvider-GetClassLoaderSecurityExceptionFileCann.td
[echoproperties] user.country=US
[echoproperties] user.dir=<https://builds.apache.org/job/River-QA-matrix/./jdk=JDK%201.7%20(latest),label=Ubuntu,test=com-sun-jini-test-spec-loader-pref-preferredClassProvider-GetClassLoaderSecurityExceptionFileCann.td/ws/>
[echoproperties] user.home=/home/jenkins
[echoproperties] user.language=en
[echoproperties] user.name=jenkins
[echoproperties] user.timezone=

qa-tree:
    [mkdir] Created dir: <https://builds.apache.org/job/River-QA-matrix/./jdk=JDK%201.7%20(latest),label=Ubuntu,test=com-sun-jini-test-spec-loader-pref-preferredClassProvider-GetClassLoaderSecurityExceptionFileCann.td/ws/tmp>
      [get] Getting: https://builds.apache.org/job/River-QA-tree/lastSuccessfulBuild/artifact/jtsk/trunk/build/qa-tree.zip
      [get] To: <https://builds.apache.org/job/River-QA-matrix/./jdk=JDK%201.7%20(latest),label=Ubuntu,test=com-sun-jini-test-spec-loader-pref-preferredClassProvider-GetClassLoaderSecurityExceptionFileCann.td/ws/tmp/qa-tree.zip>
    [unzip] Expanding: <https://builds.apache.org/job/River-QA-matrix/./jdk=JDK%201.7%20(latest),label=Ubuntu,test=com-sun-jini-test-spec-loader-pref-preferredClassProvider-GetClassLoaderSecurityExceptionFileCann.td/ws/tmp/qa-tree.zip>
into <https://builds.apache.org/job/River-QA-matrix/./jdk=JDK%201.7%20(latest),label=Ubuntu,test=com-sun-jini-test-spec-loader-pref-preferredClassProvider-GetClassLoaderSecurityExceptionFileCann.td/ws/build>

qa-run-test:

james-brown:
    [mkdir] Created dir: <https://builds.apache.org/job/River-QA-matrix/./jdk=JDK%201.7%20(latest),label=Ubuntu,test=com-sun-jini-test-spec-loader-pref-preferredClassProvider-GetClassLoaderSecurityExceptionFileCann.td/ws/build/qa/soul>
    [touch] Creating <https://builds.apache.org/job/River-QA-matrix/./jdk=JDK%201.7%20(latest),label=Ubuntu,test=com-sun-jini-test-spec-loader-pref-preferredClassProvider-GetClassLoaderSecurityExceptionFileCann.td/ws/build/qa/soul/soul.201209152058039684>

run-tests:
     [java] 
     [java] -----------------------------------------
     [java] CONFIGURATION FILE:
     [java] 
     [java]    <https://builds.apache.org/job/River-QA-matrix/./jdk=JDK%201.7%20(latest),label=Ubuntu,test=com-sun-jini-test-spec-loader-pref-preferredClassProvider-GetClassLoaderSecurityExceptionFileCann.td/ws/build/qa/src/com/sun/jini/test/resources/qaHarness.prop>
     [java] 
     [java] -----------------------------------------
     [java] SETTING UP THE TEST LIST:
     [java] 
     [java]    Adding test: com/sun/jini/test/spec/loader/pref/preferredClassProvider/GetClassLoaderSecurityExceptionFileCann.td
     [java] 
     [java] -----------------------------------------
     [java] GENERAL HARNESS CONFIGURATION INFORMATION:
     [java] 
     [java]    Date started:
     [java]       Sat Sep 15 20:58:40 UTC 2012
     [java]    Installation directory of the JSK:
     [java]       com.sun.jini.jsk.home=<https://builds.apache.org/job/River-QA-matrix/./jdk=JDK%201.7%20(latest),label=Ubuntu,test=com-sun-jini-test-spec-loader-pref-preferredClassProvider-GetClassLoaderSecurityExceptionFileCann.td/ws/build>
     [java]    Installation directory of the harness:
     [java]       com.sun.jini.qa.home=<https://builds.apache.org/job/River-QA-matrix/./jdk=JDK%201.7%20(latest),label=Ubuntu,test=com-sun-jini-test-spec-loader-pref-preferredClassProvider-GetClassLoaderSecurityExceptionFileCann.td/ws/build/qa>
     [java]    Categories being tested:
     [java]       categories=No Categories
     [java] -----------------------------------------
     [java] ENVIRONMENT PROPERTIES:
     [java] 
     [java]    JVM information:
     [java]       Java HotSpot(TM) 64-Bit Server VM, 23.0-b21, 64 bit VM mode
     [java]       Oracle Corporation
     [java]    OS information:
     [java]       Linux, 2.6.32-41-server, amd64
     [java] 
     [java] -----------------------------------------
     [java] STARTING TO RUN THE TESTS
     [java] 
     [java] 
     [java] Running com/sun/jini/test/spec/loader/pref/preferredClassProvider/GetClassLoaderSecurityExceptionFileCann.td
     [java] Time is Sat Sep 15 20:58:40 UTC 2012
     [java] Starting test in separate process with command:
     [java] /home/jenkins/tools/java/jdk1.7.0_04/jre/bin/java -Djava.security.manager=org.apache.river.api.security.CombinerSecurityManager
-Djava.security.policy=<https://builds.apache.org/job/River-QA-matrix/./jdk=JDK%201.7%20(latest),label=Ubuntu,test=com-sun-jini-test-spec-loader-pref-preferredClassProvider-GetClassLoaderSecurityExceptionFileCann.td/ws/build/qa/src/com/sun/jini/test/spec/loader/pref/preferredClassProvider/loaderNoGetClassLoader.policy>
-cp '<https://builds.apache.org/job/River-QA-matrix/./jdk=JDK%201.7%20(latest),label=Ubuntu,test=com-sun-jini-test-spec-loader-pref-preferredClassProvider-GetClassLoaderSecurityExceptionFileCann.td/ws/build/qa/lib/jiniharness.jar>:<https://builds.apache.org/job/River-QA-matrix/./jdk=JDK%201.7%20(latest),label=Ubuntu,test=com-sun-jini-test-spec-loader-pref-preferredClassProvider-GetClassLoaderSecurityExceptionFileCann.td/ws/build/qa/lib/jinitests.jar>:<https://builds.apache.org/job/River-QA-matrix/./jdk=JDK%201.7%20(latest),label=Ubuntu,test=com-sun-jini-test-spec-loader-pref-preferredClassProvider-GetClassLoaderSecurityExceptionFileCann.td/ws/build/lib/jsk-platform.jar>:<https://builds.apache.org/job/River-QA-matrix/./jdk=JDK%201.7%20(latest),label=Ubuntu,test=com-sun-jini-test-spec-loader-pref-preferredClassProvider-GetClassLoaderSecurityExceptionFileCann.td/ws/build/lib/jsk-lib.jar>:<https://builds.apache.org/job/River-QA-matrix/./jdk=JDK%201.7%20(latest),label=Ubuntu,test=com-sun-jini-test-spec-loader-pref-preferredClassProvider-GetClassLoaderSecurityExceptionFileCann.td/ws/build/lib/high-scale-lib.jar>:<https://builds.apache.org/job/River-QA-matrix/./jdk=JDK%201.7%20(latest),label=Ubuntu,test=com-sun-jini-test-spec-loader-pref-preferredClassProvider-GetClassLoaderSecurityExceptionFileCann.td/ws/build/lib/reference-collections-1.0.1.jar'>
'-Djava.ext.dirs=/home/jenkins/tools/java/jdk1.7.0_04/jre/lib/ext:/usr/java/packages/lib/ext:<https://builds.apache.org/job/River-QA-matrix/./jdk=JDK%201.7%20(latest),label=Ubuntu,test=com-sun-jini-test-spec-loader-pref-preferredClassProvider-GetClassLoaderSecurityExceptionFileCann.td/ws/build/qa/lib-ext>:<https://builds.apache.org/job/River-QA-matrix/./jdk=JDK%201.7%20(latest),label=Ubuntu,test=com-sun-jini-test-spec-loader-pref-preferredClassProvider-GetClassLoaderSecurityExceptionFileCann.td/ws/build/lib-ext'>
-Dcom.sun.jini.jsk.port=9080 -Dcom.sun.jini.qa.port=9081 '-Dcom.sun.jini.jsk.home=<https://builds.apache.org/job/River-QA-matrix/./jdk=JDK%201.7%20(latest),label=Ubuntu,test=com-sun-jini-test-spec-loader-pref-preferredClassProvider-GetClassLoaderSecurityExceptionFileCann.td/ws/build'>
'-Dcom.sun.jini.qa.home=<https://builds.apache.org/job/River-QA-matrix/./jdk=JDK%201.7%20(latest),label=Ubuntu,test=com-sun-jini-test-spec-loader-pref-preferredClassProvider-GetClassLoaderSecurityExceptionFileCann.td/ws/build/qa'>
'-Dcom.sun.jini.qa.harness.harnessJar=<https://builds.apache.org/job/River-QA-matrix/./jdk=JDK%201.7%20(latest),label=Ubuntu,test=com-sun-jini-test-spec-loader-pref-preferredClassProvider-GetClassLoaderSecurityExceptionFileCann.td/ws/build/qa/lib/jiniharness.jar'>
'-Dcom.sun.jini.qa.harness.testJar=<https://builds.apache.org/job/River-QA-matrix/./jdk=JDK%201.7%20(latest),label=Ubuntu,test=com-sun-jini-test-spec-loader-pref-preferredClassProvider-GetClassLoaderSecurityExceptionFileCann.td/ws/build/qa/lib/jinitests.jar'>
-Dcom.sun.jini.qa.harness.runjiniserver=false -Dcom.sun.jini.qa.harness.runkitserver=false
-Djava.security.properties=<https://builds.apache.org/job/River-QA-matrix/./jdk=JDK%201.7%20(latest),label=Ubuntu,test=com-sun-jini-test-spec-loader-pref-preferredClassProvider-GetClassLoaderSecurityExceptionFileCann.td/ws/build/qa/harness/trust/dynamic-policy.properties>
-Dcom.sun.jini.qa.harness.testhosts= '-Djava.util.logging.config.file=<https://builds.apache.org/job/River-QA-matrix/./jdk=JDK%201.7%20(latest),label=Ubuntu,test=com-sun-jini-test-spec-loader-pref-preferredClassProvider-GetClassLoaderSecurityExceptionFileCann.td/ws/build/qa/src/com/sun/jini/test/resources/qa1.logging'>
'-Dcom.sun.jini.test.home=<https://builds.apache.org/job/River-QA-matrix/./jdk=JDK%201.7%20(latest),label=Ubuntu,test=com-sun-jini-test-spec-loader-pref-preferredClassProvider-GetClassLoaderSecurityExceptionFileCann.td/ws/build/qa'>
-Dcom.sun.jini.test.port=9082 -Dcom.sun.jini.qa.harness.policies=<https://builds.apache.org/job/River-QA-matrix/./jdk=JDK%201.7%20(latest),label=Ubuntu,test=com-sun-jini-test-spec-loader-pref-preferredClassProvider-GetClassLoaderSecurityExceptionFileCann.td/ws/build/qa/src/com/sun/jini/test/resources/jinitest.policy>
'-Djava.ext.dirs=/home/jenkins/tools/java/jdk1.7.0_04/jre/lib/ext:/usr/java/packages/lib/ext:<https://builds.apache.org/job/River-QA-matrix/./jdk=JDK%201.7%20(latest),label=Ubuntu,test=com-sun-jini-test-spec-loader-pref-preferredClassProvider-GetClassLoaderSecurityExceptionFileCann.td/ws/build/qa/lib-ext>:<https://builds.apache.org/job/River-QA-matrix/./jdk=JDK%201.7%20(latest),label=Ubuntu,test=com-sun-jini-test-spec-loader-pref-preferredClassProvider-GetClassLoaderSecurityExceptionFileCann.td/ws/build/lib-ext'>
-Djava.rmi.server.RMIClassLoaderSpi=com.sun.jini.test.spec.loader.util.QATestPreferredClassProvider
com.sun.jini.qa.harness.MasterTest com/sun/jini/test/spec/loader/pref/preferredClassProvider/GetClassLoaderSecurityExceptionFileCann.td

     [java] Sep 15, 2012 8:58:41 PM com.sun.jini.qa.harness.HeartOfTheMachine start
     [java] SEVERE: Heart NOT started
     [java] 
     [java] TIME: 8:58:41 PM
     [java] 
     [java] MasterTest.doTest INFO: 
     [java] ============================== CALLING SETUP() ==============================
     [java] 
     [java] MasterTest.doTest INFO: 
     [java] =============================== CALLING RUN() ===============================
     [java] 
     [java] java.lang.NullPointerException
     [java] 	at com.sun.jini.test.spec.loader.pref.preferredClassProvider.GetClassLoaderSecurityException.run(GetClassLoaderSecurityException.java:196)
     [java] 	at com.sun.jini.qa.harness.MasterTest.doTest(MasterTest.java:254)
     [java] 	at com.sun.jini.qa.harness.MasterTest.main(MasterTest.java:144)
     [java] MasterTest.doTest INFO: 
     [java] ============================ CALLING TEARDOWN() =============================
     [java] 
     [java] 
     [java] TIME: 8:58:41 PM
     [java] 
     [java] Test process was destroyed and returned code 1
     [java] com/sun/jini/test/spec/loader/pref/preferredClassProvider/GetClassLoaderSecurityExceptionFileCann.td
     [java] Test Failed: Test Failed with an Unexpected Exception: java.lang.NullPointerException
     [java] 
     [java] 
     [java] -----------------------------------------
     [java] 
     [java] SUMMARY =================================
     [java] 
     [java] com/sun/jini/test/spec/loader/pref/preferredClassProvider/GetClassLoaderSecurityExceptionFileCann.td
     [java] Test Failed: Test Failed with an Unexpected Exception: java.lang.NullPointerException
     [java] 
     [java] -----------------------------------------
     [java] 
     [java] # of tests started   = 1
     [java] # of tests completed = 1
     [java] # of tests passed    = 0
     [java] # of tests failed    = 1
     [java] 
     [java] -----------------------------------------
     [java] 
     [java]    Date finished:
     [java]       Sat Sep 15 20:58:46 UTC 2012
     [java]    Time elapsed:
     [java]       5 seconds
     [java] 
     [java] Java Result: 1

collect-result:

BUILD FAILED
<https://builds.apache.org/job/River-QA-matrix/./jdk=JDK%201.7%20(latest),label=Ubuntu,test=com-sun-jini-test-spec-loader-pref-preferredClassProvider-GetClassLoaderSecurityExceptionFileCann.td/ws/build.xml>:74:
The following error occurred while executing this line:
<https://builds.apache.org/job/River-QA-matrix/./jdk=JDK%201.7%20(latest),label=Ubuntu,test=com-sun-jini-test-spec-loader-pref-preferredClassProvider-GetClassLoaderSecurityExceptionFileCann.td/ws/build/qa/build.xml>:357:
condition satisfied

Total time: 32 seconds
Build step 'Invoke Ant' marked build as failure

Mime
View raw message