river-dev mailing list archives

Site index · List index
Message view « Date » · « Thread »
Top « Date » · « Thread »
From Apache Jenkins Server <jenk...@builds.apache.org>
Subject Build failed in Jenkins: River-QA-matrix » JDK 1.7 (latest),Ubuntu,com-sun-jini-test-impl-discoverymanager-RemoveGroupsLocsDiscard.td #18
Date Sun, 16 Sep 2012 17:55:23 GMT
See <https://builds.apache.org/job/River-QA-matrix/./jdk=JDK%201.7%20(latest),label=Ubuntu,test=com-sun-jini-test-impl-discoverymanager-RemoveGroupsLocsDiscard.td/18/>

------------------------------------------
[...truncated 65 lines...]
[echoproperties] sun.java.command=org.apache.tools.ant.launch.Launcher -cp  -Dtest\=com-sun-jini-test-impl-discoverymanager-RemoveGroupsLocsDiscard.td
-Dlabel\=Ubuntu -Djdk\=JDK 1.7 (latest)
[echoproperties] sun.java.launcher=SUN_STANDARD
[echoproperties] sun.jnu.encoding=ANSI_X3.4-1968
[echoproperties] sun.management.compiler=HotSpot Tiered Compilers
[echoproperties] sun.os.patch.level=unknown
[echoproperties] test=com-sun-jini-test-impl-discoverymanager-RemoveGroupsLocsDiscard.td
[echoproperties] user.country=US
[echoproperties] user.dir=<https://builds.apache.org/job/River-QA-matrix/./jdk=JDK%201.7%20(latest),label=Ubuntu,test=com-sun-jini-test-impl-discoverymanager-RemoveGroupsLocsDiscard.td/ws/>
[echoproperties] user.home=/home/jenkins
[echoproperties] user.language=en
[echoproperties] user.name=jenkins
[echoproperties] user.timezone=

qa-tree:
    [mkdir] Created dir: <https://builds.apache.org/job/River-QA-matrix/./jdk=JDK%201.7%20(latest),label=Ubuntu,test=com-sun-jini-test-impl-discoverymanager-RemoveGroupsLocsDiscard.td/ws/tmp>
      [get] Getting: https://builds.apache.org/job/River-QA-tree/lastSuccessfulBuild/artifact/jtsk/trunk/build/qa-tree.zip
      [get] To: <https://builds.apache.org/job/River-QA-matrix/./jdk=JDK%201.7%20(latest),label=Ubuntu,test=com-sun-jini-test-impl-discoverymanager-RemoveGroupsLocsDiscard.td/ws/tmp/qa-tree.zip>
    [unzip] Expanding: <https://builds.apache.org/job/River-QA-matrix/./jdk=JDK%201.7%20(latest),label=Ubuntu,test=com-sun-jini-test-impl-discoverymanager-RemoveGroupsLocsDiscard.td/ws/tmp/qa-tree.zip>
into <https://builds.apache.org/job/River-QA-matrix/./jdk=JDK%201.7%20(latest),label=Ubuntu,test=com-sun-jini-test-impl-discoverymanager-RemoveGroupsLocsDiscard.td/ws/build>

qa-run-test:

james-brown:
    [mkdir] Created dir: <https://builds.apache.org/job/River-QA-matrix/./jdk=JDK%201.7%20(latest),label=Ubuntu,test=com-sun-jini-test-impl-discoverymanager-RemoveGroupsLocsDiscard.td/ws/build/qa/soul>
    [touch] Creating <https://builds.apache.org/job/River-QA-matrix/./jdk=JDK%201.7%20(latest),label=Ubuntu,test=com-sun-jini-test-impl-discoverymanager-RemoveGroupsLocsDiscard.td/ws/build/qa/soul/soul.201209161755011397>

run-tests:
     [java] 
     [java] -----------------------------------------
     [java] CONFIGURATION FILE:
     [java] 
     [java]    <https://builds.apache.org/job/River-QA-matrix/./jdk=JDK%201.7%20(latest),label=Ubuntu,test=com-sun-jini-test-impl-discoverymanager-RemoveGroupsLocsDiscard.td/ws/build/qa/src/com/sun/jini/test/resources/qaHarness.prop>
     [java] 
     [java] -----------------------------------------
     [java] SETTING UP THE TEST LIST:
     [java] 
     [java]    Adding test: com/sun/jini/test/impl/discoverymanager/RemoveGroupsLocsDiscard.td
     [java] 
     [java] -----------------------------------------
     [java] GENERAL HARNESS CONFIGURATION INFORMATION:
     [java] 
     [java]    Date started:
     [java]       Sun Sep 16 17:55:12 UTC 2012
     [java]    Installation directory of the JSK:
     [java]       com.sun.jini.jsk.home=<https://builds.apache.org/job/River-QA-matrix/./jdk=JDK%201.7%20(latest),label=Ubuntu,test=com-sun-jini-test-impl-discoverymanager-RemoveGroupsLocsDiscard.td/ws/build>
     [java]    Installation directory of the harness:
     [java]       com.sun.jini.qa.home=<https://builds.apache.org/job/River-QA-matrix/./jdk=JDK%201.7%20(latest),label=Ubuntu,test=com-sun-jini-test-impl-discoverymanager-RemoveGroupsLocsDiscard.td/ws/build/qa>
     [java]    Categories being tested:
     [java]       categories=No Categories
     [java] -----------------------------------------
     [java] ENVIRONMENT PROPERTIES:
     [java] 
     [java]    JVM information:
     [java]       Java HotSpot(TM) Server VM, 21.0-b17, 32 bit VM mode
     [java]       Oracle Corporation
     [java]    OS information:
     [java]       Linux, 2.6.32-41-server, i386
     [java] 
     [java] -----------------------------------------
     [java] STARTING TO RUN THE TESTS
     [java] 
     [java] 
     [java] Running com/sun/jini/test/impl/discoverymanager/RemoveGroupsLocsDiscard.td
     [java] Time is Sun Sep 16 17:55:12 UTC 2012
     [java] Starting test in separate process with command:
     [java] /home/jenkins/tools/java/jdk1.7.0-32/jre/bin/java -Djava.security.manager=org.apache.river.api.security.CombinerSecurityManager
-Djava.security.policy=<https://builds.apache.org/job/River-QA-matrix/./jdk=JDK%201.7%20(latest),label=Ubuntu,test=com-sun-jini-test-impl-discoverymanager-RemoveGroupsLocsDiscard.td/ws/build/qa/harness/policy/defaulttest.policy>
-Djava.rmi.server.codebase=http://juno:9082/qa1-share-dl.jar -cp '<https://builds.apache.org/job/River-QA-matrix/./jdk=JDK%201.7%20(latest),label=Ubuntu,test=com-sun-jini-test-impl-discoverymanager-RemoveGroupsLocsDiscard.td/ws/build/qa/lib/jiniharness.jar>:<https://builds.apache.org/job/River-QA-matrix/./jdk=JDK%201.7%20(latest),label=Ubuntu,test=com-sun-jini-test-impl-discoverymanager-RemoveGroupsLocsDiscard.td/ws/build/qa/lib/jinitests.jar>:<https://builds.apache.org/job/River-QA-matrix/./jdk=JDK%201.7%20(latest),label=Ubuntu,test=com-sun-jini-test-impl-discoverymanager-RemoveGroupsLocsDiscard.td/ws/build/lib/jsk-platform.jar>:<https://builds.apache.org/job/River-QA-matrix/./jdk=JDK%201.7%20(latest),label=Ubuntu,test=com-sun-jini-test-impl-discoverymanager-RemoveGroupsLocsDiscard.td/ws/build/lib/jsk-lib.jar>:<https://builds.apache.org/job/River-QA-matrix/./jdk=JDK%201.7%20(latest),label=Ubuntu,test=com-sun-jini-test-impl-discoverymanager-RemoveGroupsLocsDiscard.td/ws/build/lib/high-scale-lib.jar>:<https://builds.apache.org/job/River-QA-matrix/./jdk=JDK%201.7%20(latest),label=Ubuntu,test=com-sun-jini-test-impl-discoverymanager-RemoveGroupsLocsDiscard.td/ws/build/lib/reference-collections-1.0.1.jar'>
-client '-Djava.ext.dirs=/home/jenkins/tools/java/jdk1.7.0-32/jre/lib/ext:/usr/java/packages/lib/ext:<https://builds.apache.org/job/River-QA-matrix/./jdk=JDK%201.7%20(latest),label=Ubuntu,test=com-sun-jini-test-impl-discoverymanager-RemoveGroupsLocsDiscard.td/ws/build/qa/lib-ext>:<https://builds.apache.org/job/River-QA-matrix/./jdk=JDK%201.7%20(latest),label=Ubuntu,test=com-sun-jini-test-impl-discoverymanager-RemoveGroupsLocsDiscard.td/ws/build/lib-ext'>
-Dcom.sun.jini.jsk.port=9080 -Dcom.sun.jini.qa.port=9081 '-Dcom.sun.jini.jsk.home=<https://builds.apache.org/job/River-QA-matrix/./jdk=JDK%201.7%20(latest),label=Ubuntu,test=com-sun-jini-test-impl-discoverymanager-RemoveGroupsLocsDiscard.td/ws/build'>
'-Dcom.sun.jini.qa.home=<https://builds.apache.org/job/River-QA-matrix/./jdk=JDK%201.7%20(latest),label=Ubuntu,test=com-sun-jini-test-impl-discoverymanager-RemoveGroupsLocsDiscard.td/ws/build/qa'>
'-Dcom.sun.jini.qa.harness.harnessJar=<https://builds.apache.org/job/River-QA-matrix/./jdk=JDK%201.7%20(latest),label=Ubuntu,test=com-sun-jini-test-impl-discoverymanager-RemoveGroupsLocsDiscard.td/ws/build/qa/lib/jiniharness.jar'>
'-Dcom.sun.jini.qa.harness.testJar=<https://builds.apache.org/job/River-QA-matrix/./jdk=JDK%201.7%20(latest),label=Ubuntu,test=com-sun-jini-test-impl-discoverymanager-RemoveGroupsLocsDiscard.td/ws/build/qa/lib/jinitests.jar'>
-Dcom.sun.jini.qa.harness.runjiniserver=true -Dcom.sun.jini.qa.harness.runkitserver=true -Djava.security.properties=<https://builds.apache.org/job/River-QA-matrix/./jdk=JDK%201.7%20(latest),label=Ubuntu,test=com-sun-jini-test-impl-discoverymanager-RemoveGroupsLocsDiscard.td/ws/build/qa/harness/trust/dynamic-policy.properties>
-Dcom.sun.jini.qa.harness.testhosts= '-Djava.util.logging.config.file=<https://builds.apache.org/job/River-QA-matrix/./jdk=JDK%201.7%20(latest),label=Ubuntu,test=com-sun-jini-test-impl-discoverymanager-RemoveGroupsLocsDiscard.td/ws/build/qa/src/com/sun/jini/test/resources/qa1.logging'>
'-Dcom.sun.jini.test.home=<https://builds.apache.org/job/River-QA-matrix/./jdk=JDK%201.7%20(latest),label=Ubuntu,test=com-sun-jini-test-impl-discoverymanager-RemoveGroupsLocsDiscard.td/ws/build/qa'>
-Dcom.sun.jini.test.port=9082 -Dcom.sun.jini.qa.harness.policies=<https://builds.apache.org/job/River-QA-matrix/./jdk=JDK%201.7%20(latest),label=Ubuntu,test=com-sun-jini-test-impl-discoverymanager-RemoveGroupsLocsDiscard.td/ws/build/qa/src/com/sun/jini/test/resources/jinitest.policy>
'-Djava.ext.dirs=/home/jenkins/tools/java/jdk1.7.0-32/jre/lib/ext:/usr/java/packages/lib/ext:<https://builds.apache.org/job/River-QA-matrix/./jdk=JDK%201.7%20(latest),label=Ubuntu,test=com-sun-jini-test-impl-discoverymanager-RemoveGroupsLocsDiscard.td/ws/build/qa/lib-ext>:<https://builds.apache.org/job/River-QA-matrix/./jdk=JDK%201.7%20(latest),label=Ubuntu,test=com-sun-jini-test-impl-discoverymanager-RemoveGroupsLocsDiscard.td/ws/build/lib-ext'>
com.sun.jini.qa.harness.MasterTest com/sun/jini/test/impl/discoverymanager/RemoveGroupsLocsDiscard.td

     [java] 
     [java] TIME: 5:55:12 PM
     [java] 
     [java] MasterTest.doTest INFO: 
     [java] ============================== CALLING SETUP() ==============================
     [java] 
     [java] Sep 16, 2012 5:55:12 PM com.sun.jini.tool.ClassServer run
     [java] INFO: ClassServer started [[<https://builds.apache.org/job/River-QA-matrix/./jdk=JDK%201.7%20(latest),label=Ubuntu,test=com-sun-jini-test-impl-discoverymanager-RemoveGroupsLocsDiscard.td/ws/build/qa/lib/],>
port 9081]
     [java] Sep 16, 2012 5:55:12 PM com.sun.jini.tool.ClassServer run
     [java] INFO: ClassServer started [[<https://builds.apache.org/job/River-QA-matrix/./jdk=JDK%201.7%20(latest),label=Ubuntu,test=com-sun-jini-test-impl-discoverymanager-RemoveGroupsLocsDiscard.td/ws/build/lib-dl/],>
port 9080]
     [java] Sep 16, 2012 5:55:12 PM com.sun.jini.tool.ClassServer run
     [java] INFO: ClassServer started [[<https://builds.apache.org/job/River-QA-matrix/./jdk=JDK%201.7%20(latest),label=Ubuntu,test=com-sun-jini-test-impl-discoverymanager-RemoveGroupsLocsDiscard.td/ws/build/qa/lib/],>
port 9082]
     [java] NonActGrp-out: Sep 16, 2012 5:55:15 PM com.sun.jini.reggie.RegistrarImpl <init>
     [java] NonActGrp-out: SEVERE: Reggie initialization failed
     [java] NonActGrp-out: java.net.BindException: Address already in use
     [java] NonActGrp-out: 	at java.net.PlainSocketImpl.socketBind(Native Method)
     [java] NonActGrp-out: 	at java.net.AbstractPlainSocketImpl.bind(AbstractPlainSocketImpl.java:374)
     [java] NonActGrp-out: 	at java.net.ServerSocket.bind(ServerSocket.java:376)
     [java] NonActGrp-out: 	at java.net.ServerSocket.<init>(ServerSocket.java:237)
     [java] NonActGrp-out: 	at java.net.ServerSocket.<init>(ServerSocket.java:128)
     [java] NonActGrp-out: 	at javax.net.DefaultServerSocketFactory.createServerSocket(ServerSocketFactory.java:218)
     [java] NonActGrp-out: 	at com.sun.jini.reggie.RegistrarImpl$UnicastThread.<init>(RegistrarImpl.java:2503)
     [java] NonActGrp-out: 	at com.sun.jini.reggie.RegistrarImpl.init(RegistrarImpl.java:4666)
     [java] NonActGrp-out: 	at com.sun.jini.reggie.RegistrarImpl.access$000(RegistrarImpl.java:143)
     [java] NonActGrp-out: 	at com.sun.jini.reggie.RegistrarImpl$1.run(RegistrarImpl.java:448)
     [java] NonActGrp-out: 	at com.sun.jini.reggie.RegistrarImpl.loginAndRun(RegistrarImpl.java:461)
     [java] NonActGrp-out: 	at com.sun.jini.reggie.RegistrarImpl.<init>(RegistrarImpl.java:396)
     [java] NonActGrp-out: 	at com.sun.jini.reggie.TransientRegistrarImpl.<init>(TransientRegistrarImpl.java:39)
     [java] NonActGrp-out: 	at sun.reflect.NativeConstructorAccessorImpl.newInstance0(Native
Method)
     [java] NonActGrp-out: 	at sun.reflect.NativeConstructorAccessorImpl.newInstance(NativeConstructorAccessorImpl.java:57)
     [java] NonActGrp-out: 	at sun.reflect.DelegatingConstructorAccessorImpl.newInstance(DelegatingConstructorAccessorImpl.java:45)
     [java] NonActGrp-out: 	at java.lang.reflect.Constructor.newInstance(Constructor.java:525)
     [java] NonActGrp-out: 	at com.sun.jini.start.NonActivatableServiceDescriptor.create(NonActivatableServiceDescriptor.java:674)
     [java] NonActGrp-out: 	at com.sun.jini.qa.harness.NonActivatableGroupImpl$GroupImpl.startService(NonActivatableGroupImpl.java:182)
     [java] NonActGrp-out: 	at sun.reflect.NativeMethodAccessorImpl.invoke0(Native Method)
     [java] NonActGrp-out: 	at sun.reflect.NativeMethodAccessorImpl.invoke(NativeMethodAccessorImpl.java:57)
     [java] NonActGrp-out: 	at sun.reflect.DelegatingMethodAccessorImpl.invoke(DelegatingMethodAccessorImpl.java:43)
     [java] NonActGrp-out: 	at java.lang.reflect.Method.invoke(Method.java:601)
     [java] NonActGrp-out: 	at sun.rmi.server.UnicastServerRef.dispatch(UnicastServerRef.java:322)
     [java] NonActGrp-out: 	at sun.rmi.transport.Transport$1.run(Transport.java:177)
     [java] NonActGrp-out: 	at sun.rmi.transport.Transport$1.run(Transport.java:174)
     [java] NonActGrp-out: 	at java.security.AccessController.doPrivileged(Native Method)
     [java] NonActGrp-out: 	at sun.rmi.transport.Transport.serviceCall(Transport.java:173)
     [java] NonActGrp-out: 	at sun.rmi.transport.tcp.TCPTransport.handleMessages(TCPTransport.java:553)
     [java] NonActGrp-out: 	at sun.rmi.transport.tcp.TCPTransport$ConnectionHandler.run0(TCPTransport.java:808)
     [java] NonActGrp-out: 	at sun.rmi.transport.tcp.TCPTransport$ConnectionHandler.run(TCPTransport.java:667)
     [java] NonActGrp-out: 	at java.util.concurrent.ThreadPoolExecutor.runWorker(ThreadPoolExecutor.java:1110)
     [java] NonActGrp-out: 	at java.util.concurrent.ThreadPoolExecutor$Worker.run(ThreadPoolExecutor.java:603)
     [java] NonActGrp-out: 	at java.lang.Thread.run(Thread.java:722)
     [java] NonActGrp-out: 
     [java] com.sun.jini.qa.harness.TestException: Problem creating service for net.jini.core.lookup.ServiceRegistrar;
nested exception is: 
     [java] 	RemoteException occurred in server thread; nested exception is: 
     [java] 	java.rmi.RemoteException: Create failed; nested exception is: 
     [java] 	java.lang.reflect.InvocationTargetException
     [java] 	at com.sun.jini.qa.harness.NonActivatableServiceStarterAdmin.start(NonActivatableServiceStarterAdmin.java:157)
     [java] 	at com.sun.jini.qa.harness.AdminManager.startService(AdminManager.java:639)
     [java] 	at com.sun.jini.qa.harness.AdminManager.startLookupService(AdminManager.java:700)
     [java] 	at com.sun.jini.test.share.BaseQATest.startLookup(BaseQATest.java:1657)
     [java] 	at com.sun.jini.test.share.BaseQATest.startInitLookups(BaseQATest.java:1517)
     [java] 	at com.sun.jini.test.share.BaseQATest.setup(BaseQATest.java:1058)
     [java] 	at com.sun.jini.test.spec.discoverymanager.AbstractBaseTest.setup(AbstractBaseTest.java:104)
     [java] 	at com.sun.jini.qa.harness.MasterTest.doTest(MasterTest.java:219)
     [java] 	at com.sun.jini.qa.harness.MasterTest.main(MasterTest.java:144)
     [java] Caused by: java.rmi.ServerException: RemoteException occurred in server thread;
nested exception is: 
     [java] 	java.rmi.RemoteException: Create failed; nested exception is: 
     [java] 	java.lang.reflect.InvocationTargetException
     [java] 	at sun.rmi.server.UnicastServerRef.dispatch(UnicastServerRef.java:353)
     [java] 	at sun.rmi.transport.Transport$1.run(Transport.java:177)
     [java] 	at sun.rmi.transport.Transport$1.run(Transport.java:174)
     [java] 	at java.security.AccessController.doPrivileged(Native Method)
     [java] 	at sun.rmi.transport.Transport.serviceCall(Transport.java:173)
     [java] 	at sun.rmi.transport.tcp.TCPTransport.handleMessages(TCPTransport.java:553)
     [java] 	at sun.rmi.transport.tcp.TCPTransport$ConnectionHandler.run0(TCPTransport.java:808)
     [java] 	at sun.rmi.transport.tcp.TCPTransport$ConnectionHandler.run(TCPTransport.java:667)
     [java] 	at java.util.concurrent.ThreadPoolExecutor.runWorker(ThreadPoolExecutor.java:1110)
     [java] 	at java.util.concurrent.ThreadPoolExecutor$Worker.run(ThreadPoolExecutor.java:603)
     [java] 	at java.lang.Thread.run(Thread.java:722)
     [java] 	at sun.rmi.transport.StreamRemoteCall.exceptionReceivedFromServer(StreamRemoteCall.java:273)
     [java] 	at sun.rmi.transport.StreamRemoteCall.executeCall(StreamRemoteCall.java:251)
     [java] 	at sun.rmi.server.UnicastRef.invoke(UnicastRef.java:160)
     [java] 	at com.sun.jini.qa.harness.NonActivatableGroupImpl$GroupImpl_Stub.startService(Unknown
Source)
     [java] 	at com.sun.jini.qa.harness.NonActivatableServiceStarterAdmin.start(NonActivatableServiceStarterAdmin.java:148)
     [java] 	... 8 more
     [java] Caused by: java.rmi.RemoteException: Create failed; nested exception is: 
     [java] 	java.lang.reflect.InvocationTargetException
     [java] 	at com.sun.jini.qa.harness.NonActivatableGroupImpl$GroupImpl.startService(NonActivatableGroupImpl.java:186)
     [java] 	at sun.reflect.NativeMethodAccessorImpl.invoke0(Native Method)
     [java] 	at sun.reflect.NativeMethodAccessorImpl.invoke(NativeMethodAccessorImpl.java:57)
     [java] 	at sun.reflect.DelegatingMethodAccessorImpl.invoke(DelegatingMethodAccessorImpl.java:43)
     [java] 	at java.lang.reflect.Method.invoke(Method.java:601)
     [java] 	at sun.rmi.server.UnicastServerRef.dispatch(UnicastServerRef.java:322)
     [java] 	at sun.rmi.transport.Transport$1.run(Transport.java:177)
     [java] 	at sun.rmi.transport.Transport$1.run(Transport.java:174)
     [java] 	at java.security.AccessController.doPrivileged(Native Method)
     [java] 	at sun.rmi.transport.Transport.serviceCall(Transport.java:173)
     [java] 	at sun.rmi.transport.tcp.TCPTransport.handleMessages(TCPTransport.java:553)
     [java] 	at sun.rmi.transport.tcp.TCPTransport$ConnectionHandler.run0(TCPTransport.java:808)
     [java] 	at sun.rmi.transport.tcp.TCPTransport$ConnectionHandler.run(TCPTransport.java:667)
     [java] 	at java.util.concurrent.ThreadPoolExecutor.runWorker(ThreadPoolExecutor.java:1110)
     [java] 	at java.util.concurrent.ThreadPoolExecutor$Worker.run(ThreadPoolExecutor.java:603)
     [java] 	at java.lang.Thread.run(Thread.java:722)
     [java] Caused by: java.lang.reflect.InvocationTargetException
     [java] 	at sun.reflect.NativeConstructorAccessorImpl.newInstance0(Native Method)
     [java] 	at sun.reflect.NativeConstructorAccessorImpl.newInstance(NativeConstructorAccessorImpl.java:57)
     [java] 	at sun.reflect.DelegatingConstructorAccessorImpl.newInstance(DelegatingConstructorAccessorImpl.java:45)
     [java] 	at java.lang.reflect.Constructor.newInstance(Constructor.java:525)
     [java] 	at com.sun.jini.start.NonActivatableServiceDescriptor.create(NonActivatableServiceDescriptor.java:674)
     [java] 	at com.sun.jini.qa.harness.NonActivatableGroupImpl$GroupImpl.startService(NonActivatableGroupImpl.java:182)
     [java] 	... 15 more
     [java] Caused by: java.net.BindException: Address already in use
     [java] 	at java.net.PlainSocketImpl.socketBind(Native Method)
     [java] 	at java.net.AbstractPlainSocketImpl.bind(AbstractPlainSocketImpl.java:374)
     [java] 	at java.net.ServerSocket.bind(ServerSocket.java:376)
     [java] 	at java.net.ServerSocket.<init>(ServerSocket.java:237)
     [java] 	at java.net.ServerSocket.<init>(ServerSocket.java:128)
     [java] 	at javax.net.DefaultServerSocketFactory.createServerSocket(ServerSocketFactory.java:218)
     [java] 	at com.sun.jini.reggie.RegistrarImpl$UnicastThread.<init>(RegistrarImpl.java:2503)
     [java] 	at com.sun.jini.reggie.RegistrarImpl.init(RegistrarImpl.java:4666)
     [java] 	at com.sun.jini.reggie.RegistrarImpl.access$000(RegistrarImpl.java:143)
     [java] 	at com.sun.jini.reggie.RegistrarImpl$1.run(RegistrarImpl.java:448)
     [java] 	at com.sun.jini.reggie.RegistrarImpl.loginAndRun(RegistrarImpl.java:461)
     [java] 	at com.sun.jini.reggie.RegistrarImpl.<init>(RegistrarImpl.java:396)
     [java] 	at com.sun.jini.reggie.TransientRegistrarImpl.<init>(TransientRegistrarImpl.java:39)
     [java] 	... 21 more
     [java] MasterTest.doTest INFO: 
     [java] ============================ CALLING TEARDOWN() =============================
     [java] 
     [java] Sep 16, 2012 5:55:17 PM com.sun.jini.tool.ClassServer terminate
     [java] INFO: ClassServer terminated [port 9082]
     [java] Sep 16, 2012 5:55:17 PM com.sun.jini.tool.ClassServer terminate
     [java] INFO: ClassServer terminated [port 9080]
     [java] Sep 16, 2012 5:55:17 PM com.sun.jini.tool.ClassServer terminate
     [java] INFO: ClassServer terminated [port 9082]
     [java] Sep 16, 2012 5:55:17 PM com.sun.jini.tool.ClassServer terminate
     [java] INFO: ClassServer terminated [port 9080]
     [java] Sep 16, 2012 5:55:17 PM com.sun.jini.tool.ClassServer terminate
     [java] INFO: ClassServer terminated [port 9081]
     [java] Sep 16, 2012 5:55:17 PM com.sun.jini.tool.ClassServer terminate
     [java] INFO: ClassServer terminated [port 9081]
     [java] 
     [java] TIME: 5:55:17 PM
     [java] 
     [java] Test process was destroyed and returned code 1
     [java] com/sun/jini/test/impl/discoverymanager/RemoveGroupsLocsDiscard.td
     [java] Test Failed: Setup Failed: com.sun.jini.qa.harness.TestException: Problem creating
service for net.jini.core.lookup.ServiceRegistrar; nested exception is: 
     [java] 	RemoteException occurred in server thread; nested exception is: 
     [java] 	java.rmi.RemoteException: Create failed; nested exception is: 
     [java] 	java.lang.reflect.InvocationTargetException
     [java] 
     [java] 
     [java] -----------------------------------------
     [java] 
     [java] SUMMARY =================================
     [java] 
     [java] com/sun/jini/test/impl/discoverymanager/RemoveGroupsLocsDiscard.td
     [java] Test Failed: Setup Failed: com.sun.jini.qa.harness.TestException: Problem creating
service for net.jini.core.lookup.ServiceRegistrar; nested exception is: 
     [java] 	RemoteException occurred in server thread; nested exception is: 
     [java] 	java.rmi.RemoteException: Create failed; nested exception is: 
     [java] 	java.lang.reflect.InvocationTargetException
     [java] 
     [java] -----------------------------------------
     [java] 
     [java] # of tests started   = 1
     [java] # of tests completed = 1
     [java] # of tests passed    = 0
     [java] # of tests failed    = 1
     [java] 
     [java] -----------------------------------------
     [java] 
     [java]    Date finished:
     [java]       Sun Sep 16 17:55:22 UTC 2012
     [java]    Time elapsed:
     [java]       9 seconds
     [java] 
     [java] Java Result: 1

collect-result:

BUILD FAILED
<https://builds.apache.org/job/River-QA-matrix/./jdk=JDK%201.7%20(latest),label=Ubuntu,test=com-sun-jini-test-impl-discoverymanager-RemoveGroupsLocsDiscard.td/ws/build.xml>:74:
The following error occurred while executing this line:
<https://builds.apache.org/job/River-QA-matrix/./jdk=JDK%201.7%20(latest),label=Ubuntu,test=com-sun-jini-test-impl-discoverymanager-RemoveGroupsLocsDiscard.td/ws/build/qa/build.xml>:357:
condition satisfied

Total time: 52 seconds
Build step 'Invoke Ant' marked build as failure

Mime
View raw message