river-dev mailing list archives

Site index · List index
Message view « Date » · « Thread »
Top « Date » · « Thread »
From Apache Jenkins Server <jenk...@builds.apache.org>
Subject Build failed in Jenkins: River-QA-arm #7
Date Mon, 03 Sep 2012 16:33:56 GMT
See <https://builds.apache.org/job/River-QA-arm/7/>

------------------------------------------
[...truncated 8970 lines...]
     [java] Test Passed: OK
     [java] 
     [java] -----------------------------------------
     [java] com/sun/jini/test/spec/javaspace/conformance/snapshot/SnapshotTransactionTakeIfExistsTest.td
     [java] Test Passed: OK
     [java] 
     [java] -----------------------------------------
     [java] com/sun/jini/test/spec/javaspace/conformance/snapshot/SnapshotTransactionTakeIfExistsWaitTest.td
     [java] Test Passed: OK
     [java] 
     [java] -----------------------------------------
     [java] com/sun/jini/test/spec/javaspace/conformance/snapshot/SnapshotTransactionTakeNO_WAITTest.td
     [java] Test Passed: OK
     [java] 
     [java] -----------------------------------------
     [java] com/sun/jini/test/spec/javaspace/conformance/snapshot/SnapshotTransactionTakeReadTest.td
     [java] Test Passed: OK
     [java] 
     [java] -----------------------------------------
     [java] com/sun/jini/test/spec/javaspace/conformance/snapshot/SnapshotTransactionTakeTest.td
     [java] Test Passed: OK
     [java] 
     [java] -----------------------------------------
     [java] com/sun/jini/test/spec/javaspace/conformance/snapshot/SnapshotTransactionTakeWaitTest.td
     [java] Test Passed: OK
     [java] 
     [java] -----------------------------------------
     [java] com/sun/jini/test/spec/javaspace/conformance/snapshot/SnapshotTransactionWriteLeaseANYTest.td
     [java] Test Passed: OK
     [java] 
     [java] -----------------------------------------
     [java] com/sun/jini/test/spec/javaspace/conformance/snapshot/SnapshotTransactionWriteLeaseFOREVERTest.td
     [java] Test Passed: OK
     [java] 
     [java] -----------------------------------------
     [java] com/sun/jini/test/spec/javaspace/conformance/snapshot/SnapshotTransactionWriteNegativeLeaseTest.td
     [java] Test Passed: OK
     [java] 
     [java] -----------------------------------------
     [java] com/sun/jini/test/spec/javaspace/conformance/snapshot/SnapshotTransactionWriteTakeIfExistsNotifyTest.td
     [java] Test Passed: OK
     [java] 
     [java] -----------------------------------------
     [java] com/sun/jini/test/spec/javaspace/conformance/snapshot/SnapshotTransactionWriteTakeIfExistsTest.td
     [java] Test Passed: OK
     [java] 
     [java] -----------------------------------------
     [java] com/sun/jini/test/spec/javaspace/conformance/snapshot/SnapshotTransactionWriteTakeNotifyTest.td
     [java] Test Passed: OK
     [java] 
     [java] -----------------------------------------
     [java] com/sun/jini/test/spec/javaspace/conformance/snapshot/SnapshotTransactionWriteTakeTest.td
     [java] Test Passed: OK
     [java] 
     [java] -----------------------------------------
     [java] com/sun/jini/test/spec/javaspace/conformance/snapshot/SnapshotTransactionWriteTest.td
     [java] Test Passed: OK
     [java] 
     [java] -----------------------------------------
     [java] com/sun/jini/test/spec/javaspace/conformance/snapshot/SnapshotWriteLeaseANYTest.td
     [java] Test Passed: OK
     [java] 
     [java] -----------------------------------------
     [java] com/sun/jini/test/spec/javaspace/conformance/snapshot/SnapshotWriteLeaseFOREVERTest.td
     [java] Test Passed: OK
     [java] 
     [java] -----------------------------------------
     [java] com/sun/jini/test/spec/javaspace/conformance/snapshot/SnapshotWriteNegativeLeaseTest.td
     [java] Test Passed: OK
     [java] 
     [java] -----------------------------------------
     [java] com/sun/jini/test/spec/javaspace/conformance/snapshot/SnapshotWriteTest.td
     [java] Test Passed: OK
     [java] 
     [java] -----------------------------------------
     [java] com/sun/jini/test/impl/mahalo/AdminIFShutdownTest.td
     [java] Test Failed: Test Failed: com.sun.jini.qa.harness.TestException: assertLocators
returned true for bogus values
     [java] 
     [java] -----------------------------------------
     [java] com/sun/jini/test/impl/mahalo/AdminIFTest.td
     [java] Test Failed: Test Failed: com.sun.jini.qa.harness.TestException: assertLocators
returned true for bogus values
     [java] 
     [java] -----------------------------------------
     [java] com/sun/jini/test/impl/mahalo/LeaseExpireCancelTest.td
     [java] Test Passed: OK
     [java] 
     [java] -----------------------------------------
     [java] com/sun/jini/test/impl/mahalo/LeaseExpireRenewTest.td
     [java] Test Passed: OK
     [java] 
     [java] -----------------------------------------
     [java] com/sun/jini/test/impl/mahalo/LeaseMapTest.td
     [java] Test Passed: OK
     [java] 
     [java] -----------------------------------------
     [java] com/sun/jini/test/impl/mahalo/LeaseTest.td
     [java] Test Passed: OK
     [java] 
     [java] -----------------------------------------
     [java] com/sun/jini/test/impl/mahalo/MahaloCreateShutdownTest.td
     [java] Test Passed: OK
     [java] 
     [java] -----------------------------------------
     [java] com/sun/jini/test/impl/mahalo/MahaloIFTest.td
     [java] Test Passed: OK
     [java] 
     [java] -----------------------------------------
     [java] com/sun/jini/test/impl/mahalo/MahaloImplReadyStateTest.td
     [java] Test Skipped: verifiers are: com.sun.jini.test.impl.mercury.ActivatableMercuryVerifier
com.sun.jini.qa.harness.SkipConfigTestVerifier
     [java] -----------------------------------------
     [java] com/sun/jini/test/impl/mahalo/NestableServerTransactionCreatedToStringTest.td
     [java] Test Passed: OK
     [java] 
     [java] -----------------------------------------
     [java] com/sun/jini/test/impl/mahalo/NestableTransactionCreatedToStringTest.td
     [java] Test Passed: OK
     [java] 
     [java] -----------------------------------------
     [java] com/sun/jini/test/impl/mahalo/PrepareAndCommitExceptionTest.td
     [java] Test Passed: OK
     [java] 
     [java] -----------------------------------------
     [java] com/sun/jini/test/impl/mahalo/PrepareAndCommitExceptionTest2.td
     [java] Test Passed: OK
     [java] 
     [java] -----------------------------------------
     [java] com/sun/jini/test/impl/mahalo/PrepareAndCommitExceptionTest3.td
     [java] Test Passed: OK
     [java] 
     [java] -----------------------------------------
     [java] com/sun/jini/test/impl/mahalo/PrepareAndCommitExceptionTest4.td
     [java] Test Passed: OK
     [java] 
     [java] -----------------------------------------
     [java] com/sun/jini/test/impl/mahalo/PrepareAndCommitExceptionTest5.td
     [java] Test Passed: OK
     [java] 
     [java] -----------------------------------------
     [java] com/sun/jini/test/impl/mahalo/RandomStressTest.td
     [java] Test Passed: OK
     [java] 
     [java] -----------------------------------------
     [java] com/sun/jini/test/impl/mahalo/ServerTransactionEqualityTest.td
     [java] Test Passed: OK
     [java] 
     [java] -----------------------------------------
     [java] com/sun/jini/test/impl/mahalo/ServerTransactionToStringTest.td
     [java] Test Passed: OK
     [java] 
     [java] -----------------------------------------
     [java] com/sun/jini/test/impl/mahalo/TransactionCreatedToStringTest.td
     [java] Test Passed: OK
     [java] 
     [java] -----------------------------------------
     [java] com/sun/jini/test/impl/mahalo/TransactionManagerCreatedToStringTest.td
     [java] Test Passed: OK
     [java] 
     [java] -----------------------------------------
     [java] com/sun/jini/test/impl/mahalo/TxnMgrImplNullActivationConfigEntries.td
     [java] Test Skipped: verifiers are: com.sun.jini.test.impl.mahalo.ActivatableMahaloVerifier
     [java] -----------------------------------------
     [java] com/sun/jini/test/impl/mahalo/TxnMgrImplNullConfigEntries.td
     [java] Test Passed: OK
     [java] 
     [java] -----------------------------------------
     [java] com/sun/jini/test/impl/mahalo/TxnMgrImplNullRecoveredLocators.td
     [java] Test Skipped: verifiers are: com.sun.jini.test.impl.mahalo.ActivatableMahaloVerifier
     [java] -----------------------------------------
     [java] com/sun/jini/test/impl/mahalo/TxnMgrProxyEqualityTest.td
     [java] Test Passed: OK
     [java] 
     [java] -----------------------------------------
     [java] com/sun/jini/test/spec/txnmanager/AsynchAbortOnCommitTest.td
     [java] Test Passed: OK
     [java] 
     [java] -----------------------------------------
     [java] com/sun/jini/test/spec/txnmanager/AsynchAbortOnPrepareTest.td
     [java] Test Passed: OK
     [java] 
     [java] -----------------------------------------
     [java] com/sun/jini/test/spec/txnmanager/CommitExpiredTest.td
     [java] Test Passed: OK
     [java] 
     [java] -----------------------------------------
     [java] com/sun/jini/test/spec/txnmanager/CommitTimeoutTest.td
     [java] Test Passed: OK
     [java] 
     [java] -----------------------------------------
     [java] com/sun/jini/test/spec/txnmanager/GetStateTest.td
     [java] Test Passed: OK
     [java] 
     [java] -----------------------------------------
     [java] com/sun/jini/test/spec/txnmanager/JoinIdempotentTest.td
     [java] Test Passed: OK
     [java] 
     [java] -----------------------------------------
     [java] com/sun/jini/test/spec/txnmanager/JoinWhileActiveTest.td
     [java] Test Passed: OK
     [java] 
     [java] -----------------------------------------
     [java] com/sun/jini/test/spec/txnmanager/ManyParticipantsTest.td
     [java] Test Passed: OK
     [java] 
     [java] -----------------------------------------
     [java] com/sun/jini/test/spec/txnmanager/PrepareTimeoutTest.td
     [java] Test Passed: OK
     [java] 
     [java] -----------------------------------------
     [java] com/sun/jini/test/spec/txnmanager/RollBackErrorTest.td
     [java] Test Passed: OK
     [java] 
     [java] -----------------------------------------
     [java] com/sun/jini/test/spec/txnmanager/RollForwardErrorTest.td
     [java] Test Passed: OK
     [java] 
     [java] -----------------------------------------
     [java] com/sun/jini/test/spec/txnmanager/TwoPhaseTest.td
     [java] Test Passed: OK
     [java] 
     [java] -----------------------------------------
     [java] 
     [java] # of tests started   = 1343
     [java] # of tests completed = 1343
     [java] # of tests skipped   = 42
     [java] # of tests passed    = 1061
     [java] # of tests failed    = 282
     [java] 
     [java] -----------------------------------------
     [java] 
     [java]    Date finished:
     [java]       Mon Sep 03 11:30:16 CDT 2012
     [java]    Time elapsed:
     [java]       54154 seconds
     [java] 
     [java] Java Result: 1

collect-result:
     [copy] Copying 1 file to <https://builds.apache.org/job/River-QA-arm/ws/qa/result>
     [copy] Copying 1 file to <https://builds.apache.org/job/River-QA-arm/ws/qa/result>
      [zip] Building zip: <https://builds.apache.org/job/River-QA-arm/ws/qa/result/qaresults-arm-Linux-1.7.0_06.zip>

BUILD FAILED
<https://builds.apache.org/job/River-QA-arm/ws/build.xml>:55: The following error occurred
while executing this line:
<https://builds.apache.org/job/River-QA-arm/ws/qa/build.xml>:412: The following error
occurred while executing this line:
<https://builds.apache.org/job/River-QA-arm/ws/qa/build.xml>:380: condition satisfied

Total time: 916 minutes 18 seconds
Build step 'Invoke Ant' marked build as failure
Archiving artifacts

Mime
View raw message