river-dev mailing list archives

Site index · List index
Message view « Date » · « Thread »
Top « Date » · « Thread »
From Apache Jenkins Server <jenk...@builds.apache.org>
Subject Build failed in Jenkins: River-QA-ubuntu-jdk7 #27
Date Wed, 11 Jul 2012 11:59:50 GMT
See <https://builds.apache.org/job/River-QA-ubuntu-jdk7/27/>

------------------------------------------
[...truncated 18065 lines...]
     [java] com/sun/jini/test/impl/mahalo/LeaseExpireCancelTest.td
     [java] Test Failed: Test Failed: com.sun.jini.qa.harness.TestException: Exception has
been catched in specifyServices: Problem creating service for net.jini.core.transaction.server.TransactionManager;
nested exception is: 
     [java] 	RemoteException occurred in server thread; nested exception is: 
     [java] 	java.rmi.RemoteException: Create failed; nested exception is: 
     [java] 	java.security.AccessControlException: access denied ("java.security.SecurityPermission"
"getProperty.net.jini.security.policy.PolicyFileProvider.basePolicyClass")
     [java] 
     [java] -----------------------------------------
     [java] com/sun/jini/test/impl/mahalo/LeaseExpireRenewTest.td
     [java] Test Failed: Test Failed: com.sun.jini.qa.harness.TestException: Exception has
been catched in specifyServices: Problem creating service for net.jini.core.transaction.server.TransactionManager;
nested exception is: 
     [java] 	RemoteException occurred in server thread; nested exception is: 
     [java] 	java.rmi.RemoteException: Create failed; nested exception is: 
     [java] 	java.security.AccessControlException: access denied ("java.security.SecurityPermission"
"getProperty.net.jini.security.policy.PolicyFileProvider.basePolicyClass")
     [java] 
     [java] -----------------------------------------
     [java] com/sun/jini/test/impl/mahalo/LeaseMapTest.td
     [java] Test Failed: Test Failed: com.sun.jini.qa.harness.TestException: Exception has
been catched in specifyServices: Problem creating service for net.jini.core.transaction.server.TransactionManager;
nested exception is: 
     [java] 	RemoteException occurred in server thread; nested exception is: 
     [java] 	java.rmi.RemoteException: Create failed; nested exception is: 
     [java] 	java.security.AccessControlException: access denied ("java.security.SecurityPermission"
"getProperty.net.jini.security.policy.PolicyFileProvider.basePolicyClass")
     [java] 
     [java] -----------------------------------------
     [java] com/sun/jini/test/impl/mahalo/LeaseTest.td
     [java] Test Failed: Test Failed: com.sun.jini.qa.harness.TestException: Exception has
been catched in specifyServices: Problem creating service for net.jini.core.transaction.server.TransactionManager;
nested exception is: 
     [java] 	RemoteException occurred in server thread; nested exception is: 
     [java] 	java.rmi.RemoteException: Create failed; nested exception is: 
     [java] 	java.security.AccessControlException: access denied ("java.security.SecurityPermission"
"getProperty.net.jini.security.policy.PolicyFileProvider.basePolicyClass")
     [java] 
     [java] -----------------------------------------
     [java] com/sun/jini/test/impl/mahalo/MahaloCreateShutdownTest.td
     [java] Test Failed: Test Failed: com.sun.jini.qa.harness.TestException: Exception has
been catched in specifyServices: Problem creating service for net.jini.core.transaction.server.TransactionManager;
nested exception is: 
     [java] 	RemoteException occurred in server thread; nested exception is: 
     [java] 	java.rmi.RemoteException: Create failed; nested exception is: 
     [java] 	java.security.AccessControlException: access denied ("java.security.SecurityPermission"
"getProperty.net.jini.security.policy.PolicyFileProvider.basePolicyClass")
     [java] 
     [java] -----------------------------------------
     [java] com/sun/jini/test/impl/mahalo/MahaloIFTest.td
     [java] Test Failed: Test Failed: com.sun.jini.qa.harness.TestException: Exception has
been catched in specifyServices: Problem creating service for net.jini.core.transaction.server.TransactionManager;
nested exception is: 
     [java] 	RemoteException occurred in server thread; nested exception is: 
     [java] 	java.rmi.RemoteException: Create failed; nested exception is: 
     [java] 	java.security.AccessControlException: access denied ("java.security.SecurityPermission"
"getProperty.net.jini.security.policy.PolicyFileProvider.basePolicyClass")
     [java] 
     [java] -----------------------------------------
     [java] com/sun/jini/test/impl/mahalo/MahaloImplReadyStateTest.td
     [java] Test Skipped: verifiers are: com.sun.jini.test.impl.mercury.ActivatableMercuryVerifier
com.sun.jini.qa.harness.SkipConfigTestVerifier
     [java] -----------------------------------------
     [java] com/sun/jini/test/impl/mahalo/NestableServerTransactionCreatedToStringTest.td
     [java] Test Passed: OK
     [java] 
     [java] -----------------------------------------
     [java] com/sun/jini/test/impl/mahalo/NestableTransactionCreatedToStringTest.td
     [java] Test Passed: OK
     [java] 
     [java] -----------------------------------------
     [java] com/sun/jini/test/impl/mahalo/PrepareAndCommitExceptionTest.td
     [java] Test Failed: Test Failed: com.sun.jini.qa.harness.TestException: Exception has
been catched in specifyServices: Problem creating service for net.jini.core.transaction.server.TransactionManager;
nested exception is: 
     [java] 	RemoteException occurred in server thread; nested exception is: 
     [java] 	java.rmi.RemoteException: Create failed; nested exception is: 
     [java] 	java.security.AccessControlException: access denied ("java.security.SecurityPermission"
"getProperty.net.jini.security.policy.PolicyFileProvider.basePolicyClass")
     [java] 
     [java] -----------------------------------------
     [java] com/sun/jini/test/impl/mahalo/PrepareAndCommitExceptionTest2.td
     [java] Test Failed: Test Failed: com.sun.jini.qa.harness.TestException: Exception has
been catched in specifyServices: Problem creating service for net.jini.core.transaction.server.TransactionManager;
nested exception is: 
     [java] 	RemoteException occurred in server thread; nested exception is: 
     [java] 	java.rmi.RemoteException: Create failed; nested exception is: 
     [java] 	java.security.AccessControlException: access denied ("java.security.SecurityPermission"
"getProperty.net.jini.security.policy.PolicyFileProvider.basePolicyClass")
     [java] 
     [java] -----------------------------------------
     [java] com/sun/jini/test/impl/mahalo/PrepareAndCommitExceptionTest3.td
     [java] Test Failed: Test Failed: com.sun.jini.qa.harness.TestException: Exception has
been catched in specifyServices: Problem creating service for net.jini.core.transaction.server.TransactionManager;
nested exception is: 
     [java] 	RemoteException occurred in server thread; nested exception is: 
     [java] 	java.rmi.RemoteException: Create failed; nested exception is: 
     [java] 	java.security.AccessControlException: access denied ("java.security.SecurityPermission"
"getProperty.net.jini.security.policy.PolicyFileProvider.basePolicyClass")
     [java] 
     [java] -----------------------------------------
     [java] com/sun/jini/test/impl/mahalo/PrepareAndCommitExceptionTest4.td
     [java] Test Failed: Test Failed: com.sun.jini.qa.harness.TestException: Exception has
been catched in specifyServices: Problem creating service for net.jini.core.transaction.server.TransactionManager;
nested exception is: 
     [java] 	RemoteException occurred in server thread; nested exception is: 
     [java] 	java.rmi.RemoteException: Create failed; nested exception is: 
     [java] 	java.security.AccessControlException: access denied ("java.security.SecurityPermission"
"getProperty.net.jini.security.policy.PolicyFileProvider.basePolicyClass")
     [java] 
     [java] -----------------------------------------
     [java] com/sun/jini/test/impl/mahalo/PrepareAndCommitExceptionTest5.td
     [java] Test Failed: Test Failed: com.sun.jini.qa.harness.TestException: Exception has
been catched in specifyServices: Problem creating service for net.jini.core.transaction.server.TransactionManager;
nested exception is: 
     [java] 	RemoteException occurred in server thread; nested exception is: 
     [java] 	java.rmi.RemoteException: Create failed; nested exception is: 
     [java] 	java.security.AccessControlException: access denied ("java.security.SecurityPermission"
"getProperty.net.jini.security.policy.PolicyFileProvider.basePolicyClass")
     [java] 
     [java] -----------------------------------------
     [java] com/sun/jini/test/impl/mahalo/RandomStressTest.td
     [java] Test Failed: Test Failed: com.sun.jini.qa.harness.TestException: Exception has
been catched in specifyServices: Problem creating service for net.jini.core.transaction.server.TransactionManager;
nested exception is: 
     [java] 	RemoteException occurred in server thread; nested exception is: 
     [java] 	java.rmi.RemoteException: Create failed; nested exception is: 
     [java] 	java.security.AccessControlException: access denied ("java.security.SecurityPermission"
"getProperty.net.jini.security.policy.PolicyFileProvider.basePolicyClass")
     [java] 
     [java] -----------------------------------------
     [java] com/sun/jini/test/impl/mahalo/ServerTransactionEqualityTest.td
     [java] Test Failed: Test Failed: com.sun.jini.qa.harness.TestException: Exception has
been catched in specifyServices: Problem creating service for net.jini.core.transaction.server.TransactionManager;
nested exception is: 
     [java] 	RemoteException occurred in server thread; nested exception is: 
     [java] 	java.rmi.RemoteException: Create failed; nested exception is: 
     [java] 	java.security.AccessControlException: access denied ("java.security.SecurityPermission"
"getProperty.net.jini.security.policy.PolicyFileProvider.basePolicyClass")
     [java] 
     [java] -----------------------------------------
     [java] com/sun/jini/test/impl/mahalo/ServerTransactionToStringTest.td
     [java] Test Failed: Test Failed: com.sun.jini.qa.harness.TestException: Exception has
been catched in specifyServices: Problem creating service for net.jini.core.transaction.server.TransactionManager;
nested exception is: 
     [java] 	RemoteException occurred in server thread; nested exception is: 
     [java] 	java.rmi.RemoteException: Create failed; nested exception is: 
     [java] 	java.security.AccessControlException: access denied ("java.security.SecurityPermission"
"getProperty.net.jini.security.policy.PolicyFileProvider.basePolicyClass")
     [java] 
     [java] -----------------------------------------
     [java] com/sun/jini/test/impl/mahalo/TransactionCreatedToStringTest.td
     [java] Test Passed: OK
     [java] 
     [java] -----------------------------------------
     [java] com/sun/jini/test/impl/mahalo/TransactionManagerCreatedToStringTest.td
     [java] Test Passed: OK
     [java] 
     [java] -----------------------------------------
     [java] com/sun/jini/test/impl/mahalo/TxnMgrImplNullActivationConfigEntries.td
     [java] Test Skipped: verifiers are: com.sun.jini.test.impl.mahalo.ActivatableMahaloVerifier
     [java] -----------------------------------------
     [java] com/sun/jini/test/impl/mahalo/TxnMgrImplNullConfigEntries.td
     [java] Test Failed: Test Failed: com.sun.jini.qa.harness.TestException: Service failed
due to non-configuration relatedexception.
     [java] 
     [java] -----------------------------------------
     [java] com/sun/jini/test/impl/mahalo/TxnMgrImplNullRecoveredLocators.td
     [java] Test Skipped: verifiers are: com.sun.jini.test.impl.mahalo.ActivatableMahaloVerifier
     [java] -----------------------------------------
     [java] com/sun/jini/test/impl/mahalo/TxnMgrProxyEqualityTest.td
     [java] Test Failed: Test Failed: com.sun.jini.qa.harness.TestException: Exception has
been catched in specifyServices: Problem creating service for net.jini.core.transaction.server.TransactionManager;
nested exception is: 
     [java] 	RemoteException occurred in server thread; nested exception is: 
     [java] 	java.rmi.RemoteException: Create failed; nested exception is: 
     [java] 	java.security.AccessControlException: access denied ("java.security.SecurityPermission"
"getProperty.net.jini.security.policy.PolicyFileProvider.basePolicyClass")
     [java] 
     [java] -----------------------------------------
     [java] com/sun/jini/test/spec/txnmanager/AsynchAbortOnCommitTest.td
     [java] Test Failed: Test Failed: com.sun.jini.qa.harness.TestException: Exception has
been catched in specifyServices: Problem creating service for net.jini.core.transaction.server.TransactionManager;
nested exception is: 
     [java] 	RemoteException occurred in server thread; nested exception is: 
     [java] 	java.rmi.RemoteException: Create failed; nested exception is: 
     [java] 	java.security.AccessControlException: access denied ("java.security.SecurityPermission"
"getProperty.net.jini.security.policy.PolicyFileProvider.basePolicyClass")
     [java] 
     [java] -----------------------------------------
     [java] com/sun/jini/test/spec/txnmanager/AsynchAbortOnPrepareTest.td
     [java] Test Failed: Test Failed: com.sun.jini.qa.harness.TestException: Exception has
been catched in specifyServices: Problem creating service for net.jini.core.transaction.server.TransactionManager;
nested exception is: 
     [java] 	RemoteException occurred in server thread; nested exception is: 
     [java] 	java.rmi.RemoteException: Create failed; nested exception is: 
     [java] 	java.security.AccessControlException: access denied ("java.security.SecurityPermission"
"getProperty.net.jini.security.policy.PolicyFileProvider.basePolicyClass")
     [java] 
     [java] -----------------------------------------
     [java] com/sun/jini/test/spec/txnmanager/CommitExpiredTest.td
     [java] Test Failed: Test Failed: com.sun.jini.qa.harness.TestException: Exception has
been catched in specifyServices: Problem creating service for net.jini.core.transaction.server.TransactionManager;
nested exception is: 
     [java] 	RemoteException occurred in server thread; nested exception is: 
     [java] 	java.rmi.RemoteException: Create failed; nested exception is: 
     [java] 	java.security.AccessControlException: access denied ("java.security.SecurityPermission"
"getProperty.net.jini.security.policy.PolicyFileProvider.basePolicyClass")
     [java] 
     [java] -----------------------------------------
     [java] com/sun/jini/test/spec/txnmanager/CommitTimeoutTest.td
     [java] Test Failed: Test Failed: com.sun.jini.qa.harness.TestException: Exception has
been catched in specifyServices: Problem creating service for net.jini.core.transaction.server.TransactionManager;
nested exception is: 
     [java] 	RemoteException occurred in server thread; nested exception is: 
     [java] 	java.rmi.RemoteException: Create failed; nested exception is: 
     [java] 	java.security.AccessControlException: access denied ("java.security.SecurityPermission"
"getProperty.net.jini.security.policy.PolicyFileProvider.basePolicyClass")
     [java] 
     [java] -----------------------------------------
     [java] com/sun/jini/test/spec/txnmanager/GetStateTest.td
     [java] Test Failed: Test Failed: com.sun.jini.qa.harness.TestException: Exception has
been catched in specifyServices: Problem creating service for net.jini.core.transaction.server.TransactionManager;
nested exception is: 
     [java] 	RemoteException occurred in server thread; nested exception is: 
     [java] 	java.rmi.RemoteException: Create failed; nested exception is: 
     [java] 	java.security.AccessControlException: access denied ("java.security.SecurityPermission"
"getProperty.net.jini.security.policy.PolicyFileProvider.basePolicyClass")
     [java] 
     [java] -----------------------------------------
     [java] com/sun/jini/test/spec/txnmanager/JoinIdempotentTest.td
     [java] Test Failed: Test Failed: com.sun.jini.qa.harness.TestException: Exception has
been catched in specifyServices: Problem creating service for net.jini.core.transaction.server.TransactionManager;
nested exception is: 
     [java] 	RemoteException occurred in server thread; nested exception is: 
     [java] 	java.rmi.RemoteException: Create failed; nested exception is: 
     [java] 	java.security.AccessControlException: access denied ("java.security.SecurityPermission"
"getProperty.net.jini.security.policy.PolicyFileProvider.basePolicyClass")
     [java] 
     [java] -----------------------------------------
     [java] com/sun/jini/test/spec/txnmanager/JoinWhileActiveTest.td
     [java] Test Failed: Test Failed: com.sun.jini.qa.harness.TestException: Exception has
been catched in specifyServices: Problem creating service for net.jini.core.transaction.server.TransactionManager;
nested exception is: 
     [java] 	RemoteException occurred in server thread; nested exception is: 
     [java] 	java.rmi.RemoteException: Create failed; nested exception is: 
     [java] 	java.security.AccessControlException: access denied ("java.security.SecurityPermission"
"getProperty.net.jini.security.policy.PolicyFileProvider.basePolicyClass")
     [java] 
     [java] -----------------------------------------
     [java] com/sun/jini/test/spec/txnmanager/ManyParticipantsTest.td
     [java] Test Failed: Test Failed: com.sun.jini.qa.harness.TestException: Exception has
been catched in specifyServices: Problem creating service for net.jini.core.transaction.server.TransactionManager;
nested exception is: 
     [java] 	RemoteException occurred in server thread; nested exception is: 
     [java] 	java.rmi.RemoteException: Create failed; nested exception is: 
     [java] 	java.security.AccessControlException: access denied ("java.security.SecurityPermission"
"getProperty.net.jini.security.policy.PolicyFileProvider.basePolicyClass")
     [java] 
     [java] -----------------------------------------
     [java] com/sun/jini/test/spec/txnmanager/PrepareTimeoutTest.td
     [java] Test Failed: Test Failed: com.sun.jini.qa.harness.TestException: Exception has
been catched in specifyServices: Problem creating service for net.jini.core.transaction.server.TransactionManager;
nested exception is: 
     [java] 	RemoteException occurred in server thread; nested exception is: 
     [java] 	java.rmi.RemoteException: Create failed; nested exception is: 
     [java] 	java.security.AccessControlException: access denied ("java.security.SecurityPermission"
"getProperty.net.jini.security.policy.PolicyFileProvider.basePolicyClass")
     [java] 
     [java] -----------------------------------------
     [java] com/sun/jini/test/spec/txnmanager/RollBackErrorTest.td
     [java] Test Failed: Test Failed: com.sun.jini.qa.harness.TestException: Exception has
been catched in specifyServices: Problem creating service for net.jini.core.transaction.server.TransactionManager;
nested exception is: 
     [java] 	RemoteException occurred in server thread; nested exception is: 
     [java] 	java.rmi.RemoteException: Create failed; nested exception is: 
     [java] 	java.security.AccessControlException: access denied ("java.security.SecurityPermission"
"getProperty.net.jini.security.policy.PolicyFileProvider.basePolicyClass")
     [java] 
     [java] -----------------------------------------
     [java] com/sun/jini/test/spec/txnmanager/RollForwardErrorTest.td
     [java] Test Failed: Test Failed: com.sun.jini.qa.harness.TestException: Exception has
been catched in specifyServices: Problem creating service for net.jini.core.transaction.server.TransactionManager;
nested exception is: 
     [java] 	RemoteException occurred in server thread; nested exception is: 
     [java] 	java.rmi.RemoteException: Create failed; nested exception is: 
     [java] 	java.security.AccessControlException: access denied ("java.security.SecurityPermission"
"getProperty.net.jini.security.policy.PolicyFileProvider.basePolicyClass")
     [java] 
     [java] -----------------------------------------
     [java] com/sun/jini/test/spec/txnmanager/TwoPhaseTest.td
     [java] Test Failed: Test Failed: com.sun.jini.qa.harness.TestException: Exception has
been catched in specifyServices: Problem creating service for net.jini.core.transaction.server.TransactionManager;
nested exception is: 
     [java] 	RemoteException occurred in server thread; nested exception is: 
     [java] 	java.rmi.RemoteException: Create failed; nested exception is: 
     [java] 	java.security.AccessControlException: access denied ("java.security.SecurityPermission"
"getProperty.net.jini.security.policy.PolicyFileProvider.basePolicyClass")
     [java] 
     [java] -----------------------------------------
     [java] 
     [java] # of tests started   = 1411
     [java] # of tests completed = 1411
     [java] # of tests skipped   = 47
     [java] # of tests passed    = 581
     [java] # of tests failed    = 830
     [java] 
     [java] -----------------------------------------
     [java] 
     [java]    Date finished:
     [java]       Wed Jul 11 11:59:44 UTC 2012
     [java]    Time elapsed:
     [java]       17231 seconds
     [java] 
     [java] Java Result: 1

collect-result:
     [copy] Copying 1 file to <https://builds.apache.org/job/River-QA-ubuntu-jdk7/ws/qa/result>
     [copy] Copying 1 file to <https://builds.apache.org/job/River-QA-ubuntu-jdk7/ws/qa/result>
      [zip] Building zip: <https://builds.apache.org/job/River-QA-ubuntu-jdk7/27/artifact/qa/result/qaresults-i386-Linux-1.7.0.zip>

BUILD FAILED
<https://builds.apache.org/job/River-QA-ubuntu-jdk7/ws/build.xml>:2087: The following
error occurred while executing this line:
<https://builds.apache.org/job/River-QA-ubuntu-jdk7/ws/qa/build.xml>:406: The following
error occurred while executing this line:
<https://builds.apache.org/job/River-QA-ubuntu-jdk7/ws/qa/build.xml>:380: condition
satisfied

Total time: 290 minutes 31 seconds
Build step 'Invoke Ant' marked build as failure
[locks-and-latches] Releasing all the locks
[locks-and-latches] All the locks released
Archiving artifacts

Mime
View raw message