river-dev mailing list archives

Site index · List index
Message view « Date » · « Thread »
Top « Date » · « Thread »
From Apache Jenkins Server <jenk...@builds.apache.org>
Subject Build failed in Jenkins: River-QA-solaris #21
Date Sat, 07 Jul 2012 00:01:53 GMT
See <https://builds.apache.org/job/River-QA-solaris/21/>

------------------------------------------
[...truncated 5750 lines...]
A         qa/src/com/sun/jini/qa/harness/QARunner.java
A         qa/src/com/sun/jini/qa/harness/TestStatusRequest.java
A         qa/src/com/sun/jini/qa/harness/TestException.java
A         qa/src/com/sun/jini/qa/harness/SlaveHarness.java
A         qa/src/com/sun/jini/qa/harness/HtmlReport.java
A         qa/src/com/sun/jini/qa/harness/ListExclusionVerifier.java
A         qa/src/com/sun/jini/qa/harness/ServiceDestroyer.java
A         qa/src/com/sun/jini/qa/harness/SkipTestVerifier.java
A         qa/src/com/sun/jini/qa/harness/SkipDistributedVerifier.java
A         qa/src/com/sun/jini/qa/harness/SkipPostJDK14TestVerifier.java
A         qa/src/com/sun/jini/qa/harness/SlaveTestRequest.java
A         qa/src/com/sun/jini/qa/harness/AdminAccessorRequest.java
A         qa/src/com/sun/jini/qa/harness/MainWrapper.java
A         qa/src/com/sun/jini/qa/harness/HarnessFormatter.java
A         qa/src/com/sun/jini/qa/harness/SkipConfigTestVerifier.java
A         qa/src/com/sun/jini/qa/harness/Admin.java
A         qa/src/com/sun/jini/qa/harness/NonActivatableServiceStarterAdmin.java
A         qa/src/com/sun/jini/qa/harness/AutotHost.java
A         qa/src/com/sun/jini/qa/harness/TeardownRequest.java
A         qa/src/com/sun/jini/qa/harness/XmlReport.java
A         qa/src/com/sun/jini/qa/harness/FailureAnalyzer.java
A         qa/src/com/sun/jini/qa/resources
A         qa/src/com/sun/jini/qa/resources/basicDeployment.prop
A         qa/src/com/sun/jini/qa/resources/qaDefaults.properties
A         qa/src/com/sun/jini/tool
A         qa/src/com/sun/jini/tool/AbstractTreeWalker.java
A         qa/src/com/sun/jini/tool/resources
A         qa/src/com/sun/jini/tool/resources/treewalker.properties
AU        qa/README.txt
A         qa/jtreg
A         qa/jtreg/certs
A         qa/jtreg/certs/password
A         qa/jtreg/certs/CA.java
A         qa/jtreg/certs/keystores
AU        qa/jtreg/certs/keystores/test-ca2.truststore
AU        qa/jtreg/certs/keystores/test-user1A.keystore
AU        qa/jtreg/certs/keystores/test-user1B.keystore
AU        qa/jtreg/certs/keystores/test-user2A.keystore
AU        qa/jtreg/certs/keystores/test-user1C.keystore
AU        qa/jtreg/certs/keystores/test-user2B.keystore
AU        qa/jtreg/certs/keystores/test-user1D.keystore
AU        qa/jtreg/certs/keystores/test-user2C.keystore
AU        qa/jtreg/certs/keystores/test-user1E.keystore
AU        qa/jtreg/certs/keystores/test-user2D.keystore
AU        qa/jtreg/certs/keystores/test-user2E.keystore
AU        qa/jtreg/certs/keystores/test-ca.truststore
AU        qa/jtreg/certs/keystores/test-ca1.truststore
AU        qa/jtreg/certs/keystores/users.truststore
A         qa/jtreg/certs/keys
A         qa/jtreg/certs/keys/test-ca1.key
A         qa/jtreg/certs/keys/test-ca2.key
AU        qa/jtreg/certs/keys/test-ca1.cert
AU        qa/jtreg/certs/keys/test-ca2.cert
A         qa/jtreg/certs/requests
A         qa/jtreg/certs/requests/test-user1A.request
A         qa/jtreg/certs/requests/test-user1B.request
A         qa/jtreg/certs/requests/test-user2A.request
A         qa/jtreg/certs/requests/test-user1C.request
A         qa/jtreg/certs/requests/test-user2B.request
A         qa/jtreg/certs/requests/test-user1D.request
A         qa/jtreg/certs/requests/test-user2C.request
A         qa/jtreg/certs/requests/test-user1E.request
A         qa/jtreg/certs/requests/test-user2D.request
A         qa/jtreg/certs/requests/test-user2E.request
A         qa/jtreg/certs/test-ca1.properties
A         qa/jtreg/certs/Makefile
A         qa/jtreg/certs/test-ca2.properties
A         qa/jtreg/certs/run-ca.sh
A         qa/jtreg/TEST.ROOT
A         qa/jtreg/java
A         qa/jtreg/java/rmi
A         qa/jtreg/java/rmi/server
A         qa/jtreg/java/rmi/server/RMIClassLoader
A         qa/jtreg/java/rmi/server/RMIClassLoader/loadProxyClasses
A         qa/jtreg/java/rmi/server/RMIClassLoader/loadProxyClasses/LoadProxyClasses.java
A         qa/jtreg/java/rmi/server/RMIClassLoader/loadProxyClasses/PublicInterface.java
A         qa/jtreg/java/rmi/server/RMIClassLoader/loadProxyClasses/PublicInterface1.java
A         qa/jtreg/java/rmi/server/RMIClassLoader/loadProxyClasses/security.policy
A         qa/jtreg/java/rmi/server/RMIClassLoader/loadProxyClasses/FnnClass.java
A         qa/jtreg/java/rmi/server/RMIClassLoader/loadProxyClasses/NonpublicInterface.java
A         qa/jtreg/java/rmi/server/RMIClassLoader/loadProxyClasses/NonpublicInterface1.java
A         qa/jtreg/java/rmi/server/RMIClassLoader/loadProxyClasses/FnnUnmarshal.java
A         qa/jtreg/java/rmi/server/RMIClassLoader/loadProxyClasses/PreferredLoadProxyClasses.java
A         qa/jtreg/java/rmi/server/Unreferenced
A         qa/jtreg/java/rmi/server/Unreferenced/marshalledObjectGet
A         qa/jtreg/java/rmi/server/Unreferenced/marshalledObjectGet/MarshalledObjectGet.java
A         qa/jtreg/java/rmi/server/Unreferenced/whenOnUnexport
A         qa/jtreg/java/rmi/server/Unreferenced/whenOnUnexport/WhenOnUnexport.java
A         qa/jtreg/testlibrary
A         qa/jtreg/testlibrary/RegistryRunner_Stub.java
A         qa/jtreg/testlibrary/RegistryRunner.java
A         qa/jtreg/testlibrary/HTTPD.java
A         qa/jtreg/testlibrary/TestFailedException.java
A         qa/jtreg/testlibrary/TestParams.java
A         qa/jtreg/testlibrary/JavaVM.java
A         qa/jtreg/testlibrary/TestLibrary.java
A         qa/jtreg/testlibrary/ActivationLibrary.java
A         qa/jtreg/testlibrary/StreamPipe.java
A         qa/jtreg/testlibrary/RMID.java
A         qa/jtreg/testlibrary/RemoteExiter.java
A         qa/jtreg/net
A         qa/jtreg/net/jini
A         qa/jtreg/net/jini/iiop
A         qa/jtreg/net/jini/iiop/echo
A         qa/jtreg/net/jini/iiop/echo/EchoImpl.java
A         qa/jtreg/net/jini/iiop/echo/_EchoImpl_Tie.java
A         qa/jtreg/net/jini/iiop/echo/ConnectedExport.java
A         qa/jtreg/net/jini/iiop/echo/UnconnectedExport.java
A         qa/jtreg/net/jini/iiop/echo/_Echo_Stub.java
A         qa/jtreg/net/jini/iiop/echo/NonIiopExport.java
A         qa/jtreg/net/jini/iiop/echo/Echo.java
A         qa/jtreg/net/jini/activation
A         qa/jtreg/net/jini/activation/Activatable
A         qa/jtreg/net/jini/activation/Activatable/activateExceptionTest
A         qa/jtreg/net/jini/activation/Activatable/activateExceptionTest/ActivateExceptionTest.java
A         qa/jtreg/net/jini/activation/Activatable/activateExceptionTest/rmid.config
A         qa/jtreg/net/jini/activation/Activatable/activateExceptionTest/rmid.security.policy
A         qa/jtreg/net/jini/activation/Activatable/activateExceptionTest/group.security.policy
A         qa/jtreg/net/jini/activation/Activatable/activateExceptionTest/ActivateMe.java
A         qa/jtreg/net/jini/activation/Activatable/activateExceptionTest/security.policy
AU        qa/jtreg/net/jini/activation/Activatable/activateExceptionTest/classpath.sh
A         qa/jtreg/net/jini/activation/Activatable/inactiveGroup
A         qa/jtreg/net/jini/activation/Activatable/inactiveGroup/InactiveGroup.java
A         qa/jtreg/net/jini/activation/Activatable/inactiveGroup/rmid.config
A         qa/jtreg/net/jini/activation/Activatable/inactiveGroup/rmid.security.policy
A         qa/jtreg/net/jini/activation/Activatable/inactiveGroup/group.security.policy
A         qa/jtreg/net/jini/activation/Activatable/inactiveGroup/ActivateMe.java
A         qa/jtreg/net/jini/activation/Activatable/inactiveGroup/security.policy
AU        qa/jtreg/net/jini/activation/Activatable/inactiveGroup/classpath.sh
A         qa/jtreg/net/jini/activation/Activatable/inactiveGroup/InactiveGroup_Stub.java
A         qa/jtreg/net/jini/activation/Activatable/forceLogSnapshot
A         qa/jtreg/net/jini/activation/Activatable/forceLogSnapshot/rmid.config
A         qa/jtreg/net/jini/activation/Activatable/forceLogSnapshot/rmid.security.policy
A         qa/jtreg/net/jini/activation/Activatable/forceLogSnapshot/ForceLogSnapshot.java
A         qa/jtreg/net/jini/activation/Activatable/forceLogSnapshot/group.security.policy
A         qa/jtreg/net/jini/activation/Activatable/forceLogSnapshot/ActivateMe.java
A         qa/jtreg/net/jini/activation/Activatable/forceLogSnapshot/security.policy
AU        qa/jtreg/net/jini/activation/Activatable/forceLogSnapshot/classpath.sh
A         qa/jtreg/net/jini/activation/Activatable/forceLogSnapshot/ForceLogSnapshot_Stub.java
A         qa/jtreg/net/jini/activation/Activatable/forceLogSnapshot/ForceLogSnapshot_Skel.java
A         qa/jtreg/net/jini/activation/Activatable/useProxyAccessor
A         qa/jtreg/net/jini/activation/Activatable/useProxyAccessor/rmid.config
A         qa/jtreg/net/jini/activation/Activatable/useProxyAccessor/rmid.security.policy
A         qa/jtreg/net/jini/activation/Activatable/useProxyAccessor/group.security.policy
A         qa/jtreg/net/jini/activation/Activatable/useProxyAccessor/UseProxyAccessor.java
A         qa/jtreg/net/jini/activation/Activatable/useProxyAccessor/security.policy
AU        qa/jtreg/net/jini/activation/Activatable/useProxyAccessor/classpath.sh
A         qa/jtreg/net/jini/activation/Activatable/useProxyAccessor/UseProxyAccessor_Stub.java
A         qa/jtreg/net/jini/activation/Activatable/downloadSecurityManager
A         qa/jtreg/net/jini/activation/Activatable/downloadSecurityManager/rmid.config
A         qa/jtreg/net/jini/activation/Activatable/downloadSecurityManager/rmid.security.policy
A         qa/jtreg/net/jini/activation/Activatable/downloadSecurityManager/group.security.policy
A         qa/jtreg/net/jini/activation/Activatable/downloadSecurityManager/manual.security.policy
A         qa/jtreg/net/jini/activation/Activatable/downloadSecurityManager/ActivateMe.java
A         qa/jtreg/net/jini/activation/Activatable/downloadSecurityManager/CustomRMISecurityManager.java
A         qa/jtreg/net/jini/activation/Activatable/downloadSecurityManager/security.policy
A         qa/jtreg/net/jini/activation/Activatable/downloadSecurityManager/DownloadSecurityManager_Stub.java
ERROR: Failed to check out http://svn.apache.org/repos/asf/river/jtsk/trunk
org.tmatesoft.svn.core.SVNException: svn: E175002: REPORT /repos/asf/!svn/vcc/default failed
	at org.tmatesoft.svn.core.internal.io.dav.http.HTTPConnection.request(HTTPConnection.java:304)
	at org.tmatesoft.svn.core.internal.io.dav.http.HTTPConnection.request(HTTPConnection.java:289)
	at org.tmatesoft.svn.core.internal.io.dav.http.HTTPConnection.request(HTTPConnection.java:277)
	at org.tmatesoft.svn.core.internal.io.dav.DAVConnection.performHttpRequest(DAVConnection.java:696)
	at org.tmatesoft.svn.core.internal.io.dav.DAVConnection.doReport(DAVConnection.java:328)
	at org.tmatesoft.svn.core.internal.io.dav.DAVRepository.runReport(DAVRepository.java:1289)
	at org.tmatesoft.svn.core.internal.io.dav.DAVRepository.update(DAVRepository.java:837)
	at org.tmatesoft.svn.core.internal.wc16.SVNUpdateClient16.update(SVNUpdateClient16.java:557)
	at org.tmatesoft.svn.core.internal.wc16.SVNUpdateClient16.doCheckout(SVNUpdateClient16.java:965)
	at org.tmatesoft.svn.core.internal.wc2.old.SvnOldCheckout.run(SvnOldCheckout.java:19)
	at org.tmatesoft.svn.core.internal.wc2.old.SvnOldCheckout.run(SvnOldCheckout.java:8)
	at org.tmatesoft.svn.core.internal.wc2.SvnOperationRunner.run(SvnOperationRunner.java:20)
	at org.tmatesoft.svn.core.wc2.SvnOperationFactory.run(SvnOperationFactory.java:1221)
	at org.tmatesoft.svn.core.wc2.SvnOperation.run(SvnOperation.java:292)
	at org.tmatesoft.svn.core.wc.SVNUpdateClient.doCheckout(SVNUpdateClient.java:781)
	at hudson.scm.subversion.CheckoutUpdater$1.perform(CheckoutUpdater.java:85)
	at hudson.scm.subversion.WorkspaceUpdater$UpdateTask.delegateTo(WorkspaceUpdater.java:144)
	at hudson.scm.SubversionSCM$CheckOutTask.perform(SubversionSCM.java:789)
	at hudson.scm.SubversionSCM$CheckOutTask.invoke(SubversionSCM.java:770)
	at hudson.scm.SubversionSCM$CheckOutTask.invoke(SubversionSCM.java:753)
	at hudson.FilePath$FileCallableWrapper.call(FilePath.java:2196)
	at hudson.remoting.UserRequest.perform(UserRequest.java:118)
	at hudson.remoting.UserRequest.perform(UserRequest.java:48)
	at hudson.remoting.Request$2.run(Request.java:326)
	at hudson.remoting.InterceptingExecutorService$1.call(InterceptingExecutorService.java:72)
	at java.util.concurrent.FutureTask$Sync.innerRun(FutureTask.java:269)
	at java.util.concurrent.FutureTask.run(FutureTask.java:123)
	at java.util.concurrent.ThreadPoolExecutor$Worker.runTask(ThreadPoolExecutor.java:651)
	at java.util.concurrent.ThreadPoolExecutor$Worker.run(ThreadPoolExecutor.java:676)
	at java.lang.Thread.run(Thread.java:595)
Caused by: svn: E175002: REPORT /repos/asf/!svn/vcc/default failed
	at org.tmatesoft.svn.core.SVNErrorMessage.create(SVNErrorMessage.java:208)
	at org.tmatesoft.svn.core.SVNErrorMessage.create(SVNErrorMessage.java:154)
	at org.tmatesoft.svn.core.SVNErrorMessage.create(SVNErrorMessage.java:97)
	... 30 more
Caused by: org.tmatesoft.svn.core.SVNException: svn: E175002: REPORT request failed on '/repos/asf/!svn/vcc/default'
svn: E175002: chunked stream ended unexpectedly
	at org.tmatesoft.svn.core.internal.wc.SVNErrorManager.error(SVNErrorManager.java:64)
	at org.tmatesoft.svn.core.internal.wc.SVNErrorManager.error(SVNErrorManager.java:51)
	at org.tmatesoft.svn.core.internal.io.dav.http.HTTPConnection._request(HTTPConnection.java:681)
	at org.tmatesoft.svn.core.internal.io.dav.http.HTTPConnection.request(HTTPConnection.java:298)
	... 29 more
Caused by: svn: E175002: REPORT request failed on '/repos/asf/!svn/vcc/default'
	at org.tmatesoft.svn.core.SVNErrorMessage.create(SVNErrorMessage.java:208)
	at org.tmatesoft.svn.core.internal.io.dav.http.HTTPConnection._request(HTTPConnection.java:679)
	... 30 more
Caused by: svn: E175002: chunked stream ended unexpectedly
	at org.tmatesoft.svn.core.SVNErrorMessage.create(SVNErrorMessage.java:109)
	at org.tmatesoft.svn.core.internal.io.dav.http.HTTPConnection._request(HTTPConnection.java:433)
	... 30 more
Caused by: java.io.IOException: chunked stream ended unexpectedly
	at org.tmatesoft.svn.core.internal.util.ChunkedInputStream.getChunkSizeFromInputStream(ChunkedInputStream.java:113)
	at org.tmatesoft.svn.core.internal.util.ChunkedInputStream.nextChunk(ChunkedInputStream.java:97)
	at org.tmatesoft.svn.core.internal.util.ChunkedInputStream.read(ChunkedInputStream.java:69)
	at java.util.zip.InflaterInputStream.fill(InflaterInputStream.java:214)
	at java.util.zip.InflaterInputStream.read(InflaterInputStream.java:134)
	at java.util.zip.GZIPInputStream.read(GZIPInputStream.java:87)
	at sun.nio.cs.StreamDecoder$CharsetSD.readBytes(StreamDecoder.java:411)
	at sun.nio.cs.StreamDecoder$CharsetSD.implRead(StreamDecoder.java:453)
	at sun.nio.cs.StreamDecoder.read(StreamDecoder.java:183)
	at java.io.InputStreamReader.read(InputStreamReader.java:167)
	at org.tmatesoft.svn.core.internal.io.dav.http.XMLReader.read(XMLReader.java:39)
	at org.apache.xerces.impl.XMLEntityScanner.load(Unknown Source)
	at org.apache.xerces.impl.XMLEntityScanner.scanContent(Unknown Source)
	at org.apache.xerces.impl.XMLDocumentFragmentScannerImpl.scanContent(Unknown Source)
	at org.apache.xerces.impl.XMLDocumentFragmentScannerImpl$FragmentContentDispatcher.dispatch(Unknown
Source)
	at org.apache.xerces.impl.XMLDocumentFragmentScannerImpl.scanDocument(Unknown Source)
	at org.apache.xerces.parsers.XML11Configuration.parse(Unknown Source)
	at org.apache.xerces.parsers.XML11Configuration.parse(Unknown Source)
	at org.apache.xerces.parsers.XMLParser.parse(Unknown Source)
	at org.apache.xerces.parsers.AbstractSAXParser.parse(Unknown Source)
	at org.apache.xerces.jaxp.SAXParserImpl$JAXPSAXParser.parse(Unknown Source)
	at org.tmatesoft.svn.core.internal.io.dav.http.HTTPConnection.readData(HTTPConnection.java:796)
	at org.tmatesoft.svn.core.internal.io.dav.http.HTTPConnection.readData(HTTPConnection.java:761)
	at org.tmatesoft.svn.core.internal.io.dav.http.HTTPRequest.dispatch(HTTPRequest.java:218)
	at org.tmatesoft.svn.core.internal.io.dav.http.HTTPConnection._request(HTTPConnection.java:385)
	... 30 more
FATAL: null
java.lang.NullPointerException
	at java.util.ArrayList.addAll(ArrayList.java:530)
	at hudson.scm.SubversionSCM.checkout(SubversionSCM.java:743)
	at hudson.scm.SubversionSCM.checkout(SubversionSCM.java:685)
	at hudson.model.AbstractProject.checkout(AbstractProject.java:1245)
	at hudson.model.AbstractBuild$AbstractBuildExecution.defaultCheckout(AbstractBuild.java:589)
	at jenkins.scm.SCMCheckoutStrategy.checkout(SCMCheckoutStrategy.java:88)
	at hudson.model.AbstractBuild$AbstractBuildExecution.run(AbstractBuild.java:494)
	at hudson.model.Run.execute(Run.java:1488)
	at hudson.model.FreeStyleBuild.run(FreeStyleBuild.java:46)
	at hudson.model.ResourceController.execute(ResourceController.java:88)
	at hudson.model.Executor.run(Executor.java:236)

Mime
View raw message