river-dev mailing list archives

Site index · List index
Message view « Date » · « Thread »
Top « Date » · « Thread »
From Peter Firmstone <j...@zeus.net.au>
Subject jtreg test results
Date Tue, 15 May 2012 12:36:35 GMT
Only failed tests shown.  Failed tests due to missing infrastructure in 
all but one case.

jtreg:
    [mkdir] Created dir: 
/opt/src/River_Fixed_2nd_Try/peterConcurrentPolicy/qa/jtreg/JTlib-tmp
     [move] Moving 8 files to 
/opt/src/River_Fixed_2nd_Try/peterConcurrentPolicy/qa/jtreg/JTlib-tmp
     [move] Moving 1 file to 
/opt/src/River_Fixed_2nd_Try/peterConcurrentPolicy/qa/jtreg/JTlib-tmp
    [jtreg] --------------------------------------------------
    [jtreg] TEST: net/jini/jeri/http/echo/EchoImpl.java
    [jtreg] JDK under test: (/usr/jdk/jdk1.6.0_25)
    [jtreg] java version "1.6.0_25"
    [jtreg] Java(TM) SE Runtime Environment (build 1.6.0_25-b06)
    [jtreg] Java HotSpot(TM) Server VM (build 20.0-b11, mixed mode)
    [jtreg]
    [jtreg] ACTION: build -- Passed. All files up to date
    [jtreg] REASON: User specified action: run build Echo EchoImpl
    [jtreg] TIME:   0.0010 seconds
    [jtreg] messages:
    [jtreg] command: build Echo EchoImpl
    [jtreg] reason: User specified action: run build Echo EchoImpl
    [jtreg] elapsed time (seconds): 0.0010
    [jtreg]
    [jtreg] ACTION: build -- Passed. All files up to date
    [jtreg] REASON: Named class compiled on demand
    [jtreg] TIME:   0.0 seconds
    [jtreg] messages:
    [jtreg] command: build EchoImpl
    [jtreg] reason: Named class compiled on demand
    [jtreg] elapsed time (seconds): 0.0
    [jtreg]
    [jtreg] ACTION: main -- Passed. Execution successful
    [jtreg] REASON: User specified action: run main/othervm EchoImpl
    [jtreg] TIME:   4.826 seconds
    [jtreg] messages:
    [jtreg] command: main EchoImpl
    [jtreg] reason: User specified action: run main/othervm EchoImpl
    [jtreg] elapsed time (seconds): 4.826
    [jtreg] STDOUT:
    [jtreg] STDERR:
    [jtreg] STATUS:Passed.
    [jtreg]
    [jtreg] ACTION: build -- Passed. All files up to date
    [jtreg] REASON: Named class compiled on demand
    [jtreg] TIME:   0.0 seconds
    [jtreg] messages:
    [jtreg] command: build EchoImpl
    [jtreg] reason: Named class compiled on demand
    [jtreg] elapsed time (seconds): 0.0
    [jtreg]
    [jtreg] ACTION: main -- Failed. Execution failed: `main' threw 
exception: java.rmi.UnknownHostException: unknown host in 
BasicObjectEndpoint[91e3dee0-8e5e-4595-b856-f12cd69765be,HttpEndpoint[10.1.1.2:35428]]; 
nested exception is:   java.net.UnknownHostException: jiniproxy
    [jtreg] REASON: User specified action: run main/othervm 
-Dhttp.proxyHost=jiniproxy -Dhttp.proxyPort=8001 EchoImpl
    [jtreg] TIME:   3.965 seconds
    [jtreg] messages:
    [jtreg] command: main -Dhttp.proxyHost=jiniproxy 
-Dhttp.proxyPort=8001 EchoImpl
    [jtreg] reason: User specified action: run main/othervm 
-Dhttp.proxyHost=jiniproxy -Dhttp.proxyPort=8001 EchoImpl
    [jtreg] elapsed time (seconds): 3.965
    [jtreg] STDOUT:
    [jtreg] STDERR:
    [jtreg] java.rmi.UnknownHostException: unknown host in 
BasicObjectEndpoint[91e3dee0-8e5e-4595-b856-f12cd69765be,HttpEndpoint[10.1.1.2:35428]]; 
nested exception is:
    [jtreg]     java.net.UnknownHostException: jiniproxy
    [jtreg]     at 
net.jini.jeri.BasicInvocationHandler.wrapSafeIOException(BasicInvocationHandler.java:887)
    [jtreg]     at 
net.jini.jeri.BasicInvocationHandler.invokeRemoteMethodOnce(BasicInvocationHandler.java:711)
    [jtreg]     at 
net.jini.jeri.BasicInvocationHandler.invokeRemoteMethod(BasicInvocationHandler.java:659)
    [jtreg]     at 
net.jini.jeri.BasicInvocationHandler.invoke(BasicInvocationHandler.java:528)
    [jtreg]     at $Proxy0.echo(Unknown Source)
    [jtreg]     at EchoImpl.testExport(EchoImpl.java:60)
    [jtreg]     at EchoImpl.main(EchoImpl.java:38)
    [jtreg]     at sun.reflect.NativeMethodAccessorImpl.invoke0(Native 
Method)
    [jtreg]     at 
sun.reflect.NativeMethodAccessorImpl.invoke(NativeMethodAccessorImpl.java:39)
    [jtreg]     at 
sun.reflect.DelegatingMethodAccessorImpl.invoke(DelegatingMethodAccessorImpl.java:25)
    [jtreg]     at java.lang.reflect.Method.invoke(Method.java:597)
    [jtreg]     at 
com.sun.javatest.regtest.MainWrapper$MainThread.run(MainWrapper.java:94)
    [jtreg]     at java.lang.Thread.run(Thread.java:662)
    [jtreg] Caused by: java.net.UnknownHostException: jiniproxy
    [jtreg]     at 
java.net.PlainSocketImpl.connect(PlainSocketImpl.java:195)
    [jtreg]     at 
java.net.SocksSocketImpl.connect(SocksSocketImpl.java:366)
    [jtreg]     at java.net.Socket.connect(Socket.java:529)
    [jtreg]     at 
net.jini.jeri.http.HttpEndpoint$SocketFactoryAdapter.connectToSocketAddress(HttpEndpoint.java:959)
    [jtreg]     at 
net.jini.jeri.http.HttpEndpoint$SocketFactoryAdapter.connectToHost(HttpEndpoint.java:855)
    [jtreg]     at 
net.jini.jeri.http.HttpEndpoint$SocketFactoryAdapter.createSocket(HttpEndpoint.java:822)
    [jtreg]     at 
com.sun.jini.jeri.internal.http.HttpClientConnection.connect(HttpClientConnection.java:298)
    [jtreg]     at 
com.sun.jini.jeri.internal.http.HttpClientConnection.setupConnection(HttpClientConnection.java:268)
    [jtreg]     at 
com.sun.jini.jeri.internal.http.HttpClientConnection.<init>(HttpClientConnection.java:126)
    [jtreg]     at 
net.jini.jeri.http.HttpEndpoint$Connection.<init>(HttpEndpoint.java:1031)
    [jtreg]     at 
net.jini.jeri.http.HttpEndpoint$3.run(HttpEndpoint.java:567)
    [jtreg]     at java.security.AccessController.doPrivileged(Native 
Method)
    [jtreg]     at 
net.jini.jeri.http.HttpEndpoint.connectionAction(HttpEndpoint.java:564)
    [jtreg]     at 
net.jini.jeri.http.HttpEndpoint.nextRequest(HttpEndpoint.java:648)
    [jtreg]     at 
net.jini.jeri.http.HttpEndpoint.nextRequest(HttpEndpoint.java:443)
    [jtreg]     at 
net.jini.jeri.http.HttpEndpoint.access$000(HttpEndpoint.java:104)
    [jtreg]     at 
net.jini.jeri.http.HttpEndpoint$1.next(HttpEndpoint.java:427)
    [jtreg]     at 
net.jini.jeri.BasicObjectEndpoint$1.next(BasicObjectEndpoint.java:370)
    [jtreg]     at 
net.jini.jeri.BasicInvocationHandler.invokeRemoteMethodOnce(BasicInvocationHandler.java:708)
    [jtreg]     ... 11 more
    [jtreg]
    [jtreg] JavaTest Message: Test threw exception: 
java.rmi.UnknownHostException: unknown host in 
BasicObjectEndpoint[91e3dee0-8e5e-4595-b856-f12cd69765be,HttpEndpoint[10.1.1.2:35428]]; 
nested exception is:
    [jtreg]     java.net.UnknownHostException: jiniproxy
    [jtreg] JavaTest Message: shutting down test
    [jtreg]
    [jtreg] STATUS:Failed.`main' threw exception: 
java.rmi.UnknownHostException: unknown host in 
BasicObjectEndpoint[91e3dee0-8e5e-4595-b856-f12cd69765be,HttpEndpoint[10.1.1.2:35428]]; 
nested exception is:   java.net.UnknownHostException: jiniproxy
    [jtreg]
    [jtreg] TEST RESULT: Failed. Execution failed: `main' threw 
exception: java.rmi.UnknownHostException: unknown host in 
BasicObjectEndpoint[91e3dee0-8e5e-4595-b856-f12cd69765be,HttpEndpoint[10.1.1.2:35428]]; 
nested exception is:   java.net.UnknownHostException: jiniproxy
    [jtreg] --------------------------------------------------
    [jtreg] TEST: 
net/jini/jeri/kerberos/RegressionTests/runListenEndpointTest.sh
    [jtreg] JDK under test: (/usr/jdk/jdk1.6.0_25)
    [jtreg] java version "1.6.0_25"
    [jtreg] Java(TM) SE Runtime Environment (build 1.6.0_25-b06)
    [jtreg] Java HotSpot(TM) Server VM (build 20.0-b11, mixed mode)
    [jtreg]
    [jtreg] ACTION: build -- Passed. All files up to date
    [jtreg] REASON: User specified action: run build ListenEndpointTest
    [jtreg] TIME:   0.0010 seconds
    [jtreg] messages:
    [jtreg] command: build ListenEndpointTest
    [jtreg] reason: User specified action: run build ListenEndpointTest
    [jtreg] elapsed time (seconds): 0.0010
    [jtreg]
    [jtreg] ACTION: shell -- Failed. Execution failed: exit code 1
    [jtreg] REASON: User specified action: run shell 
runListenEndpointTest.sh
    [jtreg] TIME:   0.95 seconds
    [jtreg] messages:
    [jtreg] command: shell runListenEndpointTest.sh []
    [jtreg] reason: User specified action: run shell 
runListenEndpointTest.sh
    [jtreg] elapsed time (seconds): 0.95
    [jtreg] STDOUT:
    [jtreg] STDERR:
    [jtreg] 
KEYSRC=/opt/src/River_Fixed_2nd_Try/peterConcurrentPolicy/qa/jtreg/net/jini/jeri/kerberos/RegressionTests/../UnitTests
    [jtreg] + . 
/opt/src/River_Fixed_2nd_Try/peterConcurrentPolicy/qa/jtreg/net/jini/jeri/kerberos/RegressionTests/../UnitTests/krb-setenv.sh
    [jtreg] REALM=DAVIS.JINI.SUN.COM
    [jtreg] KDC_HOST=jiniautot.east.sun.com
    [jtreg] + mkdir config
    [jtreg] + cp 
/opt/src/River_Fixed_2nd_Try/peterConcurrentPolicy/qa/jtreg/net/jini/jeri/kerberos/RegressionTests/../UnitTests/config/jgssTests.keytab

config
    [jtreg] + /usr/jdk/jdk1.6.0_25/bin/java -Djava.security.manager= 
-Djava.security.policy=/opt/src/River_Fixed_2nd_Try/peterConcurrentPolicy/qa/jtreg/net/jini/jeri/kerberos/RegressionTests/config/policy

-Djava.security.auth.login.config=/opt/src/River_Fixed_2nd_Try/peterConcurrentPolicy/qa/jtreg/net/jini/jeri/kerberos/RegressionTests/config/test.login

-Djava.security.krb5.realm=DAVIS.JINI.SUN.COM 
-Djava.security.krb5.kdc=jiniautot.east.sun.com -classpath 
/opt/src/River_Fixed_2nd_Try/peterConcurrentPolicy/qa/jtreg/JTwork/classes/net/jini/jeri/kerberos/RegressionTests

ListenEndpointTest
    [jtreg] Exception in thread "main" java.lang.NoClassDefFoundError: 
net/jini/jeri/InvocationLayerFactory
    [jtreg] Caused by: java.lang.ClassNotFoundException: 
net.jini.jeri.InvocationLayerFactory
    [jtreg]     at java.net.URLClassLoader$1.run(URLClassLoader.java:202)
    [jtreg]     at java.security.AccessController.doPrivileged(Native 
Method)
    [jtreg]     at 
java.net.URLClassLoader.findClass(URLClassLoader.java:190)
    [jtreg]     at java.lang.ClassLoader.loadClass(ClassLoader.java:306)
    [jtreg]     at 
sun.misc.Launcher$AppClassLoader.loadClass(Launcher.java:301)
    [jtreg]     at java.lang.ClassLoader.loadClass(ClassLoader.java:247)
    [jtreg] Could not find the main class: ListenEndpointTest.  Program 
will exit.
    [jtreg]
    [jtreg] TEST RESULT: Failed. Execution failed: exit code 1
    [jtreg] --------------------------------------------------
    [jtreg] TEST: net/jini/jeri/kerberos/UnitTests/runTestEndpoints.sh
    [jtreg] JDK under test: (/usr/jdk/jdk1.6.0_25)
    [jtreg] java version "1.6.0_25"
    [jtreg] Java(TM) SE Runtime Environment (build 1.6.0_25-b06)
    [jtreg] Java HotSpot(TM) Server VM (build 20.0-b11, mixed mode)
    [jtreg]
    [jtreg] ACTION: build -- Passed. All files up to date
    [jtreg] REASON: User specified action: run build UnitTestUtilities 
BasicTest Test
    [jtreg] TIME:   0.0020 seconds
    [jtreg] messages:
    [jtreg] command: build UnitTestUtilities BasicTest Test
    [jtreg] reason: User specified action: run build UnitTestUtilities 
BasicTest Test
    [jtreg] elapsed time (seconds): 0.0020
    [jtreg]
    [jtreg] ACTION: build -- Passed. All files up to date
    [jtreg] REASON: User specified action: run build TestUtilities 
TestEndpoints
    [jtreg] TIME:   0.0 seconds
    [jtreg] messages:
    [jtreg] command: build TestUtilities TestEndpoints
    [jtreg] reason: User specified action: run build TestUtilities 
TestEndpoints
    [jtreg] elapsed time (seconds): 0.0
    [jtreg]
    [jtreg] ACTION: shell -- Failed. Execution failed: exit code 1
    [jtreg] REASON: User specified action: run shell/timeout=3600 
runTestEndpoints.sh
    [jtreg] TIME:   0.817 seconds
    [jtreg] messages:
    [jtreg] command: shell runTestEndpoints.sh []
    [jtreg] reason: User specified action: run shell/timeout=3600 
runTestEndpoints.sh
    [jtreg] elapsed time (seconds): 0.817
    [jtreg] STDOUT:
    [jtreg] STDERR:
    [jtreg] + . 
/opt/src/River_Fixed_2nd_Try/peterConcurrentPolicy/qa/jtreg/net/jini/jeri/kerberos/UnitTests/krb-setenv.sh
    [jtreg] REALM=DAVIS.JINI.SUN.COM
    [jtreg] KDC_HOST=jiniautot.east.sun.com
    [jtreg] + mkdir config
    [jtreg] + cp 
/opt/src/River_Fixed_2nd_Try/peterConcurrentPolicy/qa/jtreg/net/jini/jeri/kerberos/UnitTests/config/jgssTests.keytab

config
    [jtreg] + /usr/jdk/jdk1.6.0_25/bin/java 
-Djava.security.krb5.realm=DAVIS.JINI.SUN.COM 
-Djava.security.krb5.kdc=jiniautot.east.sun.com 
sun.security.krb5.internal.tools.Kinit -f -k -t 
/opt/src/River_Fixed_2nd_Try/peterConcurrentPolicy/qa/jtreg/net/jini/jeri/kerberos/UnitTests/config/jgssTests.keytab

-c FILE:config/testClient1.tgt testClient1
    [jtreg] Exception in thread "main" java.lang.NoClassDefFoundError: 
sun/security/krb5/internal/tools/Kinit
    [jtreg] Caused by: java.lang.ClassNotFoundException: 
sun.security.krb5.internal.tools.Kinit
    [jtreg]     at java.net.URLClassLoader$1.run(URLClassLoader.java:202)
    [jtreg]     at java.security.AccessController.doPrivileged(Native 
Method)
    [jtreg]     at 
java.net.URLClassLoader.findClass(URLClassLoader.java:190)
    [jtreg]     at java.lang.ClassLoader.loadClass(ClassLoader.java:306)
    [jtreg]     at 
sun.misc.Launcher$AppClassLoader.loadClass(Launcher.java:301)
    [jtreg]     at java.lang.ClassLoader.loadClass(ClassLoader.java:247)
    [jtreg] Could not find the main class: 
sun.security.krb5.internal.tools.Kinit.  Program will exit.
    [jtreg]
    [jtreg] TEST RESULT: Failed. Execution failed: exit code 1
    [jtreg] --------------------------------------------------
    [jtreg] TEST: net/jini/jeri/kerberos/UnitTests/runTestPerformance.sh
    [jtreg] JDK under test: (/usr/jdk/jdk1.6.0_25)
    [jtreg] java version "1.6.0_25"
    [jtreg] Java(TM) SE Runtime Environment (build 1.6.0_25-b06)
    [jtreg] Java HotSpot(TM) Server VM (build 20.0-b11, mixed mode)
    [jtreg]
    [jtreg] ACTION: build -- Passed. All files up to date
    [jtreg] REASON: User specified action: run build UnitTestUtilities 
BasicTest Test
    [jtreg] TIME:   0.0020 seconds
    [jtreg] messages:
    [jtreg] command: build UnitTestUtilities BasicTest Test
    [jtreg] reason: User specified action: run build UnitTestUtilities 
BasicTest Test
    [jtreg] elapsed time (seconds): 0.0020
    [jtreg]
    [jtreg] ACTION: build -- Passed. All files up to date
    [jtreg] REASON: User specified action: run build TestUtilities 
TestPerformance
    [jtreg] TIME:   0.0010 seconds
    [jtreg] messages:
    [jtreg] command: build TestUtilities TestPerformance
    [jtreg] reason: User specified action: run build TestUtilities 
TestPerformance
    [jtreg] elapsed time (seconds): 0.0010
    [jtreg]
    [jtreg] ACTION: shell -- Failed. Execution failed: exit code 1
    [jtreg] REASON: User specified action: run shell/timeout=3600 
runTestPerformance.sh
    [jtreg] TIME:   0.852 seconds
    [jtreg] messages:
    [jtreg] command: shell runTestPerformance.sh []
    [jtreg] reason: User specified action: run shell/timeout=3600 
runTestPerformance.sh
    [jtreg] elapsed time (seconds): 0.852
    [jtreg] STDOUT:
    [jtreg] STDERR:
    [jtreg] + . 
/opt/src/River_Fixed_2nd_Try/peterConcurrentPolicy/qa/jtreg/net/jini/jeri/kerberos/UnitTests/krb-setenv.sh
    [jtreg] REALM=DAVIS.JINI.SUN.COM
    [jtreg] KDC_HOST=jiniautot.east.sun.com
    [jtreg] + mkdir config
    [jtreg] + cp 
/opt/src/River_Fixed_2nd_Try/peterConcurrentPolicy/qa/jtreg/net/jini/jeri/kerberos/UnitTests/config/jgssTests.keytab

config
    [jtreg] + /usr/jdk/jdk1.6.0_25/bin/java 
-Djava.security.krb5.realm=DAVIS.JINI.SUN.COM 
-Djava.security.krb5.kdc=jiniautot.east.sun.com 
sun.security.krb5.internal.tools.Kinit -f -k -t 
/opt/src/River_Fixed_2nd_Try/peterConcurrentPolicy/qa/jtreg/net/jini/jeri/kerberos/UnitTests/config/jgssTests.keytab

-c FILE:config/testClient1.tgt testClient1
    [jtreg] Exception in thread "main" java.lang.NoClassDefFoundError: 
sun/security/krb5/internal/tools/Kinit
    [jtreg] Caused by: java.lang.ClassNotFoundException: 
sun.security.krb5.internal.tools.Kinit
    [jtreg]     at java.net.URLClassLoader$1.run(URLClassLoader.java:202)
    [jtreg]     at java.security.AccessController.doPrivileged(Native 
Method)
    [jtreg]     at 
java.net.URLClassLoader.findClass(URLClassLoader.java:190)
    [jtreg]     at java.lang.ClassLoader.loadClass(ClassLoader.java:306)
    [jtreg]     at 
sun.misc.Launcher$AppClassLoader.loadClass(Launcher.java:301)
    [jtreg]     at java.lang.ClassLoader.loadClass(ClassLoader.java:247)
    [jtreg] Could not find the main class: 
sun.security.krb5.internal.tools.Kinit.  Program will exit.
    [jtreg]
    [jtreg] TEST RESULT: Failed. Execution failed: exit code 1
    [jtreg] --------------------------------------------------
    [jtreg] TEST: net/jini/jeri/transport/multihomed/runMultihome.sh
    [jtreg] JDK under test: (/usr/jdk/jdk1.6.0_25)
    [jtreg] java version "1.6.0_25"
    [jtreg] Java(TM) SE Runtime Environment (build 1.6.0_25-b06)
    [jtreg] Java HotSpot(TM) Server VM (build 20.0-b11, mixed mode)
    [jtreg]
    [jtreg] ACTION: build -- Passed. All files up to date
    [jtreg] REASON: User specified action: run build 
AbstractSocketFactory Multihomed TestNameService 
TestNameServiceDescriptor Resolver
    [jtreg] TIME:   0.0040 seconds
    [jtreg] messages:
    [jtreg] command: build AbstractSocketFactory Multihomed 
TestNameService TestNameServiceDescriptor Resolver
    [jtreg] reason: User specified action: run build 
AbstractSocketFactory Multihomed TestNameService 
TestNameServiceDescriptor Resolver
    [jtreg] elapsed time (seconds): 0.0040
    [jtreg]
    [jtreg] ACTION: shell -- Failed. Execution failed: exit code 1
    [jtreg] REASON: User specified action: run shell runMultihome.sh
    [jtreg] TIME:   2.968 seconds
    [jtreg] messages:
    [jtreg] command: shell runMultihome.sh []
    [jtreg] reason: User specified action: run shell runMultihome.sh
    [jtreg] elapsed time (seconds): 2.968
    [jtreg] STDOUT:
    [jtreg] STDERR:
    [jtreg] + . 
/opt/src/River_Fixed_2nd_Try/peterConcurrentPolicy/qa/jtreg/net/jini/jeri/transport/multihomed/krb-setenv.sh
    [jtreg] REALM=DAVIS.JINI.SUN.COM
    [jtreg] KDC_HOST=jiniautot.east.sun.com
    [jtreg] SEPARATOR=:
    [jtreg] + uname
    [jtreg] + mkdir config
    [jtreg] + cp 
/opt/src/River_Fixed_2nd_Try/peterConcurrentPolicy/qa/jtreg/net/jini/jeri/transport/multihomed/../../kerberos/UnitTests/config/jgssTests.keytab

config
    [jtreg] + /usr/jdk/jdk1.6.0_25/bin/java -classpath 
/opt/src/River_Fixed_2nd_Try/peterConcurrentPolicy/qa/jtreg/JTwork/classes/net/jini/jeri/transport/multihomed

Resolver
    [jtreg] HOSTNAME=bluto
    [jtreg] + /usr/jdk/jdk1.6.0_25/bin/java -classpath 
/opt/src/River_Fixed_2nd_Try/peterConcurrentPolicy/qa/jtreg/JTwork/classes/net/jini/jeri/transport/multihomed

Resolver bluto
    [jtreg] HOSTADDR=10.1.1.2
    [jtreg] + /usr/jdk/jdk1.6.0_25/bin/java -classpath 
/opt/src/River_Fixed_2nd_Try/peterConcurrentPolicy/qa/jtreg/JTwork/classes/net/jini/jeri/transport/multihomed

Resolver jiniautot.east.sun.com
    [jtreg] Exception in thread "main" java.net.UnknownHostException: 
jiniautot.east.sun.com
    [jtreg]     at java.net.Inet4AddressImpl.lookupAllHostAddr(Native 
Method)
    [jtreg]     at 
java.net.InetAddress$1.lookupAllHostAddr(InetAddress.java:850)
    [jtreg]     at 
java.net.InetAddress.getAddressFromNameService(InetAddress.java:1201)
    [jtreg]     at java.net.InetAddress.getAllByName0(InetAddress.java:1154)
    [jtreg]     at java.net.InetAddress.getAllByName(InetAddress.java:1084)
    [jtreg]     at java.net.InetAddress.getAllByName(InetAddress.java:1020)
    [jtreg]     at java.net.InetAddress.getByName(InetAddress.java:970)
    [jtreg]     at Resolver.main(Resolver.java:28)
    [jtreg]
    [jtreg] TEST RESULT: Failed. Execution failed: exit code 1
    [jtreg] --------------------------------------------------
    [jtreg] TEST: 
net/jini/loader/pref/PreferredClassProvider/registryRetainCodebase/RegistryRetainCodebase.java
    [jtreg] JDK under test: (/usr/jdk/jdk1.6.0_25)
    [jtreg] java version "1.6.0_25"
    [jtreg] Java(TM) SE Runtime Environment (build 1.6.0_25-b06)
    [jtreg] Java HotSpot(TM) Server VM (build 20.0-b11, mixed mode)
    [jtreg]
    [jtreg] ACTION: build -- Passed. All files up to date
    [jtreg] REASON: User specified action: run build 
RegistryRetainCodebase BasicRemote Client RegistryRetainCodebase_Stub
    [jtreg] TIME:   0.0020 seconds
    [jtreg] messages:
    [jtreg] command: build RegistryRetainCodebase BasicRemote Client 
RegistryRetainCodebase_Stub
    [jtreg] reason: User specified action: run build 
RegistryRetainCodebase BasicRemote Client RegistryRetainCodebase_Stub
    [jtreg] elapsed time (seconds): 0.0020
    [jtreg]
    [jtreg] ACTION: build -- Passed. All files up to date
    [jtreg] REASON: User specified action: run build TestLibrary 
TestParams JavaVM HTTPD TestFailedException
    [jtreg] TIME:   0.0030 seconds
    [jtreg] messages:
    [jtreg] command: build TestLibrary TestParams JavaVM HTTPD 
TestFailedException
    [jtreg] reason: User specified action: run build TestLibrary 
TestParams JavaVM HTTPD TestFailedException
    [jtreg] elapsed time (seconds): 0.0030
    [jtreg]
    [jtreg] ACTION: build -- Passed. All files up to date
    [jtreg] REASON: Named class compiled on demand
    [jtreg] TIME:   0.0010 seconds
    [jtreg] messages:
    [jtreg] command: build RegistryRetainCodebase
    [jtreg] reason: Named class compiled on demand
    [jtreg] elapsed time (seconds): 0.0010
    [jtreg]
    [jtreg] ACTION: main -- Failed. Execution failed: `main' threw 
exception: TestFailedException: TEST FAILED: client failed to call back 
in time
    [jtreg] REASON: User specified action: run main/othervm 
-Djava.rmi.server.logCalls=true -Djava.rmi.server.hostname=localhost 
RegistryRetainCodebase
    [jtreg] TIME:   81.057 seconds
    [jtreg] messages:
    [jtreg] command: main -Djava.rmi.server.logCalls=true 
-Djava.rmi.server.hostname=localhost RegistryRetainCodebase
    [jtreg] reason: User specified action: run main/othervm 
-Djava.rmi.server.logCalls=true -Djava.rmi.server.hostname=localhost 
RegistryRetainCodebase
    [jtreg] elapsed time (seconds): 81.057
    [jtreg] STDOUT:
    [jtreg] STDERR:
    [jtreg] HTTPD: using 
/opt/src/River_Fixed_2nd_Try/peterConcurrentPolicy/lib/tools.jar on port 
9867 serving 
/opt/src/River_Fixed_2nd_Try/peterConcurrentPolicy/qa/jtreg/net/jini/loader/pref/PreferredClassProvider/registryRetainCodebase
    [jtreg] 15/05/2012 7:54:38 PM com.sun.jini.tool.ClassServer run
    [jtreg] INFO: ClassServer started 
[[/opt/src/River_Fixed_2nd_Try/peterConcurrentPolicy/qa/jtreg/net/jini/loader/pref/PreferredClassProvider/registryRetainCodebase/],

port 9867]
    [jtreg] JAVAVM: command = 
/usr/jdk/instances/jdk1.6.0/jre/bin/java    
-Djava.util.logging.config.file=/opt/src/River_Fixed_2nd_Try/peterConcurrentPolicy/qa/jtreg/net/jini/loader/pref/PreferredClassProvider/registryRetainCodebase/../../logging.properties

-Djava.security.policy=./client.policy -Djava.rmi.server.logCalls=true 
-classpath 
/opt/src/River_Fixed_2nd_Try/peterConcurrentPolicy/qa/jtreg/net/jini/loader/pref/PreferredClassProvider/registryRetainCodebase/retain.jar

sun.rmi.registry.RegistryImpl 2006
    [jtreg]
    [jtreg] JavaVM: parsed command: 
[/usr/jdk/instances/jdk1.6.0/jre/bin/java, 
-Djava.util.logging.config.file=/opt/src/River_Fixed_2nd_Try/peterConcurrentPolicy/qa/jtreg/net/jini/loader/pref/PreferredClassProvider/registryRetainCodebase/../../logging.properties,

-Djava.security.policy=./client.policy, -Djava.rmi.server.logCalls=true, 
-classpath, 
/opt/src/River_Fixed_2nd_Try/peterConcurrentPolicy/qa/jtreg/net/jini/loader/pref/PreferredClassProvider/registryRetainCodebase/retain.jar,

sun.rmi.registry.RegistryImpl, 2006]
    [jtreg] JAVAVM: finished starting vm.
    [jtreg] registry: 15/05/2012 7:54:53 PM 
sun.rmi.server.UnicastServerRef logCall
    [jtreg] registry: FINER: RMI TCP Connection(1)-127.0.0.1: 
[127.0.0.1: sun.rmi.registry.RegistryImpl[0:0:0, 0]: void 
rebind(java.lang.String, java.rmi.Remote)]    [jtreg] registry: 
15/05/2012 7:54:53 PM sun.rmi.server.UnicastServerRef logCall
    [jtreg] registry: FINER: RMI TCP Connection(1)-127.0.0.1: 
[127.0.0.1: sun.rmi.registry.RegistryImpl[0:0:0, 0]: void 
rebind(java.lang.String, java.rmi.Remote)]    [jtreg] 15/05/2012 7:54:53 
PM sun.rmi.server.UnicastServerRef logCall
    [jtreg] FINER: RMI TCP Connection(1)-127.0.0.1: [127.0.0.1: 
sun.rmi.transport.DGCImpl[0:0:0, 2]: java.rmi.dgc.Lease 
dirty(java.rmi.server.ObjID[], long, java.rmi.dgc.Lease)]
    [jtreg] JAVAVM: command = /usr/jdk/instances/jdk1.6.0/jre/bin/java   
-Djava.rmi.server.logCalls=true 
-Djava.util.logging.config.file=/opt/src/River_Fixed_2nd_Try/peterConcurrentPolicy/qa/jtreg/net/jini/loader/pref/PreferredClassProvider/registryRetainCodebase/../../logging.properties

-Djava.class.path=/opt/src/River_Fixed_2nd_Try/peterConcurrentPolicy/qa/jtreg/net/jini/loader/pref/PreferredClassProvider/registryRetainCodebase/retain.jar:/opt/src/River_Fixed_2nd_Try/peterConcurrentPolicy/qa/jtreg/JTwork/classes/net/jini/loader/pref/PreferredClassProvider/registryRetainCodebase/

-Djava.security.policy=/opt/src/River_Fixed_2nd_Try/peterConcurrentPolicy/qa/jtreg/net/jini/loader/pref/PreferredClassProvider/registryRetainCodebase/client.policy

Client
    [jtreg]
    [jtreg] JavaVM: parsed command: 
[/usr/jdk/instances/jdk1.6.0/jre/bin/java, 
-Djava.rmi.server.logCalls=true, 
-Djava.util.logging.config.file=/opt/src/River_Fixed_2nd_Try/peterConcurrentPolicy/qa/jtreg/net/jini/loader/pref/PreferredClassProvider/registryRetainCodebase/../../logging.properties,

-Djava.class.path=/opt/src/River_Fixed_2nd_Try/peterConcurrentPolicy/qa/jtreg/net/jini/loader/pref/PreferredClassProvider/registryRetainCodebase/retain.jar:/opt/src/River_Fixed_2nd_Try/peterConcurrentPolicy/qa/jtreg/JTwork/classes/net/jini/loader/pref/PreferredClassProvider/registryRetainCodebase/,

-Djava.security.policy=/opt/src/River_Fixed_2nd_Try/peterConcurrentPolicy/qa/jtreg/net/jini/loader/pref/PreferredClassProvider/registryRetainCodebase/client.policy,

Client]
    [jtreg] JAVAVM: finished starting vm.
    [jtreg] registry: 15/05/2012 7:54:56 PM 
sun.rmi.server.UnicastServerRef logCall
    [jtreg] registry: FINER: RMI TCP Connection(2)-127.0.0.1: 
[127.0.0.1: sun.rmi.registry.RegistryImpl[0:0:0, 0]: java.rmi.Remote 
lookup(java.lang.String)]
    [jtreg] registry: 15/05/2012 7:54:56 PM 
sun.rmi.server.UnicastServerRef logCall
    [jtreg] registry: FINER: RMI TCP Connection(2)-127.0.0.1: 
[127.0.0.1: sun.rmi.registry.RegistryImpl[0:0:0, 0]: java.rmi.Remote 
lookup(java.lang.String)]
    [jtreg] client:
    [jtreg] client: RegistryRetainCodebase_Stub
    [jtreg] client: java.lang.RuntimeException: Preferred class loaded 
from a file: 
file:/opt/src/River_Fixed_2nd_Try/peterConcurrentPolicy/qa/jtreg/net/jini/loader/pref/PreferredClassProvider/registryRetainCodebase/retain.jar
    [jtreg] client:     at Client.main(Client.java:62)
    [jtreg] TEST FAILED: client failed to call back in time
    [jtreg] TestFailedException: TEST FAILED: client failed to call back 
in time
    [jtreg]     at TestLibrary.bomb(TestLibrary.java:92)
    [jtreg]     at TestLibrary.bomb(TestLibrary.java:95)
    [jtreg]     at 
RegistryRetainCodebase.main(RegistryRetainCodebase.java:182)
    [jtreg]     at sun.reflect.NativeMethodAccessorImpl.invoke0(Native 
Method)
    [jtreg]     at 
sun.reflect.NativeMethodAccessorImpl.invoke(NativeMethodAccessorImpl.java:39)
    [jtreg]     at 
sun.reflect.DelegatingMethodAccessorImpl.invoke(DelegatingMethodAccessorImpl.java:25)
    [jtreg]     at java.lang.reflect.Method.invoke(Method.java:597)
    [jtreg]     at 
com.sun.javatest.regtest.MainWrapper$MainThread.run(MainWrapper.java:94)
    [jtreg]     at java.lang.Thread.run(Thread.java:662)
    [jtreg]
    [jtreg] JavaTest Message: Test threw exception: TestFailedException: 
TEST FAILED: client failed to call back in time
    [jtreg] JavaTest Message: shutting down test
    [jtreg]
    [jtreg] STATUS:Failed.`main' threw exception: TestFailedException: 
TEST FAILED: client failed to call back in time
    [jtreg]
    [jtreg] TEST RESULT: Failed. Execution failed: `main' threw 
exception: TestFailedException: TEST FAILED: client failed to call back 
in time
    [jtreg] --------------------------------------------------
    [jtreg] Test results: passed: 132; failed: 6
    [jtreg] Report written to 
/opt/src/River_Fixed_2nd_Try/peterConcurrentPolicy/qa/jtreg/JTreport/html/report.html
    [jtreg] Results written to 
/opt/src/River_Fixed_2nd_Try/peterConcurrentPolicy/qa/jtreg/JTwork
    [jtreg] Error: Some tests failed or other problems occurred.
     [move] Moving 8 files to 
/opt/src/River_Fixed_2nd_Try/peterConcurrentPolicy/lib
     [move] Moving 1 file to 
/opt/src/River_Fixed_2nd_Try/peterConcurrentPolicy/lib-ext
   [delete] Deleting directory 
/opt/src/River_Fixed_2nd_Try/peterConcurrentPolicy/qa/jtreg/JTlib-tmp
   [delete] Deleting: 
/opt/src/River_Fixed_2nd_Try/peterConcurrentPolicy/qa/jtreg/test.props

BUILD FAILED
/opt/src/River_Fixed_2nd_Try/peterConcurrentPolicy/qa/build.xml:263: 
if=jtreg.fail

Total time: 29 minutes 57 seconds
bash-3.00$

Mime
View raw message