river-dev mailing list archives

Site index · List index
Message view « Date » · « Thread »
Top « Date » · « Thread »
From Peter Firmstone <j...@zeus.net.au>
Subject Merge dissapointing
Date Thu, 09 Feb 2012 23:09:55 GMT
Just finished a local merge of trunk and skunk/peterConcurrentPolicy,

A bit dissapointing, I've got errors and additional failures in Jtreg.

I noticed trunk has some failures also in Hudson, could this be due to 
compiler optimisations?  Eg, we just had the source and target changed 
to Java 6.

Peter.



    [jtreg] TEST RESULT: Failed. Execution failed: `main' threw 
exception: TestFailedException: TEST FAILED: client failed to call back 
in time
    [jtreg] --------------------------------------------------
    [jtreg] Test results: passed: 129; failed: 7; error: 2
    [jtreg] Report written to 
/opt/src/River_Fixed_2nd_Try/peterConcurrentPolicy/qa/jtreg/JTreport/html/report.html
    [jtreg] Results written to 
/opt/src/River_Fixed_2nd_Try/peterConcurrentPolicy/qa/jtreg/JTwork
    [jtreg] Error: Some tests failed or other problems occurred.
     [move] Moving 6 files to 
/opt/src/River_Fixed_2nd_Try/peterConcurrentPolicy/lib
     [move] Moving 1 file to 
/opt/src/River_Fixed_2nd_Try/peterConcurrentPolicy/lib-ext
   [delete] Deleting directory 
/opt/src/River_Fixed_2nd_Try/peterConcurrentPolicy/qa/jtreg/JTlib-tmp
   [delete] Deleting: 
/opt/src/River_Fixed_2nd_Try/peterConcurrentPolicy/qa/jtreg/test.props

BUILD FAILED
/opt/src/River_Fixed_2nd_Try/peterConcurrentPolicy/qa/build.xml:259: 
if=jtreg.fail

Total time: 75 minutes 15 seconds

Mime
View raw message