river-dev mailing list archives

Site index · List index
Message view « Date » · « Thread »
Top « Date » · « Thread »
From Peter Firmstone <j...@zeus.net.au>
Subject Re: Build failed in Jenkins: River-trunk-QA-bsd #6
Date Mon, 16 Jan 2012 12:19:04 GMT
Sim,

Could you try running skunk on FreeBSD? 

Cheers,

Peter.

Apache Jenkins Server wrote:
> See <https://builds.apache.org/job/River-trunk-QA-bsd/6/>
>
> ------------------------------------------
> [...truncated 15501 lines...]
>      [java] com/sun/jini/test/spec/javaspace/conformance/snapshot/SnapshotTransactionTakeIfExistsTest.td
>      [java] Test Passed: OK
>      [java] 
>      [java] -----------------------------------------
>      [java] com/sun/jini/test/spec/javaspace/conformance/snapshot/SnapshotTransactionTakeIfExistsWaitTest.td
>      [java] Test Passed: OK
>      [java] 
>      [java] -----------------------------------------
>      [java] com/sun/jini/test/spec/javaspace/conformance/snapshot/SnapshotTransactionTakeNO_WAITTest.td
>      [java] Test Passed: OK
>      [java] 
>      [java] -----------------------------------------
>      [java] com/sun/jini/test/spec/javaspace/conformance/snapshot/SnapshotTransactionTakeReadTest.td
>      [java] Test Passed: OK
>      [java] 
>      [java] -----------------------------------------
>      [java] com/sun/jini/test/spec/javaspace/conformance/snapshot/SnapshotTransactionTakeTest.td
>      [java] Test Passed: OK
>      [java] 
>      [java] -----------------------------------------
>      [java] com/sun/jini/test/spec/javaspace/conformance/snapshot/SnapshotTransactionTakeWaitTest.td
>      [java] Test Passed: OK
>      [java] 
>      [java] -----------------------------------------
>      [java] com/sun/jini/test/spec/javaspace/conformance/snapshot/SnapshotTransactionWriteLeaseANYTest.td
>      [java] Test Passed: OK
>      [java] 
>      [java] -----------------------------------------
>      [java] com/sun/jini/test/spec/javaspace/conformance/snapshot/SnapshotTransactionWriteLeaseFOREVERTest.td
>      [java] Test Passed: OK
>      [java] 
>      [java] -----------------------------------------
>      [java] com/sun/jini/test/spec/javaspace/conformance/snapshot/SnapshotTransactionWriteNegativeLeaseTest.td
>      [java] Test Passed: OK
>      [java] 
>      [java] -----------------------------------------
>      [java] com/sun/jini/test/spec/javaspace/conformance/snapshot/SnapshotTransactionWriteTakeIfExistsNotifyTest.td
>      [java] Test Passed: OK
>      [java] 
>      [java] -----------------------------------------
>      [java] com/sun/jini/test/spec/javaspace/conformance/snapshot/SnapshotTransactionWriteTakeIfExistsTest.td
>      [java] Test Passed: OK
>      [java] 
>      [java] -----------------------------------------
>      [java] com/sun/jini/test/spec/javaspace/conformance/snapshot/SnapshotTransactionWriteTakeNotifyTest.td
>      [java] Test Passed: OK
>      [java] 
>      [java] -----------------------------------------
>      [java] com/sun/jini/test/spec/javaspace/conformance/snapshot/SnapshotTransactionWriteTakeTest.td
>      [java] Test Passed: OK
>      [java] 
>      [java] -----------------------------------------
>      [java] com/sun/jini/test/spec/javaspace/conformance/snapshot/SnapshotTransactionWriteTest.td
>      [java] Test Passed: OK
>      [java] 
>      [java] -----------------------------------------
>      [java] com/sun/jini/test/spec/javaspace/conformance/snapshot/SnapshotWriteLeaseANYTest.td
>      [java] Test Passed: OK
>      [java] 
>      [java] -----------------------------------------
>      [java] com/sun/jini/test/spec/javaspace/conformance/snapshot/SnapshotWriteLeaseFOREVERTest.td
>      [java] Test Passed: OK
>      [java] 
>      [java] -----------------------------------------
>      [java] com/sun/jini/test/spec/javaspace/conformance/snapshot/SnapshotWriteNegativeLeaseTest.td
>      [java] Test Passed: OK
>      [java] 
>      [java] -----------------------------------------
>      [java] com/sun/jini/test/spec/javaspace/conformance/snapshot/SnapshotWriteTest.td
>      [java] Test Passed: OK
>      [java] 
>      [java] -----------------------------------------
>      [java] com/sun/jini/test/impl/mahalo/AdminIFShutdownTest.td
>      [java] Test Passed: OK
>      [java] 
>      [java] -----------------------------------------
>      [java] com/sun/jini/test/impl/mahalo/AdminIFTest.td
>      [java] Test Passed: OK
>      [java] 
>      [java] -----------------------------------------
>      [java] com/sun/jini/test/impl/mahalo/LeaseExpireCancelTest.td
>      [java] Test Passed: OK
>      [java] 
>      [java] -----------------------------------------
>      [java] com/sun/jini/test/impl/mahalo/LeaseExpireRenewTest.td
>      [java] Test Passed: OK
>      [java] 
>      [java] -----------------------------------------
>      [java] com/sun/jini/test/impl/mahalo/LeaseMapTest.td
>      [java] Test Passed: OK
>      [java] 
>      [java] -----------------------------------------
>      [java] com/sun/jini/test/impl/mahalo/LeaseTest.td
>      [java] Test Passed: OK
>      [java] 
>      [java] -----------------------------------------
>      [java] com/sun/jini/test/impl/mahalo/MahaloCreateShutdownTest.td
>      [java] Test Passed: OK
>      [java] 
>      [java] -----------------------------------------
>      [java] com/sun/jini/test/impl/mahalo/MahaloIFTest.td
>      [java] Test Passed: OK
>      [java] 
>      [java] -----------------------------------------
>      [java] com/sun/jini/test/impl/mahalo/MahaloImplReadyStateTest.td
>      [java] Test Skipped: verifiers are: com.sun.jini.test.impl.mercury.ActivatableMercuryVerifier
com.sun.jini.qa.harness.SkipConfigTestVerifier
>      [java] -----------------------------------------
>      [java] com/sun/jini/test/impl/mahalo/NestableServerTransactionCreatedToStringTest.td
>      [java] Test Passed: OK
>      [java] 
>      [java] -----------------------------------------
>      [java] com/sun/jini/test/impl/mahalo/NestableTransactionCreatedToStringTest.td
>      [java] Test Passed: OK
>      [java] 
>      [java] -----------------------------------------
>      [java] com/sun/jini/test/impl/mahalo/PrepareAndCommitExceptionTest.td
>      [java] Test Passed: OK
>      [java] 
>      [java] -----------------------------------------
>      [java] com/sun/jini/test/impl/mahalo/PrepareAndCommitExceptionTest2.td
>      [java] Test Passed: OK
>      [java] 
>      [java] -----------------------------------------
>      [java] com/sun/jini/test/impl/mahalo/PrepareAndCommitExceptionTest3.td
>      [java] Test Passed: OK
>      [java] 
>      [java] -----------------------------------------
>      [java] com/sun/jini/test/impl/mahalo/PrepareAndCommitExceptionTest4.td
>      [java] Test Passed: OK
>      [java] 
>      [java] -----------------------------------------
>      [java] com/sun/jini/test/impl/mahalo/PrepareAndCommitExceptionTest5.td
>      [java] Test Passed: OK
>      [java] 
>      [java] -----------------------------------------
>      [java] com/sun/jini/test/impl/mahalo/RandomStressTest.td
>      [java] Test Failed: Test Failed with an Unexpected Exception: java.lang.RuntimeException:
java.rmi.server.ExportException: listen failed; nested exception is: 
>      [java] 	java.net.UnknownHostException: access to resolve local host denied
>      [java] 
>      [java] -----------------------------------------
>      [java] com/sun/jini/test/impl/mahalo/ServerTransactionEqualityTest.td
>      [java] Test Passed: OK
>      [java] 
>      [java] -----------------------------------------
>      [java] com/sun/jini/test/impl/mahalo/ServerTransactionToStringTest.td
>      [java] Test Passed: OK
>      [java] 
>      [java] -----------------------------------------
>      [java] com/sun/jini/test/impl/mahalo/TransactionCreatedToStringTest.td
>      [java] Test Passed: OK
>      [java] 
>      [java] -----------------------------------------
>      [java] com/sun/jini/test/impl/mahalo/TransactionManagerCreatedToStringTest.td
>      [java] Test Passed: OK
>      [java] 
>      [java] -----------------------------------------
>      [java] com/sun/jini/test/impl/mahalo/TxnMgrImplNullActivationConfigEntries.td
>      [java] Test Skipped: verifiers are: com.sun.jini.test.impl.mahalo.ActivatableMahaloVerifier
>      [java] -----------------------------------------
>      [java] com/sun/jini/test/impl/mahalo/TxnMgrImplNullConfigEntries.td
>      [java] Test Passed: OK
>      [java] 
>      [java] -----------------------------------------
>      [java] com/sun/jini/test/impl/mahalo/TxnMgrImplNullRecoveredLocators.td
>      [java] Test Skipped: verifiers are: com.sun.jini.test.impl.mahalo.ActivatableMahaloVerifier
>      [java] -----------------------------------------
>      [java] com/sun/jini/test/impl/mahalo/TxnMgrProxyEqualityTest.td
>      [java] Test Passed: OK
>      [java] 
>      [java] -----------------------------------------
>      [java] com/sun/jini/test/spec/txnmanager/AsynchAbortOnCommitTest.td
>      [java] Test Passed: OK
>      [java] 
>      [java] -----------------------------------------
>      [java] com/sun/jini/test/spec/txnmanager/AsynchAbortOnPrepareTest.td
>      [java] Test Passed: OK
>      [java] 
>      [java] -----------------------------------------
>      [java] com/sun/jini/test/spec/txnmanager/CommitExpiredTest.td
>      [java] Test Passed: OK
>      [java] 
>      [java] -----------------------------------------
>      [java] com/sun/jini/test/spec/txnmanager/CommitTimeoutTest.td
>      [java] Test Passed: OK
>      [java] 
>      [java] -----------------------------------------
>      [java] com/sun/jini/test/spec/txnmanager/GetStateTest.td
>      [java] Test Passed: OK
>      [java] 
>      [java] -----------------------------------------
>      [java] com/sun/jini/test/spec/txnmanager/JoinIdempotentTest.td
>      [java] Test Passed: OK
>      [java] 
>      [java] -----------------------------------------
>      [java] com/sun/jini/test/spec/txnmanager/JoinWhileActiveTest.td
>      [java] Test Passed: OK
>      [java] 
>      [java] -----------------------------------------
>      [java] com/sun/jini/test/spec/txnmanager/ManyParticipantsTest.td
>      [java] Test Passed: OK
>      [java] 
>      [java] -----------------------------------------
>      [java] com/sun/jini/test/spec/txnmanager/PrepareTimeoutTest.td
>      [java] Test Passed: OK
>      [java] 
>      [java] -----------------------------------------
>      [java] com/sun/jini/test/spec/txnmanager/RollBackErrorTest.td
>      [java] Test Passed: OK
>      [java] 
>      [java] -----------------------------------------
>      [java] com/sun/jini/test/spec/txnmanager/RollForwardErrorTest.td
>      [java] Test Passed: OK
>      [java] 
>      [java] -----------------------------------------
>      [java] com/sun/jini/test/spec/txnmanager/TwoPhaseTest.td
>      [java] Test Passed: OK
>      [java] 
>      [java] -----------------------------------------
>      [java] 
>      [java] # of tests started   = 1412
>      [java] # of tests completed = 1412
>      [java] # of tests skipped   = 46
>      [java] # of tests passed    = 1335
>      [java] # of tests failed    = 77
>      [java] 
>      [java] -----------------------------------------
>      [java] 
>      [java]    Date finished:
>      [java]       Mon Jan 16 12:03:53 UTC 2012
>      [java]    Time elapsed:
>      [java]       87241 seconds
>      [java] 
>      [java] Java Result: 1
>
> collect-result:
>      [copy] Copying 1 file to /usr<https://builds.apache.org/job/River-trunk-QA-bsd/ws/trunk/qa/result>
>      [copy] Copying 1 file to /usr<https://builds.apache.org/job/River-trunk-QA-bsd/ws/trunk/qa/result>
>       [zip] Building zip: /usr<https://builds.apache.org/job/River-trunk-QA-bsd/ws/trunk/qa/result/qaresults-amd64-FreeBSD-1.6.0.zip>
>
> BUILD FAILED
> /usr<https://builds.apache.org/job/River-trunk-QA-bsd/ws/trunk/build.xml>:2179:
The following error occurred while executing this line:
> /usr<https://builds.apache.org/job/River-trunk-QA-bsd/ws/trunk/qa/build.xml>:378:
The following error occurred while executing this line:
> /usr<https://builds.apache.org/job/River-trunk-QA-bsd/ws/trunk/qa/build.xml>:352:
condition satisfied
>
> Total time: 1458 minutes 55 seconds
> Build step 'Invoke Ant' marked build as failure
> [locks-and-latches] Releasing all the locks
> [locks-and-latches] All the locks released
> Archiving artifacts
>
>
>   


Mime
View raw message